AnsweredAssumed Answered

ACC conformance test FAILED

Question asked by Per Ekelund on Aug 7, 2017
Latest reply on Aug 8, 2017 by Yuri Muhin

Trying to build my first image using Yocto. The compiler fails in the following step:

 

| checking whether your compiler passes the ACC conformance test... FAILED
| configure:
| configure: Your compiler failed the ACC conformance test - for details see
| configure: `config.log'. Please check that log file and consider sending
| configure: a patch or bug-report to <lzop-bugs@oberhumer.com>.
| configure: Thanks for your support.
| configure:
| configure: error: ACC conformance test failed. Stop.
| NOTE: The following config.log files may provide further information.
| WARNING: exit code 1 from a shell command.
| NOTE: /home/per/fsl-release-bsp/builds/tmp/work/x86_64-linux/lzop-native/1.03-r0/build/config.log
| ERROR: configure failed
| ERROR: Function failed: do_configure (log file is located at /home/per/fsl-release-bsp/builds/tmp/work/x86_64-linux/lzop-native/1.03-r0/temp/log.do_configure.25098)
ERROR: Task 402 (virtual:native:/home/per/fsl-release-bsp/sources/poky/meta/recipes-support/lzop/lzop_1.03.bb, do_configure) failed with exit code '1'

Can anyone offer a suggestion of how this may be solved?

 

Thanks

Outcomes