Building file: ../stacks/tcpip/lwip/src/netif/ppp/polarssl/md5.c
Building file: ../stacks/tcpip/lwip/src/netif/ppp/polarssl/des.c
Building file: ../stacks/tcpip/lwip/src/netif/ppp/ccp.c
Invoking: Standard S32DS C Compiler
arm-none-eabi-gcc "@stacks/tcpip/lwip/src/netif/ppp/polarssl/arc4.args" -MMD -MP -MF"stacks/tcpip/lwip/src/netif/ppp/polarssl/sha1.d" -MT"stacks/tcpip/lwip/src/netif/ppp/polarssl/sha1.o" -o "stacks/tcpip/lwip/src/netif/ppp/polarssl/sha1.o" "../stacks/tcpip/lwip/src/netif/ppp/polarssl/sha1.c"
Invoking: Standard S32DS C Compiler
arm-none-eabi-gcc "@stacks/tcpip/lwip/src/netif/ppp/polarssl/arc4.args" -MMD -MP -MF"stacks/tcpip/lwip/src/netif/ppp/polarssl/arc4.d" -MT"stacks/tcpip/lwip/src/netif/ppp/polarssl/arc4.o" -o "stacks/tcpip/lwip/src/netif/ppp/polarssl/arc4.o" "../stacks/tcpip/lwip/src/netif/ppp/polarssl/arc4.c"
Invoking: Standard S32DS C Compiler
arm-none-eabi-gcc "@stacks/tcpip/lwip/src/netif/ppp/polarssl/arc4.args" -MMD -MP -MF"stacks/tcpip/lwip/src/netif/ppp/polarssl/des.d" -MT"stacks/tcpip/lwip/src/netif/ppp/polarssl/des.o" -o "stacks/tcpip/lwip/src/netif/ppp/polarssl/des.o" "../stacks/tcpip/lwip/src/netif/ppp/polarssl/des.c"
Invoking: Standard S32DS C Compiler
Invoking: Standard S32DS C Compiler
arm-none-eabi-gcc "@stacks/tcpip/lwip/src/netif/ppp/polarssl/arc4.args" -MMD -MP -MF"stacks/tcpip/lwip/src/netif/ppp/polarssl/md5.d" -MT"stacks/tcpip/lwip/src/netif/ppp/polarssl/md5.o" -o "stacks/tcpip/lwip/src/netif/ppp/polarssl/md5.o" "../stacks/tcpip/lwip/src/netif/ppp/polarssl/md5.c"
arm-none-eabi-gcc "@stacks/tcpip/lwip/src/netif/ppp/polarssl/arc4.args" -MMD -MP -MF"stacks/tcpip/lwip/src/netif/ppp/polarssl/md4.d" -MT"stacks/tcpip/lwip/src/netif/ppp/polarssl/md4.o" -o "stacks/tcpip/lwip/src/netif/ppp/polarssl/md4.o" "../stacks/tcpip/lwip/src/netif/ppp/polarssl/md4.c"
In file included from D:/disrupt/PFE-demo/RTD_PFE_DEMO/source/lwip_s32g274a/stacks/tcpip/lwip/src/include/lwip/arch.h:48,
from D:/disrupt/PFE-demo/RTD_PFE_DEMO/source/lwip_s32g274a/stacks/tcpip/lwip/src/include/lwip/debug.h:40,
from D:/disrupt/PFE-demo/RTD_PFE_DEMO/source/lwip_s32g274a/stacks/tcpip/lwip/src/include/lwip/opt.h:52,
from D:/disrupt/PFE-demo/RTD_PFE_DEMO/source/lwip_s32g274a/stacks/tcpip/lwip/src/include/netif/ppp/ppp_opts.h:31,
from ../stacks/tcpip/lwip/src/netif/ppp/polarssl/arc4.c:41:
D:/disrupt/PFE-demo/RTD_PFE_DEMO/source/lwip_s32g274a/stacks/tcpip/code/ports/platform/generic/gcc/setting/arch/cc.h:37:10: fatal error: Devassert.h: No such file or directory
37 | #include "Devassert.h"
| ^~~~~~~~~~~~~
compilation terminated.
In file included from D:/disrupt/PFE-demo/RTD_PFE_DEMO/source/lwip_s32g274a/stacks/tcpip/lwip/src/include/lwip/arch.h:48,
Invoking: Standard S32DS C Compiler
from D:/disrupt/PFE-demo/RTD_PFE_DEMO/source/lwip_s32g274a/stacks/tcpip/lwip/src/include/lwip/debug.h:40,
Invoking: Standard S32DS C Compiler
arm-none-eabi-gcc "@stacks/tcpip/lwip/src/netif/ppp/auth.args" -MMD -MP -MF"stacks/tcpip/lwip/src/netif/ppp/auth.d" -MT"stacks/tcpip/lwip/src/netif/ppp/auth.o" -o "stacks/tcpip/lwip/src/netif/ppp/auth.o" "../stacks/tcpip/lwip/src/netif/ppp/auth.c"
from D:/disrupt/PFE-demo/RTD_PFE_DEMO/source/lwip_s32g274a/stacks/tcpip/lwip/src/include/lwip/opt.h:52,
Building file: ../stacks/tcpip/lwip/src/netif/ppp/chap-md5.c
from D:/disrupt/PFE-demo/RTD_PFE_DEMO/source/lwip_s32g274a/stacks/tcpip/lwip/src/include/netif/ppp/ppp_opts.h:31,
from ../stacks/tcpip/lwip/src/netif/ppp/polarssl/sha1.c:41:
D:/disrupt/PFE-demo/RTD_PFE_DEMO/source/lwip_s32g274a/stacks/tcpip/code/ports/platform/generic/gcc/setting/arch/cc.h:37:10: fatal error: Devassert.h: No such file or directory
arm-none-eabi-gcc "@stacks/tcpip/lwip/src/netif/ppp/auth.args" -MMD -MP -MF"stacks/tcpip/lwip/src/netif/ppp/ccp.d" -MT"stacks/tcpip/lwip/src/netif/ppp/ccp.o" -o "stacks/tcpip/lwip/src/netif/ppp/ccp.o" "../stacks/tcpip/lwip/src/netif/ppp/ccp.c"
37 | #include "Devassert.h"
| ^~~~~~~~~~~~~
compilation terminated.
make: *** [stacks/tcpip/lwip/src/netif/ppp/polarssl/subdir.mk:32: stacks/tcpip/lwip/src/netif/ppp/polarssl/arc4.o] Error 1
make: *** Waiting for unfinished jobs....
In file included from D:/disrupt/PFE-demo/RTD_PFE_DEMO/source/lwip_s32g274a/stacks/tcpip/lwip/src/include/lwip/arch.h:48,
from D:/disrupt/PFE-demo/RTD_PFE_DEMO/source/lwip_s32g274a/stacks/tcpip/lwip/src/include/lwip/debug.h:40,
from D:/disrupt/PFE-demo/RTD_PFE_DEMO/source/lwip_s32g274a/stacks/tcpip/lwip/src/include/lwip/opt.h:52,
from D:/disrupt/PFE-demo/RTD_PFE_DEMO/source/lwip_s32g274a/stacks/tcpip/lwip/src/include/netif/ppp/ppp_opts.h:31,
from ../stacks/tcpip/lwip/src/netif/ppp/polarssl/des.c:42:
D:/disrupt/PFE-demo/RTD_PFE_DEMO/source/lwip_s32g274a/stacks/tcpip/code/ports/platform/generic/gcc/setting/arch/cc.h:37:10: fatal error: Devassert.h: No such file or directory
37 | #include "Devassert.h"
| ^~~~~~~~~~~~~
In file included from D:/disrupt/PFE-demo/RTD_PFE_DEMO/source/lwip_s32g274a/stacks/tcpip/lwip/src/include/lwip/arch.h:48,
Invoking: Standard S32DS C Compiler
from D:/disrupt/PFE-demo/RTD_PFE_DEMO/source/lwip_s32g274a/stacks/tcpip/lwip/src/include/lwip/debug.h:40,
arm-none-eabi-gcc "@stacks/tcpip/lwip/src/netif/ppp/auth.args" -MMD -MP -MF"stacks/tcpip/lwip/src/netif/ppp/chap-md5.d" -MT"stacks/tcpip/lwip/src/netif/ppp/chap-md5.o" -o "stacks/tcpip/lwip/src/netif/ppp/chap-md5.o" "../stacks/tcpip/lwip/src/netif/ppp/chap-md5.c"
from D:/disrupt/PFE-demo/RTD_PFE_DEMO/source/lwip_s32g274a/stacks/tcpip/lwip/src/include/lwip/opt.h:52,
from D:/disrupt/PFE-demo/RTD_PFE_DEMO/source/lwip_s32g274a/stacks/tcpip/lwip/src/include/netif/ppp/ppp_opts.h:31,
from ../stacks/tcpip/lwip/src/netif/ppp/polarssl/md5.c:41:
D:/disrupt/PFE-demo/RTD_PFE_DEMO/source/lwip_s32g274a/stacks/tcpip/code/ports/platform/generic/gcc/setting/arch/cc.h:37:10: fatal error: Devassert.h: No such file or directory
37 | #include "Devassert.h"
| ^~~~~~~~~~~~~
compilation terminated.
make: *** [stacks/tcpip/lwip/src/netif/ppp/polarssl/subdir.mk:32: stacks/tcpip/lwip/src/netif/ppp/polarssl/sha1.o] Error 1
compilation terminated.
In file included from D:/disrupt/PFE-demo/RTD_PFE_DEMO/source/lwip_s32g274a/stacks/tcpip/lwip/src/include/lwip/arch.h:48,
from D:/disrupt/PFE-demo/RTD_PFE_DEMO/source/lwip_s32g274a/stacks/tcpip/lwip/src/include/lwip/debug.h:40,
from D:/disrupt/PFE-demo/RTD_PFE_DEMO/source/lwip_s32g274a/stacks/tcpip/lwip/src/include/lwip/opt.h:52,
from D:/disrupt/PFE-demo/RTD_PFE_DEMO/source/lwip_s32g274a/stacks/tcpip/lwip/src/include/netif/ppp/ppp_opts.h:31,
from ../stacks/tcpip/lwip/src/netif/ppp/polarssl/md4.c:42:
D:/disrupt/PFE-demo/RTD_PFE_DEMO/source/lwip_s32g274a/stacks/tcpip/code/ports/platform/generic/gcc/setting/arch/cc.h:37:10: fatal error: Devassert.h: No such file or directory
37 | #include "Devassert.h"
| ^~~~~~~~~~~~~
make: *** [stacks/tcpip/lwip/src/netif/ppp/polarssl/subdir.mk:32: stacks/tcpip/lwip/src/netif/ppp/polarssl/md5.o] Error 1
make: *** [stacks/tcpip/lwip/src/netif/ppp/polarssl/subdir.mk:32: stacks/tcpip/lwip/src/netif/ppp/polarssl/des.o] Error 1
compilation terminated.
make: *** [stacks/tcpip/lwip/src/netif/ppp/polarssl/subdir.mk:32: stacks/tcpip/lwip/src/netif/ppp/polarssl/md4.o] Error 1
In file included from D:/disrupt/PFE-demo/RTD_PFE_DEMO/source/lwip_s32g274a/stacks/tcpip/lwip/src/include/lwip/arch.h:48,
from D:/disrupt/PFE-demo/RTD_PFE_DEMO/source/lwip_s32g274a/stacks/tcpip/lwip/src/include/lwip/debug.h:40,
from D:/disrupt/PFE-demo/RTD_PFE_DEMO/source/lwip_s32g274a/stacks/tcpip/lwip/src/include/lwip/opt.h:52,
from D:/disrupt/PFE-demo/RTD_PFE_DEMO/source/lwip_s32g274a/stacks/tcpip/lwip/src/include/netif/ppp/ppp_opts.h:31,
from ../stacks/tcpip/lwip/src/netif/ppp/auth.c:71:
D:/disrupt/PFE-demo/RTD_PFE_DEMO/source/lwip_s32g274a/stacks/tcpip/code/ports/platform/generic/gcc/setting/arch/cc.h:37:10: fatal error: Devassert.h: No such file or directory
37 | #include "Devassert.h"
| ^~~~~~~~~~~~~
compilation terminated.
In file included from D:/disrupt/PFE-demo/RTD_PFE_DEMO/source/lwip_s32g274a/stacks/tcpip/lwip/src/include/lwip/arch.h:48,
from D:/disrupt/PFE-demo/RTD_PFE_DEMO/source/lwip_s32g274a/stacks/tcpip/lwip/src/include/lwip/debug.h:40,
from D:/disrupt/PFE-demo/RTD_PFE_DEMO/source/lwip_s32g274a/stacks/tcpip/lwip/src/include/lwip/opt.h:52,
from D:/disrupt/PFE-demo/RTD_PFE_DEMO/source/lwip_s32g274a/stacks/tcpip/lwip/src/include/netif/ppp/ppp_opts.h:31,
from ../stacks/tcpip/lwip/src/netif/ppp/ccp.c:31:
D:/disrupt/PFE-demo/RTD_PFE_DEMO/source/lwip_s32g274a/stacks/tcpip/code/ports/platform/generic/gcc/setting/arch/cc.h:37:10: fatal error: Devassert.h: No such file or directory
37 | #include "Devassert.h"
| ^~~~~~~~~~~~~
make: *** [stacks/tcpip/lwip/src/netif/ppp/subdir.mk:92: stacks/tcpip/lwip/src/netif/ppp/auth.o] Error 1
In file included from D:/disrupt/PFE-demo/RTD_PFE_DEMO/source/lwip_s32g274a/stacks/tcpip/lwip/src/include/lwip/arch.h:48,
from D:/disrupt/PFE-demo/RTD_PFE_DEMO/source/lwip_s32g274a/stacks/tcpip/lwip/src/include/lwip/debug.h:40,
from D:/disrupt/PFE-demo/RTD_PFE_DEMO/source/lwip_s32g274a/stacks/tcpip/lwip/src/include/lwip/opt.h:52,
from D:/disrupt/PFE-demo/RTD_PFE_DEMO/source/lwip_s32g274a/stacks/tcpip/lwip/src/include/netif/ppp/ppp_opts.h:31,
from ../stacks/tcpip/lwip/src/netif/ppp/chap-md5.c:31:
D:/disrupt/PFE-demo/RTD_PFE_DEMO/source/lwip_s32g274a/stacks/tcpip/code/ports/platform/generic/gcc/setting/arch/cc.h:37:10: fatal error: Devassert.h: No such file or directory
37 | #include "Devassert.h"
| ^~~~~~~~~~~~~
compilation terminated.
compilation terminated.
make: *** [stacks/tcpip/lwip/src/netif/ppp/subdir.mk:92: stacks/tcpip/lwip/src/netif/ppp/ccp.o] Error 1
make: *** [stacks/tcpip/lwip/src/netif/ppp/subdir.mk:92: stacks/tcpip/lwip/src/netif/ppp/chap-md5.o] Error 1
"make -j8 all" terminated with exit code 2. Build might be incomplete.
12:23:54 Build Failed. 17 errors, 0 warnings. (took 1s.417ms)