AnsweredAssumed Answered

errors in build example by MCUXpresso IDE

Question asked by SJ YIN on Aug 3, 2018
Latest reply on Aug 16, 2018 by LPCX presso support

 when in build the exampe the MCUXpresso IDE worse error ,butthe example is from the Official routine which i download from NXP

the errors are:

  描述 资源 路径 位置 类型
D:\KW41Z\MCUXpressoIDE_10.2.0_759\ide\msys\bin\make.exe: *** Couldn't reserve space for cygwin's heap, Win32 error 0 usbkw41z_kw41z_wireless_examples_hybrid_ble_thread_router_wireless_uart_freertos C/C++ Problem
first defined here semihost_hardfault.c /usbkw41z_kw41z_1wireless_examples_hybrid_ble_thread_router_wireless_uart_freertos_usbkw41z_kw41z_1/source 第 73 行 C/C++ Problem
make: *** [source/common/ble_conn_manager.o] Error 1 projectwireless_examples_hybrid_ble_thread_router_wireless_uart_freertos_projict C/C++ Problem
make: *** [source/common/gatt_db/gatt_database.o] Error 1 projectwireless_examples_hybrid_ble_thread_router_wireless_uart_freertos_projict C/C++ Problem
make: *** [usbkw41z_kw41z_1wireless_examples_hybrid_ble_thread_router_wireless_uart_freertos_usbkw41z_kw41z_1.axf] Error 1 usbkw41z_kw41z_1wireless_examples_hybrid_ble_thread_router_wireless_uart_freertos_usbkw41z_kw41z_1 C/C++ Problem
make: *** [utilities/fsl_debug_console.o] Error 1 projectwireless_examples_hybrid_ble_thread_router_wireless_uart_freertos_projict C/C++ Problem
make: *** Waiting for unfinished jobs.... projectwireless_examples_hybrid_ble_thread_router_wireless_uart_freertos_projict C/C++ Problem
multiple definition of `HardFault_Handler' debug_log.c /usbkw41z_kw41z_1wireless_examples_hybrid_ble_thread_router_wireless_uart_freertos_usbkw41z_kw41z_1/nwk_ip/base/utils 第 515 行 C/C++ Problem

Outcomes