AnsweredAssumed Answered

which library this functions __txn_getactive、__txn_regop_42_recover、__txn_stat_print_pp,etc belong to?

Question asked by shan feifei on Jul 30, 2015

When I built sdk of p4080pcie,I met a problem as followed:

| ./.libs/libdb-5.0.so: undefined reference to `__txn_getactive'

| ./.libs/libdb-5.0.so: undefined reference to `__txn_regop_42_recover'

| ./.libs/libdb-5.0.so: undefined reference to `__txn_stat_print_pp'

| ./.libs/libdb-5.0.so: undefined reference to `__txn_ckp_desc'

| ./.libs/libdb-5.0.so: undefined reference to `__txn_ckp_42_recover'

| ./.libs/libdb-5.0.so: undefined reference to `__txn_closeevent' 

etc

which library this functions __txn_getactive、__txn_regop_42_recover、__txn_stat_print_pp,etc belong to?

 

Error message is as follows:

freescale@freescale-sdk:~/P4080-PCIE-SDK-1.0-05-03-2012/QorIQ-DPAA-SDK-20110609-systembuilder$ bitbake devel-image

NOTE: Psyco JIT Compiler (http://psyco.sf.net) not available. Install it to increase performance.

NOTE: Handling BitBake files: \ (0394/0394) [100 %]

Parsing of 394 .bb files complete (388 cached, 6 parsed). 521 targets, 1 skipped, 0 masked, 0 errors.

NOTE: Resolving any missing task queue dependencies

NOTE: preferred version 2010.12 of u-boot not available (for item u-boot)

NOTE: Preparing runqueue

NOTE: Executing runqueue

NOTE: Running task 605 of 1738 (ID: 1526, /home/freescale/P4080-PCIE-SDK-1.0-05-03-2012/QorIQ-DPAA-SDK-20110609-systembuilder/oe-core/recipes/db/db_5.0.21.bb, do_compile)

NOTE: Running task 608 of 1738 (ID: 1487, /home/freescale/P4080-PCIE-SDK-1.0-05-03-2012/QorIQ-DPAA-SDK-20110609-systembuilder/sb-core/recipes/binutils/binutils-oprofile_2.20.1.bb, do_compile)

NOTE: package db-5.0.21-r1: task do_compile: Started

ERROR: TaskFailed event exception, aborting

ERROR: Build of /home/freescale/P4080-PCIE-SDK-1.0-05-03-2012/QorIQ-DPAA-SDK-20110609-systembuilder/oe-core/recipes/db/db_5.0.21.bb do_compile failed

ERROR: Task 1526 (/home/freescale/P4080-PCIE-SDK-1.0-05-03-2012/QorIQ-DPAA-SDK-20110609-systembuilder/oe-core/recipes/db/db_5.0.21.bb, do_compile) failed with 256

ERROR: Function do_compile failed

NOTE: Task failed: ('function do_compile failed', '/home/freescale/P4080-PCIE-SDK-1.0-05-03-2012/QorIQ-DPAA-SDK-20110609-systembuilder/build_p4080n710_release/work/ppce500mc-linux/db-5.0.21-r1/temp/log.do_compile.3433')

ERROR: Logfile of failure stored in: /home/freescale/P4080-PCIE-SDK-1.0-05-03-2012/QorIQ-DPAA-SDK-20110609-systembuilder/build_p4080n710_release/work/ppce500mc-linux/db-5.0.21-r1/temp/log.do_compile.3433

Log data follows:

| NOTE: make -j 4

| ./libtool --mode=link powerpc-linux-gnu-gcc -mcpu=e500mc -maix-struct-return --sysroot=/home/freescale/P4080-PCIE-SDK-1.0-05-03-2012/QorIQ-DPAA-SDK-20110609-systembuilder/build_p4080n710_release/sysroots/ppce500mc-linux -fexpensive-optimizations -frename-registers -fomit-frame-pointer -O2 -g0  -o db_archive -L/home/freescale/P4080-PCIE-SDK-1.0-05-03-2012/QorIQ-DPAA-SDK-20110609-systembuilder/build_p4080n710_release/sysroots/ppce500mc-linux/usr/lib -Wl,-rpath-link,/home/freescale/P4080-PCIE-SDK-1.0-05-03-2012/QorIQ-DPAA-SDK-20110609-systembuilder/build_p4080n710_release/sysroots/ppce500mc-linux/usr/lib -Wl,-O1 -Wl,--hash-style=gnu -B/home/freescale/P4080-PCIE-SDK-1.0-05-03-2012/QorIQ-DPAA-SDK-20110609-systembuilder/build_p4080n710_release/sysroots/ppce500mc-linux/usr/lib \

|    db_archive.lo util_sig.lo libdb-5.0.la -lpthread

| ./libtool --mode=link powerpc-linux-gnu-gcc -mcpu=e500mc -maix-struct-return --sysroot=/home/freescale/P4080-PCIE-SDK-1.0-05-03-2012/QorIQ-DPAA-SDK-20110609-systembuilder/build_p4080n710_release/sysroots/ppce500mc-linux -fexpensive-optimizations -frename-registers -fomit-frame-pointer -O2 -g0  -o db_checkpoint -L/home/freescale/P4080-PCIE-SDK-1.0-05-03-2012/QorIQ-DPAA-SDK-20110609-systembuilder/build_p4080n710_release/sysroots/ppce500mc-linux/usr/lib -Wl,-rpath-link,/home/freescale/P4080-PCIE-SDK-1.0-05-03-2012/QorIQ-DPAA-SDK-20110609-systembuilder/build_p4080n710_release/sysroots/ppce500mc-linux/usr/lib -Wl,-O1 -Wl,--hash-style=gnu -B/home/freescale/P4080-PCIE-SDK-1.0-05-03-2012/QorIQ-DPAA-SDK-20110609-systembuilder/build_p4080n710_release/sysroots/ppce500mc-linux/usr/lib \

|    db_checkpoint.lo util_log.lo util_sig.lo libdb-5.0.la -lpthread

| ./libtool --mode=link powerpc-linux-gnu-gcc -mcpu=e500mc -maix-struct-return --sysroot=/home/freescale/P4080-PCIE-SDK-1.0-05-03-2012/QorIQ-DPAA-SDK-20110609-systembuilder/build_p4080n710_release/sysroots/ppce500mc-linux -fexpensive-optimizations -frename-registers -fomit-frame-pointer -O2 -g0  -o db_deadlock -L/home/freescale/P4080-PCIE-SDK-1.0-05-03-2012/QorIQ-DPAA-SDK-20110609-systembuilder/build_p4080n710_release/sysroots/ppce500mc-linux/usr/lib -Wl,-rpath-link,/home/freescale/P4080-PCIE-SDK-1.0-05-03-2012/QorIQ-DPAA-SDK-20110609-systembuilder/build_p4080n710_release/sysroots/ppce500mc-linux/usr/lib -Wl,-O1 -Wl,--hash-style=gnu -B/home/freescale/P4080-PCIE-SDK-1.0-05-03-2012/QorIQ-DPAA-SDK-20110609-systembuilder/build_p4080n710_release/sysroots/ppce500mc-linux/usr/lib \

|    db_deadlock.lo util_log.lo util_sig.lo libdb-5.0.la -lpthread

| ./libtool --mode=link powerpc-linux-gnu-gcc -mcpu=e500mc -maix-struct-return --sysroot=/home/freescale/P4080-PCIE-SDK-1.0-05-03-2012/QorIQ-DPAA-SDK-20110609-systembuilder/build_p4080n710_release/sysroots/ppce500mc-linux -fexpensive-optimizations -frename-registers -fomit-frame-pointer -O2 -g0  -o db_dump -L/home/freescale/P4080-PCIE-SDK-1.0-05-03-2012/QorIQ-DPAA-SDK-20110609-systembuilder/build_p4080n710_release/sysroots/ppce500mc-linux/usr/lib -Wl,-rpath-link,/home/freescale/P4080-PCIE-SDK-1.0-05-03-2012/QorIQ-DPAA-SDK-20110609-systembuilder/build_p4080n710_release/sysroots/ppce500mc-linux/usr/lib -Wl,-O1 -Wl,--hash-style=gnu -B/home/freescale/P4080-PCIE-SDK-1.0-05-03-2012/QorIQ-DPAA-SDK-20110609-systembuilder/build_p4080n710_release/sysroots/ppce500mc-linux/usr/lib \

|    db_dump.lo util_cache.lo util_sig.lo libdb-5.0.la -lpthread

| libtool: link: powerpc-linux-gnu-gcc -mcpu=e500mc -maix-struct-return --sysroot=/home/freescale/P4080-PCIE-SDK-1.0-05-03-2012/QorIQ-DPAA-SDK-20110609-systembuilder/build_p4080n710_release/sysroots/ppce500mc-linux -fexpensive-optimizations -frename-registers -fomit-frame-pointer -O2 -g0 -o .libs/db_archive -Wl,-rpath-link -Wl,/home/freescale/P4080-PCIE-SDK-1.0-05-03-2012/QorIQ-DPAA-SDK-20110609-systembuilder/build_p4080n710_release/sysroots/ppce500mc-linux/usr/lib -Wl,-O1 -Wl,--hash-style=gnu -B/home/freescale/P4080-PCIE-SDK-1.0-05-03-2012/QorIQ-DPAA-SDK-20110609-systembuilder/build_p4080n710_release/sysroots/ppce500mc-linux/usr/lib .libs/db_archive.o .libs/util_sig.o  -L/home/freescale/P4080-PCIE-SDK-1.0-05-03-2012/QorIQ-DPAA-SDK-20110609-systembuilder/build_p4080n710_release/sysroots/ppce500mc-linux/usr/lib ./.libs/libdb-5.0.so -lpthread

| libtool: link: powerpc-linux-gnu-gcc -mcpu=e500mc -maix-struct-return --sysroot=/home/freescale/P4080-PCIE-SDK-1.0-05-03-2012/QorIQ-DPAA-SDK-20110609-systembuilder/build_p4080n710_release/sysroots/ppce500mc-linux -fexpensive-optimizations -frename-registers -fomit-frame-pointer -O2 -g0 -o .libs/db_checkpoint -Wl,-rpath-link -Wl,/home/freescale/P4080-PCIE-SDK-1.0-05-03-2012/QorIQ-DPAA-SDK-20110609-systembuilder/build_p4080n710_release/sysroots/ppce500mc-linux/usr/lib -Wl,-O1 -Wl,--hash-style=gnu -B/home/freescale/P4080-PCIE-SDK-1.0-05-03-2012/QorIQ-DPAA-SDK-20110609-systembuilder/build_p4080n710_release/sysroots/ppce500mc-linux/usr/lib .libs/db_checkpoint.o .libs/util_log.o .libs/util_sig.o  -L/home/freescale/P4080-PCIE-SDK-1.0-05-03-2012/QorIQ-DPAA-SDK-20110609-systembuilder/build_p4080n710_release/sysroots/ppce500mc-linux/usr/lib ./.libs/libdb-5.0.so -lpthread

| libtool: link: powerpc-linux-gnu-gcc -mcpu=e500mc -maix-struct-return --sysroot=/home/freescale/P4080-PCIE-SDK-1.0-05-03-2012/QorIQ-DPAA-SDK-20110609-systembuilder/build_p4080n710_release/sysroots/ppce500mc-linux -fexpensive-optimizations -frename-registers -fomit-frame-pointer -O2 -g0 -o .libs/db_dump -Wl,-rpath-link -Wl,/home/freescale/P4080-PCIE-SDK-1.0-05-03-2012/QorIQ-DPAA-SDK-20110609-systembuilder/build_p4080n710_release/sysroots/ppce500mc-linux/usr/lib -Wl,-O1 -Wl,--hash-style=gnu -B/home/freescale/P4080-PCIE-SDK-1.0-05-03-2012/QorIQ-DPAA-SDK-20110609-systembuilder/build_p4080n710_release/sysroots/ppce500mc-linux/usr/lib .libs/db_dump.o .libs/util_cache.o .libs/util_sig.o  -L/home/freescale/P4080-PCIE-SDK-1.0-05-03-2012/QorIQ-DPAA-SDK-20110609-systembuilder/build_p4080n710_release/sysroots/ppce500mc-linux/usr/lib ./.libs/libdb-5.0.so -lpthread

| libtool: link: powerpc-linux-gnu-gcc -mcpu=e500mc -maix-struct-return --sysroot=/home/freescale/P4080-PCIE-SDK-1.0-05-03-2012/QorIQ-DPAA-SDK-20110609-systembuilder/build_p4080n710_release/sysroots/ppce500mc-linux -fexpensive-optimizations -frename-registers -fomit-frame-pointer -O2 -g0 -o .libs/db_deadlock -Wl,-rpath-link -Wl,/home/freescale/P4080-PCIE-SDK-1.0-05-03-2012/QorIQ-DPAA-SDK-20110609-systembuilder/build_p4080n710_release/sysroots/ppce500mc-linux/usr/lib -Wl,-O1 -Wl,--hash-style=gnu -B/home/freescale/P4080-PCIE-SDK-1.0-05-03-2012/QorIQ-DPAA-SDK-20110609-systembuilder/build_p4080n710_release/sysroots/ppce500mc-linux/usr/lib .libs/db_deadlock.o .libs/util_log.o .libs/util_sig.o  -L/home/freescale/P4080-PCIE-SDK-1.0-05-03-2012/QorIQ-DPAA-SDK-20110609-systembuilder/build_p4080n710_release/sysroots/ppce500mc-linux/usr/lib ./.libs/libdb-5.0.so -lpthread

| ./.libs/libdb-5.0.so: undefined reference to `__txn_getactive'

| ./.libs/libdb-5.0.so: undefined reference to `__txn_regop_42_recover'

| ./.libs/libdb-5.0.so: undefined reference to `__txn_stat_print_pp'

| ./.libs/libdb-5.0.so: undefined reference to `__txn_ckp_desc'

| ./.libs/libdb-5.0.so: undefined reference to `__txn_ckp_42_recover'

| ./.libs/libdb-5.0.so: undefined reference to `__txn_closeevent'

| ./.libs/libdb-5.0.so: undefined reference to `__txn_set_tx_max'

| ./.libs/libdb-5.0.so: undefined reference to `__txn_region_mutex_count'

| ./.libs/libdb-5.0.so: undefined reference to `__txn_init_recover'

| ./.libs/libdb-5.0.so: undefined reference to `__txn_env_create'

| ./.libs/libdb-5.0.so: undefined reference to `__txn_env_refresh'

| ./.libs/libdb-5.0.so: undefined reference to `__txn_findlastckp'

| ./.libs/libdb-5.0.so: undefined reference to `__txn_reset'

| ./.libs/libdb-5.0.so: undefined reference to `__txn_remrem'

| ./.libs/libdb-5.0.so: undefined reference to `__txn_set_tx_timestamp'

| ./.libs/libdb-5.0.so: undefined reference to `__txn_lockevent'

| ./.libs/libdb-5.0.so: undefined reference to `__txn_begin'

| ./.libs/libdb-5.0.so: undefined reference to `__txn_get_tx_timestamp'

| ./.libs/libdb-5.0.so: undefined reference to `__txn_applied_pp'

| ./.libs/libdb-5.0.so: undefined reference to `__txn_failchk'

| ./.libs/libdb-5.0.so: undefined reference to `__txn_activekids'

| ./.libs/libdb-5.0.so: undefined reference to `__txn_open'

| ./.libs/libdb-5.0.so: undefined reference to `__txn_recycle_id'

| ./.libs/libdb-5.0.so: undefined reference to `__txn_record_fname'

| ./.libs/libdb-5.0.so: undefined reference to `__txn_begin_pp'

| ./.libs/libdb-5.0.so: undefined reference to `__txn_recover_pp'

| ./.libs/libdb-5.0.so: undefined reference to `__txn_force_abort'

| ./.libs/libdb-5.0.so: undefined reference to `__txn_getckp'

| ./.libs/libdb-5.0.so: undefined reference to `__txn_remlock'

| ./.libs/libdb-5.0.so: undefined reference to `__txn_commit'

| ./.libs/libdb-5.0.so: undefined reference to `__txn_remove_buffer'

| ./.libs/libdb-5.0.so: undefined reference to `__txn_abort'

| ./.libs/libdb-5.0.so: undefined reference to `__txn_get_tx_max'

| ./.libs/libdb-5.0.so: undefined reference to `__txn_env_destroy'

| ./.libs/libdb-5.0.so: undefined reference to `__txn_stat_pp'

| ./.libs/libdb-5.0.so: undefined reference to `__txn_remevent'

| ./.libs/libdb-5.0.so: undefined reference to `__txn_checkpoint'

| ./.libs/libdb-5.0.so: undefined reference to `__txn_oldest_reader'

| ./.libs/libdb-5.0.so: undefined reference to `__txn_checkpoint_pp'

| ./.libs/libdb-5.0.so: undefined reference to `__txn_preclose'

| ./.libs/libdb-5.0.so: undefined reference to `__txn_add_buffer'

| ./.libs/libdb-5.0.so: undefined reference to `__txn_get_name'

| ./.libs/libdb-5.0.so: undefined reference to `__txn_set_timeout'

| collect2: ld returned 1 exit status

| ./.libs/libdb-5.0.so: undefined reference to `__txn_getactive'

| ./.libs/libdb-5.0.so: undefined reference to `__txn_regop_42_recover'

| ./.libs/libdb-5.0.so: undefined reference to `__txn_stat_print_pp'

| ./.libs/libdb-5.0.so: undefined reference to `__txn_ckp_desc'

| ./.libs/libdb-5.0.so: undefined reference to `__txn_ckp_42_recover'

| ./.libs/libdb-5.0.so: undefined reference to `__txn_closeevent'

| ./.libs/libdb-5.0.so: undefined reference to `__txn_set_tx_max'

| ./.libs/libdb-5.0.so: undefined reference to `__txn_region_mutex_count'

| ./.libs/libdb-5.0.so: undefined reference to `__txn_init_recover'

| ./.libs/libdb-5.0.so: undefined reference to `__txn_env_create'

| ./.libs/libdb-5.0.so: undefined reference to `__txn_env_refresh'

| ./.libs/libdb-5.0.so: undefined reference to `__txn_findlastckp'

| ./.libs/libdb-5.0.so: undefined reference to `__txn_reset'

| ./.libs/libdb-5.0.so: undefined reference to `__txn_remrem'

| ./.libs/libdb-5.0.so: undefined reference to `__txn_set_tx_timestamp'

| ./.libs/libdb-5.0.so: undefined reference to `__txn_lockevent'

| ./.libs/libdb-5.0.so: undefined reference to `__txn_begin'

| ./.libs/libdb-5.0.so: undefined reference to `__txn_get_tx_timestamp'

| ./.libs/libdb-5.0.so: undefined reference to `__txn_applied_pp'

| ./.libs/libdb-5.0.so: undefined reference to `__txn_failchk'

| ./.libs/libdb-5.0.so: undefined reference to `__txn_activekids'

| ./.libs/libdb-5.0.so: undefined reference to `__txn_open'

| ./.libs/libdb-5.0.so: undefined reference to `__txn_recycle_id'

| ./.libs/libdb-5.0.so: undefined reference to `__txn_record_fname'

| ./.libs/libdb-5.0.so: undefined reference to `__txn_begin_pp'

| ./.libs/libdb-5.0.so: undefined reference to `__txn_recover_pp'

| ./.libs/libdb-5.0.so: undefined reference to `__txn_force_abort'

| ./.libs/libdb-5.0.so: undefined reference to `__txn_getckp'

| ./.libs/libdb-5.0.so: undefined reference to `__txn_remlock'

| ./.libs/libdb-5.0.so: undefined reference to `__txn_commit'

| ./.libs/libdb-5.0.so: undefined reference to `__txn_remove_buffer'

| ./.libs/libdb-5.0.so: undefined reference to `__txn_abort'

| ./.libs/libdb-5.0.so: undefined reference to `__txn_get_tx_max'

| ./.libs/libdb-5.0.so: undefined reference to `__txn_env_destroy'

| ./.libs/libdb-5.0.so: undefined reference to `__txn_stat_pp'

| ./.libs/libdb-5.0.so: undefined reference to `__txn_remevent'

| ./.libs/libdb-5.0.so: undefined reference to `__txn_checkpoint'

| ./.libs/libdb-5.0.so: undefined reference to `__txn_oldest_reader'

| ./.libs/libdb-5.0.so: undefined reference to `__txn_checkpoint_pp'

| ./.libs/libdb-5.0.so: undefined reference to `__txn_preclose'

| ./.libs/libdb-5.0.so: undefined reference to `__txn_add_buffer'

| ./.libs/libdb-5.0.so: undefined reference to `__txn_get_name'

| ./.libs/libdb-5.0.so: undefined reference to `__txn_set_timeout'

| collect2: ld returned 1 exit status

| make: *** [db_archive] Error 1

| make: *** Waiting for unfinished jobs....

| make: *** [db_checkpoint] Error 1

| ./.libs/libdb-5.0.so: undefined reference to `__txn_getactive'

| ./.libs/libdb-5.0.so: undefined reference to `__txn_regop_42_recover'

| ./.libs/libdb-5.0.so: undefined reference to `__txn_stat_print_pp'

| ./.libs/libdb-5.0.so: undefined reference to `__txn_ckp_desc'

| ./.libs/libdb-5.0.so: undefined reference to `__txn_ckp_42_recover'

| ./.libs/libdb-5.0.so: undefined reference to `__txn_closeevent'

| ./.libs/libdb-5.0.so: undefined reference to `__txn_set_tx_max'

| ./.libs/libdb-5.0.so: undefined reference to `__txn_region_mutex_count'

| ./.libs/libdb-5.0.so: undefined reference to `__txn_init_recover'

| ./.libs/libdb-5.0.so: undefined reference to `__txn_env_create'

| ./.libs/libdb-5.0.so: undefined reference to `__txn_env_refresh'

| ./.libs/libdb-5.0.so: undefined reference to `__txn_findlastckp'

| ./.libs/libdb-5.0.so: undefined reference to `__txn_reset'

| ./.libs/libdb-5.0.so: undefined reference to `__txn_remrem'

| ./.libs/libdb-5.0.so: undefined reference to `__txn_set_tx_timestamp'

| ./.libs/libdb-5.0.so: undefined reference to `__txn_lockevent'

| ./.libs/libdb-5.0.so: undefined reference to `__txn_begin'

| ./.libs/libdb-5.0.so: undefined reference to `__txn_get_tx_timestamp'

| ./.libs/libdb-5.0.so: undefined reference to `__txn_applied_pp'

| ./.libs/libdb-5.0.so: undefined reference to `__txn_failchk'

| ./.libs/libdb-5.0.so: undefined reference to `__txn_activekids'

| ./.libs/libdb-5.0.so: undefined reference to `__txn_open'

| ./.libs/libdb-5.0.so: undefined reference to `__txn_recycle_id'

| ./.libs/libdb-5.0.so: undefined reference to `__txn_record_fname'

| ./.libs/libdb-5.0.so: undefined reference to `__txn_begin_pp'

| ./.libs/libdb-5.0.so: undefined reference to `__txn_recover_pp'

| ./.libs/libdb-5.0.so: undefined reference to `__txn_force_abort'

| ./.libs/libdb-5.0.so: undefined reference to `__txn_getckp'

| ./.libs/libdb-5.0.so: undefined reference to `__txn_remlock'

| ./.libs/libdb-5.0.so: undefined reference to `__txn_commit'

| ./.libs/libdb-5.0.so: undefined reference to `__txn_remove_buffer'

| ./.libs/libdb-5.0.so: undefined reference to `__txn_abort'

| ./.libs/libdb-5.0.so: undefined reference to `__txn_get_tx_max'

| ./.libs/libdb-5.0.so: undefined reference to `__txn_env_destroy'

| ./.libs/libdb-5.0.so: undefined reference to `__txn_stat_pp'

| ./.libs/libdb-5.0.so: undefined reference to `__txn_remevent'

| ./.libs/libdb-5.0.so: undefined reference to `__txn_checkpoint'

| ./.libs/libdb-5.0.so: undefined reference to `__txn_oldest_reader'

| ./.libs/libdb-5.0.so: undefined reference to `__txn_checkpoint_pp'

| ./.libs/libdb-5.0.so: undefined reference to `__txn_preclose'

| ./.libs/libdb-5.0.so: undefined reference to `__txn_add_buffer'

| ./.libs/libdb-5.0.so: undefined reference to `__txn_get_name'

| ./.libs/libdb-5.0.so: undefined reference to `__txn_set_timeout'

| collect2: ld returned 1 exit status

| ./.libs/libdb-5.0.so: undefined reference to `__txn_getactive'

| ./.libs/libdb-5.0.so: undefined reference to `__txn_regop_42_recover'

| ./.libs/libdb-5.0.so: undefined reference to `__txn_stat_print_pp'

| ./.libs/libdb-5.0.so: undefined reference to `__txn_ckp_desc'

| ./.libs/libdb-5.0.so: undefined reference to `__txn_ckp_42_recover'

| ./.libs/libdb-5.0.so: undefined reference to `__txn_closeevent'

| ./.libs/libdb-5.0.so: undefined reference to `__txn_set_tx_max'

| ./.libs/libdb-5.0.so: undefined reference to `__txn_region_mutex_count'

| ./.libs/libdb-5.0.so: undefined reference to `__txn_init_recover'

| ./.libs/libdb-5.0.so: undefined reference to `__txn_env_create'

| ./.libs/libdb-5.0.so: undefined reference to `__txn_env_refresh'

| ./.libs/libdb-5.0.so: undefined reference to `__txn_findlastckp'

| ./.libs/libdb-5.0.so: undefined reference to `__txn_reset'

| ./.libs/libdb-5.0.so: undefined reference to `__txn_remrem'

| ./.libs/libdb-5.0.so: undefined reference to `__txn_set_tx_timestamp'

| ./.libs/libdb-5.0.so: undefined reference to `__txn_lockevent'

| ./.libs/libdb-5.0.so: undefined reference to `__txn_begin'

| ./.libs/libdb-5.0.so: undefined reference to `__txn_get_tx_timestamp'

| ./.libs/libdb-5.0.so: undefined reference to `__txn_applied_pp'

| ./.libs/libdb-5.0.so: undefined reference to `__txn_failchk'

| ./.libs/libdb-5.0.so: undefined reference to `__txn_activekids'

| ./.libs/libdb-5.0.so: undefined reference to `__txn_open'

| ./.libs/libdb-5.0.so: undefined reference to `__txn_recycle_id'

| ./.libs/libdb-5.0.so: undefined reference to `__txn_record_fname'

| ./.libs/libdb-5.0.so: undefined reference to `__txn_begin_pp'

| ./.libs/libdb-5.0.so: undefined reference to `__txn_recover_pp'

| ./.libs/libdb-5.0.so: undefined reference to `__txn_force_abort'

| ./.libs/libdb-5.0.so: undefined reference to `__txn_getckp'

| ./.libs/libdb-5.0.so: undefined reference to `__txn_remlock'

| ./.libs/libdb-5.0.so: undefined reference to `__txn_commit'

| ./.libs/libdb-5.0.so: undefined reference to `__txn_remove_buffer'

| ./.libs/libdb-5.0.so: undefined reference to `__txn_abort'

| ./.libs/libdb-5.0.so: undefined reference to `__txn_get_tx_max'

| ./.libs/libdb-5.0.so: undefined reference to `__txn_env_destroy'

| ./.libs/libdb-5.0.so: undefined reference to `__txn_stat_pp'

| ./.libs/libdb-5.0.so: undefined reference to `__txn_remevent'

| ./.libs/libdb-5.0.so: undefined reference to `__txn_checkpoint'

| ./.libs/libdb-5.0.so: undefined reference to `__txn_oldest_reader'

| ./.libs/libdb-5.0.so: undefined reference to `__txn_checkpoint_pp'

| ./.libs/libdb-5.0.so: undefined reference to `__txn_preclose'

| ./.libs/libdb-5.0.so: undefined reference to `__txn_add_buffer'

| ./.libs/libdb-5.0.so: undefined reference to `__txn_get_name'

| ./.libs/libdb-5.0.so: undefined reference to `__txn_set_timeout'

| collect2: ld returned 1 exit status

| make: *** [db_dump] Error 1

| make: *** [db_deadlock] Error 1

| FATAL: oe_runmake failed

| ERROR: Function do_compile failed

NOTE: package db-5.0.21-r1: task do_compile: Failed

ERROR: TaskFailed event exception, aborting

ERROR: Build of /home/freescale/P4080-PCIE-SDK-1.0-05-03-2012/QorIQ-DPAA-SDK-20110609-systembuilder/oe-core/recipes/db/db_5.0.21.bb do_compile failed

ERROR: Task 1526 (/home/freescale/P4080-PCIE-SDK-1.0-05-03-2012/QorIQ-DPAA-SDK-20110609-systembuilder/oe-core/recipes/db/db_5.0.21.bb, do_compile) failed with 256

Waiting for 1 active tasks to finish:

1: binutils-oprofile-2.20.1-r0.2 do_compile (pid 3434)

NOTE: package binutils-oprofile-2.20.1-r0.2: task do_compile: Started

ERROR: '/home/freescale/P4080-PCIE-SDK-1.0-05-03-2012/QorIQ-DPAA-SDK-20110609-systembuilder/oe-core/recipes/db/db_5.0.21.bb' failed

NOTE: package binutils-oprofile-2.20.1-r0.2: task do_compile: Succeeded

ERROR: '/home/freescale/P4080-PCIE-SDK-1.0-05-03-2012/QorIQ-DPAA-SDK-20110609-systembuilder/oe-core/recipes/db/db_5.0.21.bb' failed

ERROR: '/home/freescale/P4080-PCIE-SDK-1.0-05-03-2012/QorIQ-DPAA-SDK-20110609-systembuilder/oe-core/recipes/db/db_5.0.21.bb' failed

freescale@freescale-sdk:~/P4080-PCIE-SDK-1.0-05-03-2012/QorIQ-DPAA-SDK-20110609-systembuilder$

Outcomes