AnsweredAssumed Answered

Simulink build error with example code

Question asked by Andy Knitt on Nov 7, 2018
Latest reply on Jul 29, 2019 by Constantin Razvan Chivu

I am getting the following error when attempting to build:


arm-none-eabi-gcc: error: Documents\MATLAB\Add-Ons\Toolboxes\NXP_MBDToolbox_S32K1xx\code\tools\gcc-6.3-arm32-eabi/arm-none-eabi/newlib: No such file or directory arm-none-eabi-gcc: error: nosys.specs: No such file or directory gmake: *** [adc_software_trigger_s32k14x.elf] Error 1 ### Build procedure for model: 'adc_software_trigger_s32k14x' aborted due to an error. Error(s) encountered while building "adc_software_trigger_s32k14x"


A full log is attached.  This is  when trying to build the examples in the Model-Based Design Toolbox for S32K1xx Series Version 2018.R1


Any assistance would be appreciated.