AnsweredAssumed Answered

Regenerate MCAL for S32k14x with Arctic Studio

Question asked by SADAN DONMEZ on Sep 26, 2018

Hello,

 

I am trying to regenerate MCAL for S32k14x with Arctic Studio. "tresos_cmd.bat" file is used to regenerate but it generates errors about EB Tresos. I am asking to you because Arctic Studio support team directed me to EB. Then EB directed me to NXP again

 

I am using EB Tresos Studio 21.0.0, S32K14X_MCAL_4.2_RTM_P2_1.0.1, IAR Embedded_Workbench_8_0.

 

Here is the log file:

 

17:10:51 **** Build of configuration Default for project HelloWorld_S32K14X ****

make cleantresosgen generateMCAL

 

==========[ /C/devtools/HelloWorld_S32K14X/HelloWorld_S32K14X ]===========

SELECT_OPT=OPT_DEBUG file

from rules.mk, /C/devtools/HelloWorld_S32K14X/HelloWorld_S32K14X/obj_s32k144evb_0100

/Rte/Config   /C/devtools/HelloWorld_S32K14X/HelloWorld_S32K14X/config/stm32_stm3210c/Rte   /C/devtools/HelloWorld_S32K14X/HelloWorld_S32K14X/config/stm32_stm3210c/Rte/Contract   /C/devtools/HelloWorld_S32K14X/HelloWorld_S32K14X/config/stm32_stm3210c/Rte/Config   /C/devtools/HelloWorld_S32K14X/HelloWorld_S32K14X/config/stm32_stm3210c/Rte/MemMap   /C/devtools/HelloWorld_S32K14X/HelloWorld_S32K14X/obj_s32k144evb_0100/core/arch/arm/armv7_m/drivers_stm32/STM32_ETH_Driver   /C/devtools/HelloWorld_S32K14X/HelloWorld_S32K14X/obj_s32k144evb_0100/core/arch/arm/armv7_m/drivers_stm32/STM32F10x_StdPeriph_Driver   /c/devtools/ArcCore/core/system/Os/osal/tricore/aurix/TC39x_Source/IFX_base_famework/BaseFramework_TC39xA/0_Src/AppSw/Tricore/Cfg_Ssw   /c/devtools/ArcCore/core/system/Os/osal/tricore/aurix/TC39x_Source/IFX_base_famework/BaseFramework_TC39xA/0_Src/BaseSw/StartUp_39A/Tricore   /c/devtools/ArcCore/core/system/Os/osal/tricore/aurix/TC39x_Source/IFX_base_famework/BaseFramework_TC39xA/0_Src/BaseSw/Compilers/Tricore   /c/devtools/ArcCore/core/system/Os/osal/tricore/aurix/TC39x_Source/IFX_base_famework/BaseFramework_TC39xA/0_Src/BaseSw/iLLD_39A/Tricore/_Impl   /c/devtools/ArcCore/core/system/Os/osal/tricore/aurix/TC39x_Source/IFX_base_famework/BaseFramework_TC39xA/0_Src/BaseSw/iLLD_39A/Tricore/Scu/Std   /c/devtools/ArcCore/core/system/Os/osal/tricore/aurix/TC39x_Source/IFX_base_famework/BaseFramework_TC39xA/0_Src/BaseSw/iLLD_39A/Tricore/Pms/Std   /c/devtools/ArcCore/core/system/Os/osal/tricore/aurix/TC39x_Source/IFX_base_famework/BaseFramework_TC39xA/0_Src/BaseSw/iLLD_39A/Tricore/Cpu/Std

make[1]: Entering directory `/C/devtools/HelloWorld_S32K14X/HelloWorld_S32K14X/obj_s32k144evb_0100'

rm -f -r /C/devtools/HelloWorld_S32K14X/HelloWorld_S32K14X/../../MCAL_S32K14X/output/generated

cmd //c /c/devtools/EB/tresos/bin/tresos_cmd.bat -Dtarget=ARM -Dderivate=S32K14X -data /c/devtools/EB/tresos/workspace legacy generate -u /C/devtools/HelloWorld_S32K14X/HelloWorld_S32K14X/../../MCAL_S32K14X/exports/HelloWorld_MCAL.ARXML@asc:4.2.2 -o /C/devtools/HelloWorld_S32K14X/HelloWorld_S32K14X/../../MCAL_S32K14X/output/generated

EB tresos Studio 21.0.0 b160607-0933

Copyright 2003-2016 Elektrobit Automotive GmbH

INFO 18-09-25,17:12:12 (12145) Using a shortened feature name ("EB_TS_MOD_USDio_TS_T40D2M10I1R" instead of "EB_TS_MOD_USDio_TS_T40D2M10I1R0") for license check.

INFO 18-09-25,17:12:12 (12145) Using a shortened feature name ("EB_TS_MOD_USDio_TS_T40D2M10I1R" instead of "EB_TS_MOD_USDio_TS_T40D2M10I1R0") for license check.

INFO 18-09-25,17:12:12 (12145) Using a shortened feature name ("EB_TS_MOD_USDio_TS_T40D2M10I1R" instead of "EB_TS_MOD_USDio_TS_T40D2M10I1R0") for license check.

INFO 18-09-25,17:12:12 (12145) Using a shortened feature name ("EB_TS_MOD_USEcuM_TS_T40D2M10I1" instead of "EB_TS_MOD_USEcuM_TS_T40D2M10I1R0") for license check.

INFO 18-09-25,17:12:12 (12145) Using a shortened feature name ("EB_TS_MOD_USEcuM_TS_T40D2M10I1" instead of "EB_TS_MOD_USEcuM_TS_T40D2M10I1R0") for license check.

INFO 18-09-25,17:12:12 (12145) Using a shortened feature name ("EB_TS_MOD_USEcuM_TS_T40D2M10I1" instead of "EB_TS_MOD_USEcuM_TS_T40D2M10I1R0") for license check.

INFO 18-09-25,17:12:12 (12145) Using a shortened feature name ("EB_TS_MOD_USWdg_TS_T40D2M10I1R" instead of "EB_TS_MOD_USWdg_TS_T40D2M10I1R0") for license check.

INFO 18-09-25,17:12:12 (12145) Using a shortened feature name ("EB_TS_MOD_USWdg_TS_T40D2M10I1R" instead of "EB_TS_MOD_USWdg_TS_T40D2M10I1R0") for license check.

INFO 18-09-25,17:12:12 (12145) Using a shortened feature name ("EB_TS_MOD_USWdg_TS_T40D2M10I1R" instead of "EB_TS_MOD_USWdg_TS_T40D2M10I1R0") for license check.

INFO 18-09-25,17:12:13 (12145) Using a shortened feature name ("EB_TS_MOD_USSpi_TS_T40D2M10I1R" instead of "EB_TS_MOD_USSpi_TS_T40D2M10I1R0") for license check.

INFO 18-09-25,17:12:13 (12145) Using a shortened feature name ("EB_TS_MOD_USSpi_TS_T40D2M10I1R" instead of "EB_TS_MOD_USSpi_TS_T40D2M10I1R0") for license check.

INFO 18-09-25,17:12:13 (12145) Using a shortened feature name ("EB_TS_MOD_USSpi_TS_T40D2M10I1R" instead of "EB_TS_MOD_USSpi_TS_T40D2M10I1R0") for license check.

INFO 18-09-25,17:12:13 (12145) Using a shortened feature name ("EB_TS_MOD_USPwm_TS_T40D2M10I1R" instead of "EB_TS_MOD_USPwm_TS_T40D2M10I1R0") for license check.

INFO 18-09-25,17:12:13 (12145) Using a shortened feature name ("EB_TS_MOD_USPwm_TS_T40D2M10I1R" instead of "EB_TS_MOD_USPwm_TS_T40D2M10I1R0") for license check.

INFO 18-09-25,17:12:13 (12145) Using a shortened feature name ("EB_TS_MOD_USPwm_TS_T40D2M10I1R" instead of "EB_TS_MOD_USPwm_TS_T40D2M10I1R0") for license check.

INFO 18-09-25,17:12:14 (12145) Using a shortened feature name ("EB_TS_MOD_USMcl_TS_T40D2M10I1R" instead of "EB_TS_MOD_USMcl_TS_T40D2M10I1R0") for license check.

INFO 18-09-25,17:12:14 (12145) Using a shortened feature name ("EB_TS_MOD_USMcl_TS_T40D2M10I1R" instead of "EB_TS_MOD_USMcl_TS_T40D2M10I1R0") for license check.

INFO 18-09-25,17:12:14 (12145) Using a shortened feature name ("EB_TS_MOD_USMcl_TS_T40D2M10I1R" instead of "EB_TS_MOD_USMcl_TS_T40D2M10I1R0") for license check.

INFO 18-09-25,17:12:14 (12145) Using a shortened feature name ("EB_TS_MOD_USResource_TS_T40D2M" instead of "EB_TS_MOD_USResource_TS_T40D2M10I1R0") for license check.

INFO 18-09-25,17:12:14 (12145) Using a shortened feature name ("EB_TS_MOD_USResource_TS_T40D2M" instead of "EB_TS_MOD_USResource_TS_T40D2M10I1R0") for license check.

INFO 18-09-25,17:12:14 (12145) Using a shortened feature name ("EB_TS_MOD_USResource_TS_T40D2M" instead of "EB_TS_MOD_USResource_TS_T40D2M10I1R0") for license check.

INFO 18-09-25,17:12:14 (12145) Using a shortened feature name ("EB_TS_MOD_USBase_TS_T40D2M10I1" instead of "EB_TS_MOD_USBase_TS_T40D2M10I1R0") for license check.

INFO 18-09-25,17:12:14 (12145) Using a shortened feature name ("EB_TS_MOD_USBase_TS_T40D2M10I1" instead of "EB_TS_MOD_USBase_TS_T40D2M10I1R0") for license check.

INFO 18-09-25,17:12:14 (12145) Using a shortened feature name ("EB_TS_MOD_USBase_TS_T40D2M10I1" instead of "EB_TS_MOD_USBase_TS_T40D2M10I1R0") for license check.

INFO 18-09-25,17:12:14 (12145) Using a shortened feature name ("EB_TS_MOD_USGpt_TS_T40D2M10I1R" instead of "EB_TS_MOD_USGpt_TS_T40D2M10I1R0") for license check.

INFO 18-09-25,17:12:14 (12145) Using a shortened feature name ("EB_TS_MOD_USGpt_TS_T40D2M10I1R" instead of "EB_TS_MOD_USGpt_TS_T40D2M10I1R0") for license check.

INFO 18-09-25,17:12:14 (12145) Using a shortened feature name ("EB_TS_MOD_USGpt_TS_T40D2M10I1R" instead of "EB_TS_MOD_USGpt_TS_T40D2M10I1R0") for license check.

INFO 18-09-25,17:12:14 (12145) Using a shortened feature name ("EB_TS_MOD_USPort_TS_T40D2M10I1" instead of "EB_TS_MOD_USPort_TS_T40D2M10I1R0") for license check.

INFO 18-09-25,17:12:14 (12145) Using a shortened feature name ("EB_TS_MOD_USPort_TS_T40D2M10I1" instead of "EB_TS_MOD_USPort_TS_T40D2M10I1R0") for license check.

INFO 18-09-25,17:12:14 (12145) Using a shortened feature name ("EB_TS_MOD_USPort_TS_T40D2M10I1" instead of "EB_TS_MOD_USPort_TS_T40D2M10I1R0") for license check.

INFO 18-09-25,17:12:14 (12145) Using a shortened feature name ("EB_TS_MOD_USPort_TS_T40D2M10I1" instead of "EB_TS_MOD_USPort_TS_T40D2M10I1R0") for license check.

INFO 18-09-25,17:12:14 (12145) Using a shortened feature name ("EB_TS_MOD_USPort_TS_T40D2M10I1" instead of "EB_TS_MOD_USPort_TS_T40D2M10I1R0") for license check.

INFO 18-09-25,17:12:15 (12145) Using a shortened feature name ("EB_TS_MOD_USAdc_TS_T40D2M10I1R" instead of "EB_TS_MOD_USAdc_TS_T40D2M10I1R0") for license check.

INFO 18-09-25,17:12:15 (12145) Using a shortened feature name ("EB_TS_MOD_USAdc_TS_T40D2M10I1R" instead of "EB_TS_MOD_USAdc_TS_T40D2M10I1R0") for license check.

INFO 18-09-25,17:12:15 (12145) Using a shortened feature name ("EB_TS_MOD_USAdc_TS_T40D2M10I1R" instead of "EB_TS_MOD_USAdc_TS_T40D2M10I1R0") for license check.

INFO 18-09-25,17:12:16 (12145) Using a shortened feature name ("EB_TS_MOD_USCan_TS_T40D2M10I1R" instead of "EB_TS_MOD_USCan_TS_T40D2M10I1R0") for license check.

INFO 18-09-25,17:12:16 (12145) Using a shortened feature name ("EB_TS_MOD_USCan_TS_T40D2M10I1R" instead of "EB_TS_MOD_USCan_TS_T40D2M10I1R0") for license check.

INFO 18-09-25,17:12:16 (12145) Using a shortened feature name ("EB_TS_MOD_USCan_TS_T40D2M10I1R" instead of "EB_TS_MOD_USCan_TS_T40D2M10I1R0") for license check.

INFO 18-09-25,17:12:16 (12145) Using a shortened feature name ("EB_TS_MOD_USMcu_TS_T40D2M10I1R" instead of "EB_TS_MOD_USMcu_TS_T40D2M10I1R0") for license check.

INFO 18-09-25,17:12:16 (12145) Using a shortened feature name ("EB_TS_MOD_USMcu_TS_T40D2M10I1R" instead of "EB_TS_MOD_USMcu_TS_T40D2M10I1R0") for license check.

INFO 18-09-25,17:12:16 (12145) Using a shortened feature name ("EB_TS_MOD_USMcu_TS_T40D2M10I1R" instead of "EB_TS_MOD_USMcu_TS_T40D2M10I1R0") for license check.

INFO 18-09-25,17:12:16 (12145) Using a shortened feature name ("EB_TS_MOD_USMcu_TS_T40D2M10I1R" instead of "EB_TS_MOD_USMcu_TS_T40D2M10I1R0") for license check.

INFO 18-09-25,17:12:17 (12145) Using a shortened feature name ("EB_TS_MOD_USMcu_TS_T40D2M10I1R" instead of "EB_TS_MOD_USMcu_TS_T40D2M10I1R0") for license check.

INFO 18-09-25,17:12:17 (12145) Using a shortened feature name ("EB_TS_MOD_USDem_TS_T40D2M10I1R" instead of "EB_TS_MOD_USDem_TS_T40D2M10I1R0") for license check.

INFO 18-09-25,17:12:17 (12145) Using a shortened feature name ("EB_TS_MOD_USDem_TS_T40D2M10I1R" instead of "EB_TS_MOD_USDem_TS_T40D2M10I1R0") for license check.

INFO 18-09-25,17:12:17 (12145) Using a shortened feature name ("EB_TS_MOD_USDem_TS_T40D2M10I1R" instead of "EB_TS_MOD_USDem_TS_T40D2M10I1R0") for license check.

INFO 18-09-25,17:12:17 (12145) Using a shortened feature name ("EB_TS_MOD_USDem_TS_T40D2M10I1R" instead of "EB_TS_MOD_USDem_TS_T40D2M10I1R0") for license check.

INFO 18-09-25,17:12:17 (12145) Using a shortened feature name ("EB_TS_MOD_USDem_TS_T40D2M10I1R" instead of "EB_TS_MOD_USDem_TS_T40D2M10I1R0") for license check.

INFO 18-09-25,17:12:04 (2102) Reading file "c:\devtools\HelloWorld_S32K14X\HelloWorld_S32K14X\..\..\MCAL_S32K14X\exports\HelloWorld_MCAL.ARXML"

WARNING 18-09-25,17:12:06 (1134) Cannot set the value of the node /AUTOSAR/TOP-LEVEL-PACKAGES/Dio/ELEMENTS/Dio/CommonPublishedInformation/ArReleaseMinorVersion to 0 because it is readonly. Its DEFAULT is used instead.

WARNING 18-09-25,17:12:06 (1134) Cannot set the value of the node /AUTOSAR/TOP-LEVEL-PACKAGES/Dio/ELEMENTS/Dio/CommonPublishedInformation/ArReleaseRevisionVersion to 3 because it is readonly. Its DEFAULT is used instead.

WARNING 18-09-25,17:12:07 (1055) Removed node "EcuMEnableDefBehaviour": The schema does not define a parameter with name "EcuMEnableDefBehaviour" in container "ASPath:/TS_T40D2M10I1R0/EcuM/EcuMGeneral".

WARNING 18-09-25,17:12:07 (1055) Removed node "EcuMIncludeDem": The schema does not define a parameter with name "EcuMIncludeDem" in container "ASPath:/TS_T40D2M10I1R0/EcuM/EcuMGeneral".

WARNING 18-09-25,17:12:07 (1134) Cannot set the value of the node /AUTOSAR/TOP-LEVEL-PACKAGES/EcuM/ELEMENTS/EcuM/CommonPublishedInformation/ArReleaseMinorVersion to 0 because it is readonly. Its DEFAULT is used instead.

WARNING 18-09-25,17:12:07 (1134) Cannot set the value of the node /AUTOSAR/TOP-LEVEL-PACKAGES/EcuM/ELEMENTS/EcuM/CommonPublishedInformation/ArReleaseRevisionVersion to 3 because it is readonly. Its DEFAULT is used instead.

WARNING 18-09-25,17:12:07 (1134) Cannot set the value of the node /AUTOSAR/TOP-LEVEL-PACKAGES/Wdg/ELEMENTS/Wdg/CommonPublishedInformation/ArReleaseMinorVersion to 0 because it is readonly. Its DEFAULT is used instead.

WARNING 18-09-25,17:12:07 (1134) Cannot set the value of the node /AUTOSAR/TOP-LEVEL-PACKAGES/Wdg/ELEMENTS/Wdg/CommonPublishedInformation/ArReleaseRevisionVersion to 3 because it is readonly. Its DEFAULT is used instead.

WARNING 18-09-25,17:12:07 (1648) Created required node "/AUTOSAR/TOP-LEVEL-PACKAGES/Wdg/ELEMENTS/Wdg/WdgSettingsConfig/WdgSettingsConfig_0/WdgInterruptContentEnable" in container "/Wdg/Wdg/WdgSettingsConfig_0"

WARNING 18-09-25,17:12:07 (1055) Removed node "SpiForceDataType": The schema does not define a parameter with name "SpiForceDataType" in container "ASPath:/TS_T40D2M10I1R0/Spi/SpiNonAUTOSAR".

WARNING 18-09-25,17:12:07 (1134) Cannot set the value of the node /AUTOSAR/TOP-LEVEL-PACKAGES/Spi/ELEMENTS/Spi/CommonPublishedInformation/ArReleaseMinorVersion to 0 because it is readonly. Its DEFAULT is used instead.

WARNING 18-09-25,17:12:07 (1134) Cannot set the value of the node /AUTOSAR/TOP-LEVEL-PACKAGES/Spi/ELEMENTS/Spi/CommonPublishedInformation/ArReleaseRevisionVersion to 3 because it is readonly. Its DEFAULT is used instead.

WARNING 18-09-25,17:12:07 (1055) Removed node "PwmClockRef": The schema does not define a parameter with name "PwmClockRef" in container "ASPath:/TS_T40D2M10I1R0/Pwm/PwmChannelConfigSet/PwmFtmModule".

WARNING 18-09-25,17:12:07 (1055) Removed node "PwmDiableTrigger": The schema does not define a parameter with name "PwmDiableTrigger" in container "ASPath:/TS_T40D2M10I1R0/Pwm/PwmConfigurationOfOptApiServices".

WARNING 18-09-25,17:12:07 (1055) Removed node "PwmDevErorDetect": The schema does not define a parameter with name "PwmDevErorDetect" in container "ASPath:/TS_T40D2M10I1R0/Pwm/PwmGeneral".

WARNING 18-09-25,17:12:07 (1134) Cannot set the value of the node /AUTOSAR/TOP-LEVEL-PACKAGES/Pwm/ELEMENTS/Pwm/CommonPublishedInformation/ArReleaseMinorVersion to 0 because it is readonly. Its DEFAULT is used instead.

WARNING 18-09-25,17:12:07 (1134) Cannot set the value of the node /AUTOSAR/TOP-LEVEL-PACKAGES/Pwm/ELEMENTS/Pwm/CommonPublishedInformation/ArReleaseRevisionVersion to 3 because it is readonly. Its DEFAULT is used instead.

WARNING 18-09-25,17:12:07 (1648) Created required node "/AUTOSAR/TOP-LEVEL-PACKAGES/Pwm/ELEMENTS/Pwm/PwmChannelConfigSet/PwmChannel/PwmChannel_0/PwmMcuClockReferencePoint" in container "/Pwm/Pwm/PwmChannelConfigSet_0/PwmChannel_0"

WARNING 18-09-25,17:12:07 (1648) Created required node "/AUTOSAR/TOP-LEVEL-PACKAGES/Pwm/ELEMENTS/Pwm/PwmChannelConfigSet/PwmFtmModule/PwmFtmModule_0/PwmUpdatedEndPeriod" in container "/Pwm/Pwm/PwmChannelConfigSet_0/PwmFtmModule_0"

WARNING 18-09-25,17:12:07 (1648) Created required node "/AUTOSAR/TOP-LEVEL-PACKAGES/Pwm/ELEMENTS/Pwm/PwmChannelConfigSet/PwmFtmModule/PwmFtmModule_0/PwmUpdatedMiddlePeriod" in container "/Pwm/Pwm/PwmChannelConfigSet_0/PwmFtmModule_0"

WARNING 18-09-25,17:12:07 (1648) Created required node "/AUTOSAR/TOP-LEVEL-PACKAGES/Pwm/ELEMENTS/Pwm/PwmChannelConfigSet/PwmFtmModule/PwmFtmModule_0/PwmReloadFrequency" in container "/Pwm/Pwm/PwmChannelConfigSet_0/PwmFtmModule_0"

WARNING 18-09-25,17:12:07 (1648) Created required node "/AUTOSAR/TOP-LEVEL-PACKAGES/Pwm/ELEMENTS/Pwm/PwmConfigurationOfOptApiServices/PwmDisableTrigger" in container "/Pwm/Pwm/PwmConfigurationOfOptApiServices"

WARNING 18-09-25,17:12:07 (1648) Created required node "/AUTOSAR/TOP-LEVEL-PACKAGES/Pwm/ELEMENTS/Pwm/PwmGeneral/PwmDevErrorDetect" in container "/Pwm/Pwm/PwmGeneral"

WARNING 18-09-25,17:12:08 (1134) Cannot set the value of the node /AUTOSAR/TOP-LEVEL-PACKAGES/Mcl/ELEMENTS/Mcl/CommonPublishedInformation/ArReleaseMinorVersion to 0 because it is readonly. Its DEFAULT is used instead.

WARNING 18-09-25,17:12:08 (1134) Cannot set the value of the node /AUTOSAR/TOP-LEVEL-PACKAGES/Mcl/ELEMENTS/Mcl/CommonPublishedInformation/ArReleaseRevisionVersion to 3 because it is readonly. Its DEFAULT is used instead.

WARNING 18-09-25,17:12:08 (1134) Cannot set the value of the node /AUTOSAR/TOP-LEVEL-PACKAGES/Resource/ELEMENTS/Resource/CommonPublishedInformation/ArReleaseMinorVersion to 0 because it is readonly. Its DEFAULT is used instead.

WARNING 18-09-25,17:12:08 (1134) Cannot set the value of the node /AUTOSAR/TOP-LEVEL-PACKAGES/Resource/ELEMENTS/Resource/CommonPublishedInformation/ArReleaseRevisionVersion to 3 because it is readonly. Its DEFAULT is used instead.

WARNING 18-09-25,17:12:08 (1134) Cannot set the value of the node /AUTOSAR/TOP-LEVEL-PACKAGES/Base/ELEMENTS/Base/CommonPublishedInformation/ArReleaseMinorVersion to 0 because it is readonly. Its DEFAULT is used instead.

WARNING 18-09-25,17:12:08 (1134) Cannot set the value of the node /AUTOSAR/TOP-LEVEL-PACKAGES/Base/ELEMENTS/Base/CommonPublishedInformation/ArReleaseRevisionVersion to 3 because it is readonly. Its DEFAULT is used instead.

WARNING 18-09-25,17:12:08 (1134) Cannot set the value of the node /AUTOSAR/TOP-LEVEL-PACKAGES/Gpt/ELEMENTS/Gpt/CommonPublishedInformation/ArReleaseMinorVersion to 0 because it is readonly. Its DEFAULT is used instead.

WARNING 18-09-25,17:12:08 (1134) Cannot set the value of the node /AUTOSAR/TOP-LEVEL-PACKAGES/Gpt/ELEMENTS/Gpt/CommonPublishedInformation/ArReleaseRevisionVersion to 3 because it is readonly. Its DEFAULT is used instead.

WARNING 18-09-25,17:12:08 (1648) Created required node "/Gpt/Gpt/GptPredefTimerConfiguration" in container "/Gpt/Gpt"

WARNING 18-09-25,17:12:08 (1648) Created required node "/AUTOSAR/TOP-LEVEL-PACKAGES/Gpt/ELEMENTS/Gpt/GptConfigurationOfOptApiServices/GptPredefTimerFunctionalityApi" in container "/Gpt/Gpt/GptConfigurationOfOptApiServices"

WARNING 18-09-25,17:12:08 (1648) Created required node "/AUTOSAR/TOP-LEVEL-PACKAGES/Gpt/ELEMENTS/Gpt/GptDriverConfiguration/GptPredefTimer100us32bitEnable" in container "/Gpt/Gpt/GptDriverConfiguration"

WARNING 18-09-25,17:12:08 (1648) Created required node "/AUTOSAR/TOP-LEVEL-PACKAGES/Gpt/ELEMENTS/Gpt/GptDriverConfiguration/GptPredefTimer1usEnablingGrade" in container "/Gpt/Gpt/GptDriverConfiguration"

WARNING 18-09-25,17:12:08 (1134) Cannot set the value of the node /AUTOSAR/TOP-LEVEL-PACKAGES/Port/ELEMENTS/Port/CommonPublishedInformation/ArReleaseMinorVersion to 0 because it is readonly. Its DEFAULT is used instead.

WARNING 18-09-25,17:12:08 (1134) Cannot set the value of the node /AUTOSAR/TOP-LEVEL-PACKAGES/Port/ELEMENTS/Port/CommonPublishedInformation/ArReleaseRevisionVersion to 3 because it is readonly. Its DEFAULT is used instead.

WARNING 18-09-25,17:12:08 (1648) Created required node "/AUTOSAR/TOP-LEVEL-PACKAGES/Port/ELEMENTS/Port/PortGeneral/PortSet2PinsDirectionApi" in container "/Port/Port/PortGeneral"

WARNING 18-09-25,17:12:09 (1055) Removed node "AdcHwTrigSrc": The schema does not define a parameter with name "AdcHwTrigSrc" in container "ASPath:/TS_T40D2M10I1R0/Adc/AdcConfigSet/AdcHwUnit/AdcGroup".

WARNING 18-09-25,17:12:09 (1134) Cannot set the value of the node /AUTOSAR/TOP-LEVEL-PACKAGES/Adc/ELEMENTS/Adc/AdcPublishedInformation/AdcChannelValueSigned to 0 because it is readonly. Its DEFAULT is used instead.

WARNING 18-09-25,17:12:09 (1134) Cannot set the value of the node /AUTOSAR/TOP-LEVEL-PACKAGES/Adc/ELEMENTS/Adc/AdcPublishedInformation/AdcGroupFirstChannelFixed to 0 because it is readonly. Its DEFAULT is used instead.

WARNING 18-09-25,17:12:09 (1134) Cannot set the value of the node /AUTOSAR/TOP-LEVEL-PACKAGES/Adc/ELEMENTS/Adc/CommonPublishedInformation/ArReleaseMinorVersion to 0 because it is readonly. Its DEFAULT is used instead.

WARNING 18-09-25,17:12:09 (1134) Cannot set the value of the node /AUTOSAR/TOP-LEVEL-PACKAGES/Adc/ELEMENTS/Adc/CommonPublishedInformation/ArReleaseRevisionVersion to 3 because it is readonly. Its DEFAULT is used instead.

WARNING 18-09-25,17:12:09 (1648) Created required node "/AUTOSAR/TOP-LEVEL-PACKAGES/Adc/ELEMENTS/Adc/AdcConfigSet/AdcHwUnit/AdcHwUnit_0/AdcGroup/AdcGroup_0/AdcEnableHalfInterrupt" in container "/Adc/Adc/AdcConfigSet_0/AdcHwUnit_0/AdcGroup_0"

WARNING 18-09-25,17:12:09 (1648) Created required node "/AUTOSAR/TOP-LEVEL-PACKAGES/Adc/ELEMENTS/Adc/AdcConfigSet/AdcHwUnit/AdcHwUnit_0/AdcGroup/AdcGroup_0/AdcPdbPeriodContinuousMode" in container "/Adc/Adc/AdcConfigSet_0/AdcHwUnit_0/AdcGroup_0"

WARNING 18-09-25,17:12:09 (1648) Created required node "/AUTOSAR/TOP-LEVEL-PACKAGES/Adc/ELEMENTS/Adc/CommonPublishedInformation/VendorApiInfix" in container "/Adc/Adc/CommonPublishedInformation"

WARNING 18-09-25,17:12:09 (1648) Created required node "/AUTOSAR/TOP-LEVEL-PACKAGES/Adc/ELEMENTS/Adc/NonAutosar/DoubleBufferingMoreThanOneChannel" in container "/Adc/Adc/NonAutosar"

WARNING 18-09-25,17:12:09 (1648) Created required node "/AUTOSAR/TOP-LEVEL-PACKAGES/Adc/ELEMENTS/Adc/NonAutosar/AdcEnableDmaTrasferMode" in container "/Adc/Adc/NonAutosar"

WARNING 18-09-25,17:12:09 (1648) Created required node "/AUTOSAR/TOP-LEVEL-PACKAGES/Adc/ELEMENTS/Adc/NonAutosar/AdcUseHardwareNormalGroups" in container "/Adc/Adc/NonAutosar"

WARNING 18-09-25,17:12:09 (1648) Created required node "/AUTOSAR/TOP-LEVEL-PACKAGES/Adc/ELEMENTS/Adc/NonAutosar/AdcContinuousWithoutInterrupt" in container "/Adc/Adc/NonAutosar"

WARNING 18-09-25,17:12:09 (1055) Removed node "CanFilterMask_0": The schema does not define a parameter with name "CanFilterMask" in container "ASPath:/TS_T40D2M10I1R0/Can/CanConfigSet/CanController".

WARNING 18-09-25,17:12:09 (1055) Removed node "CanIdValue": The schema does not define a parameter with name "CanIdValue" in container "ASPath:/TS_T40D2M10I1R0/Can/CanConfigSet/CanHardwareObject".

WARNING 18-09-25,17:12:09 (1055) Removed node "CanFilterMaskRef": The schema does not define a parameter with name "CanFilterMaskRef" in container "ASPath:/TS_T40D2M10I1R0/Can/CanConfigSet/CanHardwareObject".

WARNING 18-09-25,17:12:09 (1055) Removed node "CanIdValue": The schema does not define a parameter with name "CanIdValue" in container "ASPath:/TS_T40D2M10I1R0/Can/CanConfigSet/CanHardwareObject".

WARNING 18-09-25,17:12:09 (1055) Removed node "CanFilterMaskRef": The schema does not define a parameter with name "CanFilterMaskRef" in container "ASPath:/TS_T40D2M10I1R0/Can/CanConfigSet/CanHardwareObject".

WARNING 18-09-25,17:12:09 (1055) Removed node "CanHardwareCancellation": The schema does not define a parameter with name "CanHardwareCancellation" in container "ASPath:/TS_T40D2M10I1R0/Can/CanGeneral".

WARNING 18-09-25,17:12:09 (1055) Removed node "CanIdenticalIdCancellation": The schema does not define a parameter with name "CanIdenticalIdCancellation" in container "ASPath:/TS_T40D2M10I1R0/Can/CanGeneral".

WARNING 18-09-25,17:12:09 (1055) Removed node "CanCounterRef": The schema does not define a parameter with name "CanCounterRef" in container "ASPath:/TS_T40D2M10I1R0/Can/CanGeneral".

WARNING 18-09-25,17:12:09 (1134) Cannot set the value of the node /AUTOSAR/TOP-LEVEL-PACKAGES/Can/ELEMENTS/Can/CommonPublishedInformation/ArReleaseMinorVersion to 0 because it is readonly. Its DEFAULT is used instead.

WARNING 18-09-25,17:12:09 (1134) Cannot set the value of the node /AUTOSAR/TOP-LEVEL-PACKAGES/Can/ELEMENTS/Can/CommonPublishedInformation/ArReleaseRevisionVersion to 3 because it is readonly. Its DEFAULT is used instead.

WARNING 18-09-25,17:12:09 (1648) Created required node "/AUTOSAR/TOP-LEVEL-PACKAGES/Can/ELEMENTS/Can/CanConfigSet/CanController/CanController_0/CanControllerIcomSupported" in container "/Can/Can/CanConfigSet_0/CanController_0"

WARNING 18-09-25,17:12:09 (1648) Created required node "/AUTOSAR/TOP-LEVEL-PACKAGES/Can/ELEMENTS/Can/CanConfigSet/CanController/CanController_0/CanWakeupFunctionalityAPI" in container "/Can/Can/CanConfigSet_0/CanController_0"

WARNING 18-09-25,17:12:09 (1648) Created required node "/AUTOSAR/TOP-LEVEL-PACKAGES/Can/ELEMENTS/Can/CanConfigSet/CanController/CanController_0/CanWakeUpSourceFilter" in container "/Can/Can/CanConfigSet_0/CanController_0"

WARNING 18-09-25,17:12:09 (1648) Created required node "/AUTOSAR/TOP-LEVEL-PACKAGES/Can/ELEMENTS/Can/CanConfigSet/CanHardwareObject/CanHardwareObject_0/CanHwObjectCount" in container "/Can/Can/CanConfigSet_0/CanHardwareObject_0"

WARNING 18-09-25,17:12:09 (1648) Created required node "/AUTOSAR/TOP-LEVEL-PACKAGES/Can/ELEMENTS/Can/CanConfigSet/CanHardwareObject/CanHardwareObject_1/CanHwObjectCount" in container "/Can/Can/CanConfigSet_0/CanHardwareObject_1"

WARNING 18-09-25,17:12:09 (1648) Created required node "/AUTOSAR/TOP-LEVEL-PACKAGES/Can/ELEMENTS/Can/CanGeneral/CanMaxMessageBuffers" in container "/Can/Can/CanGeneral"

WARNING 18-09-25,17:12:09 (1648) Created required node "/AUTOSAR/TOP-LEVEL-PACKAGES/Can/ELEMENTS/Can/CanGeneral/CanPublicIcomSupport" in container "/Can/Can/CanGeneral"

WARNING 18-09-25,17:12:09 (1648) Created required node "/AUTOSAR/TOP-LEVEL-PACKAGES/Can/ELEMENTS/Can/CanGeneral/CanMainFunctionRWPeriods/CanMainFunctionRWPeriods_0/CanMainFunctionPeriod" in container "/Can/Can/CanGeneral/CanMainFunctionRWPeriods_0"

WARNING 18-09-25,17:12:09 (1072) Removed "VariableDataNode(NAME=McuRMII_ClkSelect, TYPE=ENUMERATION, VALUE=FIRCDIV1_CLK, XPath=/__internalSubstituteRoot__/AUTOSAR/TOP-LEVEL-PACKAGES/Mcu/ELEMENTS/Mcu/McuModuleConfiguration/McuSIMConfig/McuFlexTimerConfiguration/McuRMII_ClkSelect)" from "/TS_T40D2M10I1R0/Mcu/McuModuleConfiguration/McuSIMConfig/McuFlexTimerConfiguration/McuRMII_ClkSelect": Expected a node of type VariableDataNode(BOOLEAN)

WARNING 18-09-25,17:12:09 (1134) Cannot set the value of the node /AUTOSAR/TOP-LEVEL-PACKAGES/Mcu/ELEMENTS/Mcu/CommonPublishedInformation/ArReleaseMinorVersion to 0 because it is readonly. Its DEFAULT is used instead.

WARNING 18-09-25,17:12:09 (1134) Cannot set the value of the node /AUTOSAR/TOP-LEVEL-PACKAGES/Mcu/ELEMENTS/Mcu/CommonPublishedInformation/ArReleaseRevisionVersion to 3 because it is readonly. Its DEFAULT is used instead.

WARNING 18-09-25,17:12:09 (1134) Cannot set the value of the node /AUTOSAR/TOP-LEVEL-PACKAGES/Mcu/ELEMENTS/Mcu/McuPublishedInformation/McuResetReasonConf/MCU_SOFTWARE_RESET/McuResetReason to 2 because it is readonly. Its DEFAULT is used instead.

WARNING 18-09-25,17:12:09 (1648) Created required node "/AUTOSAR/TOP-LEVEL-PACKAGES/Mcu/ELEMENTS/Mcu/McuDebugConfiguration/McuDisableCmuApi" in container "/Mcu/Mcu/McuDebugConfiguration"

WARNING 18-09-25,17:12:09 (1648) Created required node "/AUTOSAR/TOP-LEVEL-PACKAGES/Mcu/ELEMENTS/Mcu/McuDebugConfiguration/McuEnablePeripheralCMU" in container "/Mcu/Mcu/McuDebugConfiguration"

WARNING 18-09-25,17:12:09 (1648) Created required node "/Mcu/Mcu/McuModuleConfiguration_0/McuClockSettingConfig_0/McuClkMonitor_0" in container "/Mcu/Mcu/McuModuleConfiguration_0/McuClockSettingConfig_0"

WARNING 18-09-25,17:12:09 (1648) Created required node "/Mcu/Mcu/McuModuleConfiguration_0/McuClockSettingConfig_0/McuClkMonitor_1" in container "/Mcu/Mcu/McuModuleConfiguration_0/McuClockSettingConfig_0"

WARNING 18-09-25,17:12:09 (1648) Created required node "/AUTOSAR/TOP-LEVEL-PACKAGES/Mcu/ELEMENTS/Mcu/McuModuleConfiguration/McuClockSettingConfig/McuClockSettingConfig_0/McuSIMClockConfig/McuGPIOClockGatingEnable" in container "/Mcu/Mcu/McuModuleConfiguration_0/McuClockSettingConfig_0/McuSIMClockConfig"

WARNING 18-09-25,17:12:09 (1648) Created required node "/AUTOSAR/TOP-LEVEL-PACKAGES/Mcu/ELEMENTS/Mcu/McuModuleConfiguration/McuResetConfig/McuSystemInterruptEnable/McuCMULossOfClockResetInterrupt" in container "/Mcu/Mcu/McuModuleConfiguration_0/McuResetConfig/McuSystemInterruptEnable"

WARNING 18-09-25,17:12:09 (1648) Created required node "/AUTOSAR/TOP-LEVEL-PACKAGES/Mcu/ELEMENTS/Mcu/McuModuleConfiguration/McuSIMConfig/McuFlexTimerConfiguration/McuRMII_ClkSelect" in container "/Mcu/Mcu/McuModuleConfiguration_0/McuSIMConfig/McuFlexTimerConfiguration"

WARNING 18-09-25,17:12:09 (1055) Removed node "DemDTCClass_0": The schema does not define a parameter with name "DemDTCClass" in container "ASPath:/TS_T40D2M10I1R0/Dem/DemConfigSet".

WARNING 18-09-25,17:12:09 (1055) Removed node "DemMaxNumberFreezeFrameRecords": The schema does not define a parameter with name "DemMaxNumberFreezeFrameRecords" in container "ASPath:/TS_T40D2M10I1R0/Dem/DemConfigSet/DemEventParameter".

WARNING 18-09-25,17:12:09 (1055) Removed node "DemFreezeFrameRecNumClassRef": The schema does not define a parameter with name "DemFreezeFrameRecNumClassRef" in container "ASPath:/TS_T40D2M10I1R0/Dem/DemConfigSet/DemEventParameter".

WARNING 18-09-25,17:12:09 (1055) Removed node "DemEventClass": The schema does not define a parameter with name "DemEventClass" in container "ASPath:/TS_T40D2M10I1R0/Dem/DemConfigSet/DemEventParameter".

WARNING 18-09-25,17:12:09 (1055) Removed node "DemDTCSuppressionSupport": The schema does not define a parameter with name "DemDTCSuppressionSupport" in container "ASPath:/TS_T40D2M10I1R0/Dem/DemGeneral".

WARNING 18-09-25,17:12:09 (1055) Removed node "DemEnableConditionSupport": The schema does not define a parameter with name "DemEnableConditionSupport" in container "ASPath:/TS_T40D2M10I1R0/Dem/DemGeneral".

WARNING 18-09-25,17:12:09 (1055) Removed node "DemEventDisplacementSupport": The schema does not define a parameter with name "DemEventDisplacementSupport" in container "ASPath:/TS_T40D2M10I1R0/Dem/DemGeneral".

WARNING 18-09-25,17:12:09 (1055) Removed node "DemMaxNumberEventEntryMirror": The schema does not define a parameter with name "DemMaxNumberEventEntryMirror" in container "ASPath:/TS_T40D2M10I1R0/Dem/DemGeneral".

WARNING 18-09-25,17:12:09 (1055) Removed node "DemMaxNumberEventEntryPrimary": The schema does not define a parameter with name "DemMaxNumberEventEntryPrimary" in container "ASPath:/TS_T40D2M10I1R0/Dem/DemGeneral".

WARNING 18-09-25,17:12:09 (1055) Removed node "DemMaxNumberEventEntrySecondary": The schema does not define a parameter with name "DemMaxNumberEventEntrySecondary" in container "ASPath:/TS_T40D2M10I1R0/Dem/DemGeneral".

WARNING 18-09-25,17:12:09 (1072) Removed "VariableDataNode(NAME=DemOBDSupport, TYPE=BOOLEAN, VALUE=0, XPath=/__internalSubstituteRoot__/AUTOSAR/TOP-LEVEL-PACKAGES/Dem/ELEMENTS/Dem/DemGeneral/DemOBDSupport)" from "/TS_T40D2M10I1R0/Dem/DemGeneral/DemOBDSupport": Expected a node of type VariableDataNode(ENUMERATION)

WARNING 18-09-25,17:12:09 (1055) Removed node "DemOperationCycleProcessing": The schema does not define a parameter with name "DemOperationCycleProcessing" in container "ASPath:/TS_T40D2M10I1R0/Dem/DemGeneral".

WARNING 18-09-25,17:12:09 (1055) Removed node "DemStorageConditionSupport": The schema does not define a parameter with name "DemStorageConditionSupport" in container "ASPath:/TS_T40D2M10I1R0/Dem/DemGeneral".

WARNING 18-09-25,17:12:09 (1055) Removed node "DemFreezeFrameRecordNumber": The schema does not define a parameter with name "DemFreezeFrameRecordNumber" in container "ASPath:/TS_T40D2M10I1R0/Dem/DemGeneral/DemFreezeFrameRecNumClass".

WARNING 18-09-25,17:12:09 (1134) Cannot set the value of the node /AUTOSAR/TOP-LEVEL-PACKAGES/Dem/ELEMENTS/Dem/CommonPublishedInformation/ArReleaseMinorVersion to 0 because it is readonly. Its DEFAULT is used instead.

WARNING 18-09-25,17:12:09 (1134) Cannot set the value of the node /AUTOSAR/TOP-LEVEL-PACKAGES/Dem/ELEMENTS/Dem/CommonPublishedInformation/ArReleaseRevisionVersion to 3 because it is readonly. Its DEFAULT is used instead.

WARNING 18-09-25,17:12:09 (1648) Created required node "/AUTOSAR/TOP-LEVEL-PACKAGES/Dem/ELEMENTS/Dem/DemConfigSet/DemEventParameter/DemEventParameter_ADC_E_Timeout/DemEventAvailable" in container "/Dem/Dem/DemConfigSet_0/DemEventParameter_ADC_E_Timeout"

WARNING 18-09-25,17:12:09 (1648) Created required node "/AUTOSAR/TOP-LEVEL-PACKAGES/Dem/ELEMENTS/Dem/DemConfigSet/DemEventParameter/DemEventParameter_ADC_E_Timeout/DemEventFailureCycleCounterThreshold" in container "/Dem/Dem/DemConfigSet_0/DemEventParameter_ADC_E_Timeout"

WARNING 18-09-25,17:12:09 (1648) Created required node "/AUTOSAR/TOP-LEVEL-PACKAGES/Dem/ELEMENTS/Dem/DemConfigSet/DemEventParameter/DemEventParameter_ADC_E_Timeout/DemFFPrestorageSupported" in container "/Dem/Dem/DemConfigSet_0/DemEventParameter_ADC_E_Timeout"

WARNING 18-09-25,17:12:09 (1648) Created required node "/AUTOSAR/TOP-LEVEL-PACKAGES/Dem/ELEMENTS/Dem/DemConfigSet/DemEventParameter/DemEventParameter_ADC_E_Timeout/DemOperationCycleRef" in container "/Dem/Dem/DemConfigSet_0/DemEventParameter_ADC_E_Timeout"

WARNING 18-09-25,17:12:09 (1648) Created required node "/Dem/Dem/DemConfigSet_0/DemEventParameter_ADC_E_Timeout/DemDebounceAlgorithmClass" in container "/Dem/Dem/DemConfigSet_0/DemEventParameter_ADC_E_Timeout"

WARNING 18-09-25,17:12:09 (1648) Created required node "/AUTOSAR/TOP-LEVEL-PACKAGES/Dem/ELEMENTS/Dem/DemGeneral/DemAgingRequieresTestedCycle" in container "/Dem/Dem/DemGeneral"

WARNING 18-09-25,17:12:09 (1648) Created required node "/AUTOSAR/TOP-LEVEL-PACKAGES/Dem/ELEMENTS/Dem/DemGeneral/DemAvailabilitySupport" in container "/Dem/Dem/DemGeneral"

WARNING 18-09-25,17:12:09 (1648) Created required node "/AUTOSAR/TOP-LEVEL-PACKAGES/Dem/ELEMENTS/Dem/DemGeneral/DemClearDTCLimitation" in container "/Dem/Dem/DemGeneral"

WARNING 18-09-25,17:12:09 (1648) Created required node "/AUTOSAR/TOP-LEVEL-PACKAGES/Dem/ELEMENTS/Dem/DemGeneral/DemDataElementDefaultEndianness" in container "/Dem/Dem/DemGeneral"

WARNING 18-09-25,17:12:09 (1648) Created required node "/AUTOSAR/TOP-LEVEL-PACKAGES/Dem/ELEMENTS/Dem/DemGeneral/DemEventDisplacementStrategy" in container "/Dem/Dem/DemGeneral"

WARNING 18-09-25,17:12:09 (1648) Created required node "/AUTOSAR/TOP-LEVEL-PACKAGES/Dem/ELEMENTS/Dem/DemGeneral/DemEventMemoryEntryStorageTrigger" in container "/Dem/Dem/DemGeneral"

WARNING 18-09-25,17:12:09 (1648) Created required node "/AUTOSAR/TOP-LEVEL-PACKAGES/Dem/ELEMENTS/Dem/DemGeneral/DemGeneralInterfaceSupport" in container "/Dem/Dem/DemGeneral"

WARNING 18-09-25,17:12:09 (1648) Created required node "/AUTOSAR/TOP-LEVEL-PACKAGES/Dem/ELEMENTS/Dem/DemGeneral/DemOBDSupport" in container "/Dem/Dem/DemGeneral"

WARNING 18-09-25,17:12:09 (1648) Created required node "/AUTOSAR/TOP-LEVEL-PACKAGES/Dem/ELEMENTS/Dem/DemGeneral/DemResetConfirmedBitOnOverflow" in container "/Dem/Dem/DemGeneral"

WARNING 18-09-25,17:12:09 (1648) Created required node "/AUTOSAR/TOP-LEVEL-PACKAGES/Dem/ELEMENTS/Dem/DemGeneral/DemSuppressionSupport" in container "/Dem/Dem/DemGeneral"

WARNING 18-09-25,17:12:09 (1648) Created required node "/Dem/Dem/DemGeneral/DemPrimaryMemory" in container "/Dem/Dem/DemGeneral"

WARNING 18-09-25,17:12:09 (1648) Created required node "/AUTOSAR/TOP-LEVEL-PACKAGES/Dem/ELEMENTS/Dem/DemGeneral/DemOperationCycle/DemOperationCycle_0/DemOperationCycleAutomaticEnd" in container "/Dem/Dem/DemGeneral/DemOperationCycle_0"

WARNING 18-09-25,17:12:09 (1648) Created required node "/AUTOSAR/TOP-LEVEL-PACKAGES/Dem/ELEMENTS/Dem/DemGeneral/DemOperationCycle/DemOperationCycle_0/DemOperationCycleAutostart" in container "/Dem/Dem/DemGeneral/DemOperationCycle_0"

INFO 18-09-25,17:12:10 (2064) Verify module "EcuM"

WARNING 18-09-25,17:12:10 (1069) The node "/AUTOSAR/TOP-LEVEL-PACKAGES/EcuM/ELEMENTS/EcuM/EcuMConfiguration/EcuMCommonConfiguration/EcuMDefaultAppMode" with value "" does not refer to nodes.

WARNING 18-09-25,17:12:10 (1069) The node "/AUTOSAR/TOP-LEVEL-PACKAGES/EcuM/ELEMENTS/EcuM/EcuMConfiguration/EcuMCommonConfiguration/EcuMOSResource/__1" with value "" does not refer to nodes.

WARNING 18-09-25,17:12:10 (1069) The node "/AUTOSAR/TOP-LEVEL-PACKAGES/EcuM/ELEMENTS/EcuM/EcuMConfiguration/EcuMCommonConfiguration/EcuMSleepMode/EcuMSleepMode_0/EcuMSleepModeMcuModeRef" with value "ASPath:/Mcu/Mcu/McuModuleConfiguration_0/McuModeSettingConf_0" does not refer to nodes.

INFO 18-09-25,17:12:10 (2064) Verify module "Pwm"

ERROR 18-09-25,17:12:10 (1019) Invalid value for node "/AUTOSAR/TOP-LEVEL-PACKAGES/Pwm/ELEMENTS/Pwm/PwmChannelConfigSet/PwmChannel/PwmChannel_0/PwmMcuClockReferencePoint": Invalid or empty reference.

WARNING 18-09-25,17:12:10 (1021) Warning for node "/AUTOSAR/TOP-LEVEL-PACKAGES/Pwm/ELEMENTS/Pwm/PwmChannelConfigSet/PwmFtmModule/PwmFtmModule_0/PwmFtmChannels/PwmFtmChannels_0/ChannelCombDeadTimeEn": Deadtime insertion should be only used with PHASE_SHIFTED_COMPLEMENTARY or COMBINED_COMPLEMENTARY channel edge setup. If COMBINED_SYNCED/PHASE_SHIFTED_SYNCED is selected and deadtime insertion is used then the odd channel related to COMBINED_SYNCED/PHASE_SHIFTED_SYNCED channel may not work

ERROR 18-09-25,17:12:10 (1019) Invalid value for node "/AUTOSAR/TOP-LEVEL-PACKAGES/Pwm/ELEMENTS/Pwm/PwmChannelConfigSet/PwmFtmModule/PwmFtmModule_0/PwmFtmChannels/PwmFtmChannels_0/PwmFtmChannelId": please eneble this channel in PwmGeneral/PwmHwConfiguration/PwmChannelIsUsed

ERROR 18-09-25,17:12:10 (1065) The node "/AUTOSAR/TOP-LEVEL-PACKAGES/Pwm/ELEMENTS/Pwm/PwmGeneral/PwmHwConfiguration" has not enough children! It has "0" child - allowed are "40" to "40" children. The children are: []

INFO 18-09-25,17:12:10 (2064) Verify module "Gpt"

ERROR 18-09-25,17:12:10 (1065) The node "/AUTOSAR/TOP-LEVEL-PACKAGES/Gpt/ELEMENTS/Gpt/GptHwConfiguration" has not enough children! It has "0" child - allowed are "22" to "22" children. The children are: []

ERROR 18-09-25,17:12:10 (1019) Invalid value for node "/AUTOSAR/TOP-LEVEL-PACKAGES/Gpt/ELEMENTS/Gpt/GptChannelConfigSet/GptChannelConfiguration/GptChannelConfiguration_LedBlinker/GptFtmPrescaler": Value out of range: is "0" but must be "> 0" and "< 129"

ERROR 18-09-25,17:12:10 (1019) Invalid value for node "/AUTOSAR/TOP-LEVEL-PACKAGES/Gpt/ELEMENTS/Gpt/GptChannelConfigSet/GptChannelConfiguration/GptChannelConfiguration_LedBlinker/GptFtmPrescaler_Alternate": Value out of range: is "0" but must be "> 0" and "< 129"

ERROR 18-09-25,17:12:10 (1019) Invalid value for node "/AUTOSAR/TOP-LEVEL-PACKAGES/Gpt/ELEMENTS/Gpt/GptChannelConfigSet/GptChannelConfiguration/GptChannelConfiguration_LedBlinker/GptHwChannel": This channel has not been configured for use yet. Please refer to GptHwConfiguration to configure!

ERROR 18-09-25,17:12:10 (1019) Invalid value for node "/AUTOSAR/TOP-LEVEL-PACKAGES/Gpt/ELEMENTS/Gpt/GptChannelConfigSet/GptChannelConfiguration/GptChannelConfiguration_LedBlinker/GptHwChannel": If continuous mode is used for current channel then its ISRs shall be enabled for current timer module.

ERROR 18-09-25,17:12:10 (1019) Invalid value for node "/AUTOSAR/TOP-LEVEL-PACKAGES/Gpt/ELEMENTS/Gpt/GptChannelConfigSet/GptChannelConfiguration/GptChannelConfiguration_LedBlinker/GptLptmrPrescaler": Value out of range: is "0" but must be "> 0" and "< 65537"

ERROR 18-09-25,17:12:10 (1019) Invalid value for node "/AUTOSAR/TOP-LEVEL-PACKAGES/Gpt/ELEMENTS/Gpt/GptChannelConfigSet/GptChannelConfiguration/GptChannelConfiguration_LedBlinker/GptLptmrPrescaler_Alternate": Value out of range: is "0" but must be "> 0" and "< 65537"

ERROR 18-09-25,17:12:10 (1019) Invalid value for node "/AUTOSAR/TOP-LEVEL-PACKAGES/Gpt/ELEMENTS/Gpt/GptChannelConfigSet/GptChannelConfiguration/GptChannelConfiguration_WdgTrig/GptFtmPrescaler": Value out of range: is "0" but must be "> 0" and "< 129"

ERROR 18-09-25,17:12:10 (1019) Invalid value for node "/AUTOSAR/TOP-LEVEL-PACKAGES/Gpt/ELEMENTS/Gpt/GptChannelConfigSet/GptChannelConfiguration/GptChannelConfiguration_WdgTrig/GptFtmPrescaler_Alternate": Value out of range: is "0" but must be "> 0" and "< 129"

ERROR 18-09-25,17:12:10 (1019) Invalid value for node "/AUTOSAR/TOP-LEVEL-PACKAGES/Gpt/ELEMENTS/Gpt/GptChannelConfigSet/GptChannelConfiguration/GptChannelConfiguration_WdgTrig/GptHwChannel": This channel has not been configured for use yet. Please refer to GptHwConfiguration to configure!

ERROR 18-09-25,17:12:10 (1019) Invalid value for node "/AUTOSAR/TOP-LEVEL-PACKAGES/Gpt/ELEMENTS/Gpt/GptChannelConfigSet/GptChannelConfiguration/GptChannelConfiguration_WdgTrig/GptHwChannel": If continuous mode is used for current channel then its ISRs shall be enabled for current timer module.

ERROR 18-09-25,17:12:10 (1019) Invalid value for node "/AUTOSAR/TOP-LEVEL-PACKAGES/Gpt/ELEMENTS/Gpt/GptChannelConfigSet/GptChannelConfiguration/GptChannelConfiguration_WdgTrig/GptLptmrPrescaler": Value out of range: is "0" but must be "> 0" and "< 65537"

ERROR 18-09-25,17:12:10 (1019) Invalid value for node "/AUTOSAR/TOP-LEVEL-PACKAGES/Gpt/ELEMENTS/Gpt/GptChannelConfigSet/GptChannelConfiguration/GptChannelConfiguration_WdgTrig/GptLptmrPrescaler_Alternate": Value out of range: is "0" but must be "> 0" and "< 65537"

INFO 18-09-25,17:12:11 (2064) Verify module "Adc"

ERROR 18-09-25,17:12:11 (1065) The node "/AUTOSAR/TOP-LEVEL-PACKAGES/Adc/ELEMENTS/Adc/AdcInterrupt" has not enough children! It has "0" child - allowed are "2" to "*" children. The children are: []

INFO 18-09-25,17:12:11 (2064) Verify module "Can"

ERROR 18-09-25,17:12:11 (1025) Value "Polling" of node "/AUTOSAR/TOP-LEVEL-PACKAGES/Can/ELEMENTS/Can/CanConfigSet/CanController/CanController_0/CanBusoffProcessing" not in range "[INTERRUPT, POLLING]"

ERROR 18-09-25,17:12:11 (1025) Value "Polling" of node "/AUTOSAR/TOP-LEVEL-PACKAGES/Can/ELEMENTS/Can/CanConfigSet/CanController/CanController_0/CanRxProcessing" not in range "[INTERRUPT, POLLING]"

ERROR 18-09-25,17:12:11 (1025) Value "Polling" of node "/AUTOSAR/TOP-LEVEL-PACKAGES/Can/ELEMENTS/Can/CanConfigSet/CanController/CanController_0/CanTxProcessing" not in range "[INTERRUPT, POLLING]"

ERROR 18-09-25,17:12:11 (1025) Value "Polling" of node "/AUTOSAR/TOP-LEVEL-PACKAGES/Can/ELEMENTS/Can/CanConfigSet/CanController/CanController_0/CanWakeupProcessing" not in range "[INTERRUPT, POLLING]"

WARNING 18-09-25,17:12:11 (1069) The node "/AUTOSAR/TOP-LEVEL-PACKAGES/Can/ELEMENTS/Can/CanConfigSet/CanController/CanController_0/CanCpuClockRef_Alternate" with value "ASPath:/Mcu/Mcu/McuModuleConfiguration_0/McuClockSettingConfig_0/McuClockReferencePoint_0" does not refer to nodes.

WARNING 18-09-25,17:12:11 (1069) The node "/AUTOSAR/TOP-LEVEL-PACKAGES/Can/ELEMENTS/Can/CanConfigSet/CanController/CanController_0/CanWakeupSourceRef" with value "" does not refer to nodes.

WARNING 18-09-25,17:12:11 (1069) The node "/AUTOSAR/TOP-LEVEL-PACKAGES/Can/ELEMENTS/Can/CanGeneral/CanSupportTTCANRef" with value "" does not refer to nodes.

INFO 18-09-25,17:12:12 (2064) Verify module "Mcu"

ERROR 18-09-25,17:12:11 (1019) Invalid value for node "/AUTOSAR/TOP-LEVEL-PACKAGES/Mcu/ELEMENTS/Mcu/McuGeneralConfiguration/McuEnterLowPowerMode": The McuAllowVeryLowPowerModes and McuEnterLowPowerMode must be same configuration (true or false)

ERROR 18-09-25,17:12:11 (1032) Value "1" of node "/AUTOSAR/TOP-LEVEL-PACKAGES/Mcu/ELEMENTS/Mcu/McuModuleConfiguration/McuClockSettingConfig/McuClockSettingConfig_0/McuClockSettingId" is out of range: For input string: "Value out of range: must be in range 0 to N-1 (N is number of configured clock setting). Use the Calculate button to calculate correct default value."

ERROR 18-09-25,17:12:12 (1032) Value "3" of node "/AUTOSAR/TOP-LEVEL-PACKAGES/Mcu/ELEMENTS/Mcu/McuModuleConfiguration/McuModeSettingConf/McuModeSettingConf_SLEEP/McuMode" is out of range: For input string: "Value out of range: must be in range 0 to N-1 (N is number of configured Mode setting). Use the Calculate button to calculate correct default value."

ERROR 18-09-25,17:12:12 (1019) Invalid value for node "/AUTOSAR/TOP-LEVEL-PACKAGES/Mcu/ELEMENTS/Mcu/McuPublishedInformation/McuResetReasonConf/MCU_SOFTWARE_RESET/McuResetReason": Value "" is no number

INFO 18-09-25,17:12:12 (2064) Verify module "Dem"

ERROR 18-09-25,17:12:12 (1023) Invalid boolean value for node "/AUTOSAR/TOP-LEVEL-PACKAGES/Dem/ELEMENTS/Dem/DemConfigSet/DemEventParameter/DemEventParameter_ADC_E_Timeout/DemEventAvailable". Expected either "true" as true or "false" as false

ERROR 18-09-25,17:12:12 (1023) Invalid boolean value for node "/AUTOSAR/TOP-LEVEL-PACKAGES/Dem/ELEMENTS/Dem/DemConfigSet/DemEventParameter/DemEventParameter_ADC_E_Timeout/DemFFPrestorageSupported". Expected either "true" as true or "false" as false

WARNING 18-09-25,17:12:12 (1069) The node "/AUTOSAR/TOP-LEVEL-PACKAGES/Dem/ELEMENTS/Dem/DemConfigSet/DemEventParameter/DemEventParameter_ADC_E_Timeout/DemOperationCycleRef" with value "" does not refer to nodes.

WARNING 18-09-25,17:12:12 (1069) The node "/AUTOSAR/TOP-LEVEL-PACKAGES/Dem/ELEMENTS/Dem/DemConfigSet/DemEventParameter/DemEventParameter_ADC_E_Timeout/DemDebounceAlgorithmClass/DemDebounceCounterBasedClassRef" with value "" does not refer to nodes.

ERROR 18-09-25,17:12:12 (1023) Invalid boolean value for node "/AUTOSAR/TOP-LEVEL-PACKAGES/Dem/ELEMENTS/Dem/DemGeneral/DemAgingRequieresTestedCycle". Expected either "true" as true or "false" as false

ERROR 18-09-25,17:12:12 (1025) Value "" of node "/AUTOSAR/TOP-LEVEL-PACKAGES/Dem/ELEMENTS/Dem/DemGeneral/DemAvailabilitySupport" not in range "[DEM_EVENT_AVAILABILITY, DEM_NO_AVAILABILITY]"

ERROR 18-09-25,17:12:12 (1025) Value "" of node "/AUTOSAR/TOP-LEVEL-PACKAGES/Dem/ELEMENTS/Dem/DemGeneral/DemDataElementDefaultEndianness" not in range "[BIG_ENDIAN, LITTLE_ENDIAN, OPAQUE]"

ERROR 18-09-25,17:12:12 (1025) Value "" of node "/AUTOSAR/TOP-LEVEL-PACKAGES/Dem/ELEMENTS/Dem/DemGeneral/DemEventDisplacementStrategy" not in range "[DEM_DISPLACEMENT_FULL, DEM_DISPLACEMENT_NONE, DEM_DISPLACEMENT_PRIO_OCC]"

ERROR 18-09-25,17:12:12 (1025) Value "DEM_STORAGE_ON_TEST_FAILED" of node "/AUTOSAR/TOP-LEVEL-PACKAGES/Dem/ELEMENTS/Dem/DemGeneral/DemEventMemoryEntryStorageTrigger" not in range "[DEM_TRIGGER_ON_CONFIRMED, DEM_TRIGGER_ON_FDC_THRESHOLD, DEM_TRIGGER_ON_PENDING, DEM_TRIGGER_ON_TEST_FAILED]"

ERROR 18-09-25,17:12:12 (1023) Invalid boolean value for node "/AUTOSAR/TOP-LEVEL-PACKAGES/Dem/ELEMENTS/Dem/DemGeneral/DemGeneralInterfaceSupport". Expected either "true" as true or "false" as false

ERROR 18-09-25,17:12:12 (1025) Value "" of node "/AUTOSAR/TOP-LEVEL-PACKAGES/Dem/ELEMENTS/Dem/DemGeneral/DemOBDSupport" not in range "[DEM_OBD_DEP_SEC_ECU, DEM_OBD_MASTER_ECU, DEM_OBD_NO_OBD_SUPPORT, DEM_OBD_PRIMARY_ECU]"

ERROR 18-09-25,17:12:12 (1025) Value "" of node "/AUTOSAR/TOP-LEVEL-PACKAGES/Dem/ELEMENTS/Dem/DemGeneral/DemSuppressionSupport" not in range "[DEM_DTC_SUPPRESSION, DEM_NO_SUPPRESSION]"

ERROR 18-09-25,17:12:12 (1019) Invalid value for node "/AUTOSAR/TOP-LEVEL-PACKAGES/Dem/ELEMENTS/Dem/DemGeneral/DemTaskTime": Value out of range: is "0.0" but must be ">= 0.001" and "<= 0.1"

ERROR 18-09-25,17:12:12 (1065) The node "/AUTOSAR/TOP-LEVEL-PACKAGES/Dem/ELEMENTS/Dem/DemGeneral/DemFreezeFrameRecNumClass/DemFreezeFrameRecNumClass_0/DemFreezeFrameRecordClassRef" has not enough children! It has "0" child - allowed are "1" to "254" children. The children are: []

ERROR 18-09-25,17:12:12 (1019) Invalid value for node "/AUTOSAR/TOP-LEVEL-PACKAGES/Dem/ELEMENTS/Dem/DemGeneral/DemPrimaryMemory/DemMaxNumberEventEntryPrimary": Value "" is no number

INFO 18-09-25,17:12:12 (2113) Creating directory "c:\devtools\HelloWorld_S32K14X\HelloWorld_S32K14X\..\..\MCAL_S32K14X\output\generated"

INFO 18-09-25,17:12:12 (13030) Running generator "Dio_TS_T40D2M10I1R0" in mode "generate" for module "Dio_TS_T40D2M10I1R0"

INFO 18-09-25,17:12:12 (2113) Creating directory "c:\devtools\HelloWorld_S32K14X\HelloWorld_S32K14X\..\..\MCAL_S32K14X\output\generated\output"

INFO 18-09-25,17:12:12 (20053) Generating file C:\devtools\MCAL_S32K14X\output\generated\output\Dio.epc

INFO 18-09-25,17:12:12 (13030) Running generator "Dio_TS_T40D2M10I1R0_GeneratorId" in mode "generate" for module "Dio_TS_T40D2M10I1R0"

INFO 18-09-25,17:12:12 (13014) Generated "c:\devtools\HelloWorld_S32K14X\HelloWorld_S32K14X\..\..\MCAL_S32K14X\output\generated\include\Dio_Cfg.h"

INFO 18-09-25,17:12:12 (13014) Generated "c:\devtools\HelloWorld_S32K14X\HelloWorld_S32K14X\..\..\MCAL_S32K14X\output\generated\src\Dio_Cfg.c"

INFO 18-09-25,17:12:12 (13030) Running generator "EcuM_TS_T40D2M10I1R0" in mode "generate" for module "EcuM_TS_T40D2M10I1R0"

INFO 18-09-25,17:12:12 (20053) Generating file C:\devtools\MCAL_S32K14X\output\generated\output\EcuM.epc

INFO 18-09-25,17:12:12 (13030) Running generator "EcuM_TS_T40D2M10I1R0_GeneratorId" in mode "generate" for module "EcuM_TS_T40D2M10I1R0"

INFO 18-09-25,17:12:12 (13014) Generated "c:\devtools\HelloWorld_S32K14X\HelloWorld_S32K14X\..\..\MCAL_S32K14X\output\generated\include\EcuM_Cfg.h"

INFO 18-09-25,17:12:12 (13030) Running generator "Wdg_TS_T40D2M10I1R0" in mode "generate" for module "Wdg_TS_T40D2M10I1R0"

INFO 18-09-25,17:12:12 (20053) Generating file C:\devtools\MCAL_S32K14X\output\generated\output\Wdg.epc

INFO 18-09-25,17:12:12 (13030) Running generator "Wdg_TS_T40D2M10I1R0_GeneratorId" in mode "generate" for module "Wdg_TS_T40D2M10I1R0"

INFO 18-09-25,17:12:12 (13014) Generated "c:\devtools\HelloWorld_S32K14X\HelloWorld_S32K14X\..\..\MCAL_S32K14X\output\generated\src\Wdg_Lcfg.c"

INFO 18-09-25,17:12:12 (13014) Generated "c:\devtools\HelloWorld_S32K14X\HelloWorld_S32K14X\..\..\MCAL_S32K14X\output\generated\src\Wdg_CfgExt.c"

INFO 18-09-25,17:12:13 (13014) Generated "c:\devtools\HelloWorld_S32K14X\HelloWorld_S32K14X\..\..\MCAL_S32K14X\output\generated\src\Wdg_PBcfg.c"

INFO 18-09-25,17:12:13 (13014) Generated "c:\devtools\HelloWorld_S32K14X\HelloWorld_S32K14X\..\..\MCAL_S32K14X\output\generated\include\Wdg_Cfg.h"

INFO 18-09-25,17:12:13 (13014) Generated "c:\devtools\HelloWorld_S32K14X\HelloWorld_S32K14X\..\..\MCAL_S32K14X\output\generated\src\Wdg_Cfg.c"

INFO 18-09-25,17:12:13 (13030) Running generator "Spi_TS_T40D2M10I1R0" in mode "generate" for module "Spi_TS_T40D2M10I1R0"

INFO 18-09-25,17:12:13 (20053) Generating file C:\devtools\MCAL_S32K14X\output\generated\output\Spi.epc

INFO 18-09-25,17:12:13 (13030) Running generator "Spi_TS_T40D2M10I1R0_GeneratorId" in mode "generate" for module "Spi_TS_T40D2M10I1R0"

INFO 18-09-25,17:12:13 (13014) Generated "c:\devtools\HelloWorld_S32K14X\HelloWorld_S32K14X\..\..\MCAL_S32K14X\output\generated\src\Spi_PBcfg.c"

INFO 18-09-25,17:12:13 (13014) Generated "c:\devtools\HelloWorld_S32K14X\HelloWorld_S32K14X\..\..\MCAL_S32K14X\output\generated\include\Spi_Cfg.h"

INFO 18-09-25,17:12:13 (13014) Generated "c:\devtools\HelloWorld_S32K14X\HelloWorld_S32K14X\..\..\MCAL_S32K14X\output\generated\src\Spi_Cfg.c"

INFO 18-09-25,17:12:13 (13030) Running generator "Pwm_TS_T40D2M10I1R0" in mode "generate" for module "Pwm_TS_T40D2M10I1R0"

INFO 18-09-25,17:12:13 (20053) Generating file C:\devtools\MCAL_S32K14X\output\generated\output\Pwm.epc

INFO 18-09-25,17:12:13 (13030) Running generator "Pwm_TS_T40D2M10I1R0_GeneratorId" in mode "generate" for module "Pwm_TS_T40D2M10I1R0"

ERROR 18-09-25,17:12:14 (2091) Failed to run generator "Pwm_TS_T40D2M10I1R0_GeneratorId" (mode: "generate") for module "Pwm_TS_T40D2M10I1R0"

ERROR 18-09-25,17:12:14 (1806) Parsing file "C:\NXP\AUTOSAR\S32K14X_MCAL4_2_RTM_P2_1_0_1\eclipse\plugins\Pwm_TS_T40D2M10I1R0/generate_PB/src/Pwm_PBcfg.c (signed)", line "299"

  Parsing file "C:\NXP\AUTOSAR\S32K14X_MCAL4_2_RTM_P2_1_0_1\eclipse\plugins\Pwm_TS_T40D2M10I1R0/generate_PB/src/Pwm_PBcfg.c (signed)", line "299"

  Parsing file "C:\NXP\AUTOSAR\S32K14X_MCAL4_2_RTM_P2_1_0_1\eclipse\plugins\Pwm_TS_T40D2M10I1R0/generate_PB/src/Pwm_PBcfg.c (signed)", line "299"

  The XPath-expression "node:ref(PwmMcuClockReferencePoint)/McuClockReferencePointFrequency" caused an error: (1844) No node found for path ""

ERROR 18-09-25,17:12:14 (2070) Failed to generate file "C:\NXP\AUTOSAR\S32K14X_MCAL4_2_RTM_P2_1_0_1\eclipse\plugins\Pwm_TS_T40D2M10I1R0/generate_PB/src/Pwm_PBcfg.c (signed)"

INFO 18-09-25,17:12:14 (13014) Generated "c:\devtools\HelloWorld_S32K14X\HelloWorld_S32K14X\..\..\MCAL_S32K14X\output\generated\include\Pwm_Cfg.h"

INFO 18-09-25,17:12:14 (13030) Running generator "Mcl_TS_T40D2M10I1R0" in mode "generate" for module "Mcl_TS_T40D2M10I1R0"

INFO 18-09-25,17:12:14 (20053) Generating file C:\devtools\MCAL_S32K14X\output\generated\output\Mcl.epc

INFO 18-09-25,17:12:14 (13030) Running generator "Mcl_TS_T40D2M10I1R0_GeneratorId" in mode "generate" for module "Mcl_TS_T40D2M10I1R0"

INFO 18-09-25,17:12:14 (13014) Generated "c:\devtools\HelloWorld_S32K14X\HelloWorld_S32K14X\..\..\MCAL_S32K14X\output\generated\src\CDD_Mcl_Cfg.c"

INFO 18-09-25,17:12:14 (13014) Generated "c:\devtools\HelloWorld_S32K14X\HelloWorld_S32K14X\..\..\MCAL_S32K14X\output\generated\src\CDD_Mcl_PBcfg.c"

INFO 18-09-25,17:12:14 (13014) Generated "c:\devtools\HelloWorld_S32K14X\HelloWorld_S32K14X\..\..\MCAL_S32K14X\output\generated\include\CDD_Mcl_Cfg.h"

INFO 18-09-25,17:12:14 (13030) Running generator "Resource_TS_T40D2M10I1R0" in mode "generate" for module "Resource_TS_T40D2M10I1R0"

INFO 18-09-25,17:12:14 (20053) Generating file C:\devtools\MCAL_S32K14X\output\generated\output\Resource.epc

INFO 18-09-25,17:12:14 (13030) Running generator "Resource_TS_T40D2M10I1R0_GeneratorId" in mode "generate" for module "Resource_TS_T40D2M10I1R0"

INFO 18-09-25,17:12:14 (13030) Running generator "Base_TS_T40D2M10I1R0" in mode "generate" for module "Base_TS_T40D2M10I1R0"

INFO 18-09-25,17:12:14 (20053) Generating file C:\devtools\MCAL_S32K14X\output\generated\output\Base.epc

INFO 18-09-25,17:12:14 (13030) Running generator "Base_TS_T40D2M10I1R0_GeneratorId" in mode "generate" for module "Base_TS_T40D2M10I1R0"

INFO 18-09-25,17:12:14 (13014) Generated "c:\devtools\HelloWorld_S32K14X\HelloWorld_S32K14X\..\..\MCAL_S32K14X\output\generated\include\modules.h"

INFO 18-09-25,17:12:14 (13014) Generated "c:\devtools\HelloWorld_S32K14X\HelloWorld_S32K14X\..\..\MCAL_S32K14X\output\generated\include\Reg_eSys.h"

INFO 18-09-25,17:12:14 (13030) Running generator "Gpt_TS_T40D2M10I1R0" in mode "generate" for module "Gpt_TS_T40D2M10I1R0"

ERROR 18-09-25,17:12:14 (2091) Failed to run generator "Gpt_TS_T40D2M10I1R0_GeneratorId" (mode: "generate") for module "Gpt_TS_T40D2M10I1R0"

ERROR 18-09-25,17:12:14 (1806) Parsing file "C:\NXP\AUTOSAR\S32K14X_MCAL4_2_RTM_P2_1_0_1\eclipse\plugins\Gpt_TS_T40D2M10I1R0/generate_PB/Gpt_PluginMacros.m (signed)", line "396"

 Parsing file "C:\NXP\AUTOSAR\S32K14X_MCAL4_2_RTM_P2_1_0_1\eclipse\plugins\Gpt_TS_T40D2M10I1R0/generate_PB/Gpt_PluginMacros.m (signed)", line "396"

  Parsing file "C:\NXP\AUTOSAR\S32K14X_MCAL4_2_RTM_P2_1_0_1\eclipse\plugins\Gpt_TS_T40D2M10I1R0/generate_PB/Gpt_PluginMacros.m (signed)", line "396"

  The XPath-expression "node:ref($path_predef)" caused an error: (1844) No node found for path "GptPredefTimerConfiguration/GptPredefTimer_1us_16Bit"

ERROR 18-09-25,17:12:14 (2070) Failed to generate file "C:\NXP\AUTOSAR\S32K14X_MCAL4_2_RTM_P2_1_0_1\eclipse\plugins\Gpt_TS_T40D2M10I1R0/generate_PB/src/Gpt_PBcfg.c (signed)"

INFO 18-09-25,17:12:14 (20053) Generating file C:\devtools\MCAL_S32K14X\output\generated\output\Gpt.epc

INFO 18-09-25,17:12:14 (13030) Running generator "Gpt_TS_T40D2M10I1R0_GeneratorId" in mode "generate" for module "Gpt_TS_T40D2M10I1R0"

INFO 18-09-25,17:12:14 (13014) Generated "c:\devtools\HelloWorld_S32K14X\HelloWorld_S32K14X\..\..\MCAL_S32K14X\output\generated\include\Gpt_Cfg.h"

INFO 18-09-25,17:12:14 (13030) Running generator "Port_TS_T40D2M10I1R0" in mode "generate" for module "Port_TS_T40D2M10I1R0"

INFO 18-09-25,17:12:14 (20053) Generating file C:\devtools\MCAL_S32K14X\output\generated\output\Port.epc

INFO 18-09-25,17:12:14 (13030) Running generator "Port_TS_T40D2M10I1R0_GeneratorId" in mode "generate" for module "Port_TS_T40D2M10I1R0"

INFO 18-09-25,17:12:15 (13014) Generated "c:\devtools\HelloWorld_S32K14X\HelloWorld_S32K14X\..\..\MCAL_S32K14X\output\generated\src\Port_Cfg.c"

INFO 18-09-25,17:12:15 (13014) Generated "c:\devtools\HelloWorld_S32K14X\HelloWorld_S32K14X\..\..\MCAL_S32K14X\output\generated\src\Port_PBcfg.c"

INFO 18-09-25,17:12:15 (13014) Generated "c:\devtools\HelloWorld_S32K14X\HelloWorld_S32K14X\..\..\MCAL_S32K14X\output\generated\include\Port_Cfg.h"

INFO 18-09-25,17:12:15 (13030) Running generator "Os_TS_T40D2M10I1R0" in mode "generate" for module "Os_TS_T40D2M10I1R0"

INFO 18-09-25,17:12:15 (20053) Generating file C:\devtools\MCAL_S32K14X\output\generated\output\Os.epc

INFO 18-09-25,17:12:15 (13030) Running generator "Os_TS_T40D2M10I1R0_GeneratorId" in mode "generate" for module "Os_TS_T40D2M10I1R0"

INFO 18-09-25,17:12:15 (13014) Generated "c:\devtools\HelloWorld_S32K14X\HelloWorld_S32K14X\..\..\MCAL_S32K14X\output\generated\include\Os_cfg.h"

INFO 18-09-25,17:12:15 (13030) Running generator "Adc_TS_T40D2M10I1R0" in mode "generate" for module "Adc_TS_T40D2M10I1R0"

INFO 18-09-25,17:12:15 (20053) Generating file C:\devtools\MCAL_S32K14X\output\generated\output\Adc.epc

INFO 18-09-25,17:12:15 (13030) Running generator "Adc_TS_T40D2M10I1R0_GeneratorId" in mode "generate" for module "Adc_TS_T40D2M10I1R0"

INFO 18-09-25,17:12:15 (13014) Generated "c:\devtools\HelloWorld_S32K14X\HelloWorld_S32K14X\..\..\MCAL_S32K14X\output\generated\include\Adc_CfgDefines.h"

INFO 18-09-25,17:12:15 (13014) Generated "c:\devtools\HelloWorld_S32K14X\HelloWorld_S32K14X\..\..\MCAL_S32K14X\output\generated\src\Adc_Cfg.c"

INFO 18-09-25,17:12:16 (13014) Generated "c:\devtools\HelloWorld_S32K14X\HelloWorld_S32K14X\..\..\MCAL_S32K14X\output\generated\src\Adc_PBcfg.c"

INFO 18-09-25,17:12:16 (13014) Generated "c:\devtools\HelloWorld_S32K14X\HelloWorld_S32K14X\..\..\MCAL_S32K14X\output\generated\include\Adc_Cfg.h"

INFO 18-09-25,17:12:16 (13030) Running generator "Can_TS_T40D2M10I1R0" in mode "generate" for module "Can_TS_T40D2M10I1R0"

INFO 18-09-25,17:12:16 (20053) Generating file C:\devtools\MCAL_S32K14X\output\generated\output\Can.epc

INFO 18-09-25,17:12:16 (13030) Running generator "Can_TS_T40D2M10I1R0_GeneratorId" in mode "generate" for module "Can_TS_T40D2M10I1R0"

ERROR 18-09-25,17:12:16 (2091) Failed to run generator "Can_TS_T40D2M10I1R0_GeneratorId" (mode: "generate") for module "Can_TS_T40D2M10I1R0"

ERROR 18-09-25,17:12:16 (2004) [C:\NXP\AUTOSAR\S32K14X_MCAL4_2_RTM_P2_1_0_1\eclipse\plugins\Can_TS_T40D2M10I1R0/generate_PC/include/Can_Cfg.h (signed):218]: The "CanHwFilter" of each HOH must be enabled when user configure HOH is receive.

(node )

ERROR 18-09-25,17:12:16 (2070) Failed to generate file "C:\NXP\AUTOSAR\S32K14X_MCAL4_2_RTM_P2_1_0_1\eclipse\plugins\Can_TS_T40D2M10I1R0/generate_PC/include/Can_Cfg.h (signed)"

INFO 18-09-25,17:12:16 (13014) Generated "c:\devtools\HelloWorld_S32K14X\HelloWorld_S32K14X\..\..\MCAL_S32K14X\output\generated\src\Can_PBcfg.c"

INFO 18-09-25,17:12:16 (13014) Generated "c:\devtools\HelloWorld_S32K14X\HelloWorld_S32K14X\..\..\MCAL_S32K14X\output\generated\src\Can_Cfg.c"

INFO 18-09-25,17:12:16 (13030) Running generator "Mcu_TS_T40D2M10I1R0" in mode "generate" for module "Mcu_TS_T40D2M10I1R0"

INFO 18-09-25,17:12:16 (20053) Generating file C:\devtools\MCAL_S32K14X\output\generated\output\Mcu.epc

INFO 18-09-25,17:12:16 (13030) Running generator "Mcu_TS_T40D2M10I1R0_GeneratorId" in mode "generate" for module "Mcu_TS_T40D2M10I1R0"

INFO 18-09-25,17:12:17 (13014) Generated "c:\devtools\HelloWorld_S32K14X\HelloWorld_S32K14X\..\..\MCAL_S32K14X\output\generated\include\Mcu_Cfg.h"

INFO 18-09-25,17:12:17 (13014) Generated "c:\devtools\HelloWorld_S32K14X\HelloWorld_S32K14X\..\..\MCAL_S32K14X\output\generated\src\Mcu_PBcfg.c"

INFO 18-09-25,17:12:17 (13014) Generated "c:\devtools\HelloWorld_S32K14X\HelloWorld_S32K14X\..\..\MCAL_S32K14X\output\generated\src\Mcu_Cfg.c"

INFO 18-09-25,17:12:17 (13030) Running generator "Dem_TS_T40D2M10I1R0" in mode "generate" for module "Dem_TS_T40D2M10I1R0"

INFO 18-09-25,17:12:17 (20053) Generating file C:\devtools\MCAL_S32K14X\output\generated\output\Dem.epc

INFO 18-09-25,17:12:17 (13030) Running generator "Dem_TS_T40D2M10I1R0_GeneratorId" in mode "generate" for module "Dem_TS_T40D2M10I1R0"

INFO 18-09-25,17:12:17 (13014) Generated "c:\devtools\HelloWorld_S32K14X\HelloWorld_S32K14X\..\..\MCAL_S32K14X\output\generated\include\Dem_IntErrId.h"

 

Errors "47" Warnings "122"

make[1]: *** [generateMCAL] Error 1

make[1]: Leaving directory `/C/devtools/HelloWorld_S32K14X/HelloWorld_S32K14X/obj_s32k144evb_0100'

make: *** [/C/devtools/HelloWorld_S32K14X/HelloWorld_S32K14X] Error 2

 

17:12:20 Build Finished (took 1m:28s.942ms)

 

 

 

Could you please help me for the solution?

 

Thank you in advance

 

Sadan Donmez

Outcomes