AnsweredAssumed Answered

After creating new  a  ISP appliction   ,when I used S32DS3.1  to build  ISP_test_application  the following errors occurred

Question asked by li lei on Aug 1, 2019

After creating new  a  ISP appliction   ,when I used S32DS3.1  to build  ISP_test_application  the following errors occurred:

 

11:37:02 **** Clean-only build of configuration A53 for project ISP_test_application ****
make -j2 clean
rm -rf ./*/*/*.o ./*/*.o ISP_test_application.siz ./*/*/*.d ./*/*/*.d ./*/*.d ISP_test_application.elf

11:37:03 Build Finished (took 747ms)

11:37:03 **** Build of configuration A53 for project ISP_test_application ****
make -j2 all
make --no-print-directory pre-build
rm -f ../A53_gen/src/sequencer_srec.c; make -f ../Project_Settings/Scripts/seq.mk TD="/home/lilei/NXP/S32DS.3.1/eclipse/../S32DS/build_tools/gcc-6.3-arm32-eabi" VD="/home/lilei/NXP/S32DS.3.1/eclipse/../S32DS/software/VSDK_S32V2_RTM_1_3_0/s32v234_sdk"
make[2]: dos2unix:命令未找到
make[2]: *** [../A53_gen/src/sequencer_srec.c] Error 127
../Project_Settings/Scripts/seq.mk:77: recipe for target '../A53_gen/src/sequencer_srec.c' failed
make[1]: [pre-build] Error 2 (ignored)
makefile:75: recipe for target 'pre-build' failed

 

 

Building target: ISP_test_application.elf
Invoking: Standard S32DS C++ Linker
aarch64-linux-gnu-g++ -o "ISP_test_application.elf" "@ISP_test_application.args"
./A53_gen/src/isp_process.o:在函数‘ISP_CALL()’中:
/home/lilei/workspaceS32DS.3.1/ISP_test_application/A53/../A53_gen/src/isp_process.cpp:121:对‘sequencer_srec’未定义的引用
makefile:57: recipe for target 'ISP_test_application.elf' failed
makefile:46: recipe for target 'all' failed
/home/lilei/workspaceS32DS.3.1/ISP_test_application/A53/../A53_gen/src/isp_process.cpp:121:对‘sequencer_srec’未定义的引用
collect2: error: ld returned 1 exit status
make[1]: *** [ISP_test_application.elf] Error 1
make: *** [all] Error 2

 

Outcomes