AnsweredAssumed Answered

Yocto build compilation errors

Question asked by viswanath kondapalli on May 8, 2019
Latest reply on May 10, 2019 by gusarambula

We are facing errors in Yocto building the environment. Ubuntu 16.04 we are using.

we tried many ways but not fixing like bitbake -c cleanall target but error still coming.

 

ERROR: libpciaccess-0.14-r0 do_compile: oe_runmake failed
ERROR: libpciaccess-0.14-r0 do_compile: Function failed: do_compile (log file is located at /home/testsys/Work/test-yocto-ver1-1/Ver1.1/ccu-yocto-rel-Ver1.1-dx/imx-yocto-bsp/build_imx8dx-ccu/tmp/work/aarch64-poky-linux/libpciaccess/0.14-r0/temp/log.do_compile.17540)
ERROR: Logfile of failure stored in: /home/testsys/Work/test-yocto-ver1-1/Ver1.1/ccu-yocto-rel-Ver1.1-dx/imx-yocto-bsp/build_imx8dx-ccu/tmp/work/aarch64-poky-linux/libpciaccess/0.14-r0/temp/log.do_compile.17540
Log data follows:
| DEBUG: SITE files ['endian-little', 'bit-64', 'arm-common', 'arm-64', 'common-linux', 'common-glibc', 'aarch64-linux', 'common']
| DEBUG: Executing shell function do_compile
| NOTE: make -j 2
| make: *** No targets specified and no makefile found. Stop.
| ERROR: oe_runmake failed
| WARNING: exit code 1 from a shell command.
| ERROR: Function failed: do_compile (log file is located at /home/testsys/Work/test-yocto-ver1-1/Ver1.1/ccu-yocto-rel-Ver1.1-dx/imx-yocto-bsp/build_imx8dx-ccu/tmp/work/aarch64-poky-linux/libpciaccess/0.14-r0/temp/log.do_compile.17540)
ERROR: Task (/home/testsys/Work/test-yocto-ver1-1/Ver1.1/ccu-yocto-rel-Ver1.1-dx/imx-yocto-bsp/sources/poky/meta/recipes-graphics/xorg-lib/libpciaccess_0.14.bb:do_compile) failed with exit code '1'
ERROR: libpthread-stubs-0.4-r0 do_compile: oe_runmake failed
ERROR: libpthread-stubs-0.4-r0 do_compile: Function failed: do_compile (log file is located at /home/testsys/Work/test-yocto-ver1-1/Ver1.1/ccu-yocto-rel-Ver1.1-dx/imx-yocto-bsp/build_imx8dx-ccu/tmp/work/aarch64-poky-linux/libpthread-stubs/0.4-r0/temp/log.do_compile.17541)
ERROR: Logfile of failure stored in: /home/testsys/Work/test-yocto-ver1-1/Ver1.1/ccu-yocto-rel-Ver1.1-dx/imx-yocto-bsp/build_imx8dx-ccu/tmp/work/aarch64-poky-linux/libpthread-stubs/0.4-r0/temp/log.do_compile.17541
Log data follows:
| DEBUG: SITE files ['endian-little', 'bit-64', 'arm-common', 'arm-64', 'common-linux', 'common-glibc', 'aarch64-linux', 'common']
| DEBUG: Executing shell function do_compile
| NOTE: make -j 2
| make: *** No targets. Stop.
| ERROR: oe_runmake failed
| WARNING: exit code 1 from a shell command.
| ERROR: Function failed: do_compile (log file is located at /home/testsys/Work/test-yocto-ver1-1/Ver1.1/ccu-yocto-rel-Ver1.1-dx/imx-yocto-bsp/build_imx8dx-ccu/tmp/work/aarch64-poky-linux/libpthread-stubs/0.4-r0/temp/log.do_compile.17541)
ERROR: Task (/home/testsys/Work/test-yocto-ver1-1/Ver1.1/ccu-yocto-rel-Ver1.1-dx/imx-yocto-bsp/sources/poky/meta/recipes-graphics/xorg-lib/libpthread-stubs_0.4.bb:do_compile) failed with exit code '1'
ERROR: binutils-native-2.30-r0 do_compile: oe_runmake failed
ERROR: binutils-native-2.30-r0 do_compile: Function failed: do_compile (log file is located at /home/testsys/Work/test-yocto-ver1-1/Ver1.1/ccu-yocto-rel-Ver1.1-dx/imx-yocto-bsp/build_imx8dx-ccu/tmp/work/x86_64-linux/binutils-native/2.30-r0/temp/log.do_compile.17545)
ERROR: Logfile of failure stored in: /home/testsys/Work/test-yocto-ver1-1/Ver1.1/ccu-yocto-rel-Ver1.1-dx/imx-yocto-bsp/build_imx8dx-ccu/tmp/work/x86_64-linux/binutils-native/2.30-r0/temp/log.do_compile.17545
Log data follows:
| DEBUG: Executing shell function do_compile
| NOTE: make -j 2
| make[1]: Entering directory '/home/testsys/Work/test-yocto-ver1-1/Ver1.1/ccu-yocto-rel-Ver1.1-dx/imx-yocto-bsp/build_imx8dx-ccu/tmp/work/x86_64-linux/binutils-native/2.30-r0/git/build.x86_64-linux.x86_64-linux'
| make[1]: Nothing to be done for 'all-target'.
| make[2]: Entering directory '/home/testsys/Work/test-yocto-ver1-1/Ver1.1/ccu-yocto-rel-Ver1.1-dx/imx-yocto-bsp/build_imx8dx-ccu/tmp/work/x86_64-linux/binutils-native/2.30-r0/git/build.x86_64-linux.x86_64-linux/libiberty'
| make[2]: Entering directory '/home/testsys/Work/test-yocto-ver1-1/Ver1.1/ccu-yocto-rel-Ver1.1-dx/imx-yocto-bsp/build_imx8dx-ccu/tmp/work/x86_64-linux/binutils-native/2.30-r0/git/build.x86_64-linux.x86_64-linux/intl'
| make[2]: Nothing to be done for 'all'.
| make[2]: Leaving directory '/home/testsys/Work/test-yocto-ver1-1/Ver1.1/ccu-yocto-rel-Ver1.1-dx/imx-yocto-bsp/build_imx8dx-ccu/tmp/work/x86_64-linux/binutils-native/2.30-r0/git/build.x86_64-linux.x86_64-linux/intl'
| make[3]: Entering directory '/home/testsys/Work/test-yocto-ver1-1/Ver1.1/ccu-yocto-rel-Ver1.1-dx/imx-yocto-bsp/build_imx8dx-ccu/tmp/work/x86_64-linux/binutils-native/2.30-r0/git/build.x86_64-linux.x86_64-linux/libiberty/testsuite'
| make[3]: Nothing to be done for 'all'.
| make[3]: Leaving directory '/home/testsys/Work/test-yocto-ver1-1/Ver1.1/ccu-yocto-rel-Ver1.1-dx/imx-yocto-bsp/build_imx8dx-ccu/tmp/work/x86_64-linux/binutils-native/2.30-r0/git/build.x86_64-linux.x86_64-linux/libiberty/testsuite'
| make[2]: Leaving directory '/home/testsys/Work/test-yocto-ver1-1/Ver1.1/ccu-yocto-rel-Ver1.1-dx/imx-yocto-bsp/build_imx8dx-ccu/tmp/work/x86_64-linux/binutils-native/2.30-r0/git/build.x86_64-linux.x86_64-linux/libiberty'
| make[2]: Entering directory '/home/testsys/Work/test-yocto-ver1-1/Ver1.1/ccu-yocto-rel-Ver1.1-dx/imx-yocto-bsp/build_imx8dx-ccu/tmp/work/x86_64-linux/binutils-native/2.30-r0/git/build.x86_64-linux.x86_64-linux/zlib'
| true "AR_FLAGS=rc" "CC_FOR_BUILD=gcc " "CFLAGS=-isystem/home/testsys/Work/test-yocto-ver1-1/Ver1.1/ccu-yocto-rel-Ver1.1-dx/imx-yocto-bsp/build_imx8dx-ccu/tmp/work/x86_64-linux/binutils-native/2.30-r0/recipe-sysroot-native/usr/include -O2 -pipe -pie -fpie" "CXXFLAGS=-isystem/home/testsys/Work/test-yocto-ver1-1/Ver1.1/ccu-yocto-rel-Ver1.1-dx/imx-yocto-bsp/build_imx8dx-ccu/tmp/work/x86_64-linux/binutils-native/2.30-r0/recipe-sysroot-native/usr/include -O2 -pipe -pie -fpie" "CFLAGS_FOR_BUILD=-isystem/home/testsys/Work/test-yocto-ver1-1/Ver1.1/ccu-yocto-rel-Ver1.1-dx/imx-yocto-bsp/build_imx8dx-ccu/tmp/work/x86_64-linux/binutils-native/2.30-r0/recipe-sysroot-native/usr/include -O2 -pipe -pie -fpie" "CFLAGS_FOR_TARGET=-g -isystem/home/testsys/Work/test-yocto-ver1-1/Ver1.1/ccu-yocto-rel-Ver1.1-dx/imx-yocto-bsp/build_imx8dx-ccu/tmp/work/x86_64-linux/binutils-native/2.30-r0/recipe-sysroot-native/usr/include -O2 -pipe -pie -fpie" "INSTALL=/home/testsys/Work/test-yocto-ver1-1/Ver1.1/ccu-yocto-rel-Ver1.1-dx/imx-yocto-bsp/build_imx8dx-ccu/tmp/hosttools/install -c" "INSTALL_DATA=/home/testsys/Work/test-yocto-ver1-1/Ver1.1/ccu-yocto-rel-Ver1.1-dx/imx-yocto-bsp/build_imx8dx-ccu/tmp/hosttools/install -c -m 644" "INSTALL_PROGRAM=/home/testsys/Work/test-yocto-ver1-1/Ver1.1/ccu-yocto-rel-Ver1.1-dx/imx-yocto-bsp/build_imx8dx-ccu/tmp/hosttools/install -c" "INSTALL_SCRIPT=/home/testsys/Work/test-yocto-ver1-1/Ver1.1/ccu-yocto-rel-Ver1.1-dx/imx-yocto-bsp/build_imx8dx-ccu/tmp/hosttools/install -c" "LDFLAGS=-static-libstdc++ -static-libgcc -L/home/testsys/Work/test-yocto-ver1-1/Ver1.1/ccu-yocto-rel-Ver1.1-dx/imx-yocto-bsp/build_imx8dx-ccu/tmp/work/x86_64-linux/binutils-native/2.30-r0/recipe-sysroot-native/usr/lib -L/home/testsys/Work/test-yocto-ver1-1/Ver1.1/ccu-yocto-rel-Ver1.1-dx/imx-yocto-bsp/build_imx8dx-ccu/tmp/work/x86_64-linux/binutils-native/2.30-r0/recipe-sysroot-native/lib -Wl,-rpath-link,/home/testsys/Work/test-yocto-ver1-1/Ver1.1/ccu-yocto-rel-Ver1.1-dx/imx-yocto-bsp/build_imx8dx-ccu/tmp/work/x86_64-linux/binutils-native/2.30-r0/recipe-sysroot-native/usr/lib -Wl,-rpath-link,/home/testsys/Work/test-yocto-ver1-1/Ver1.1/ccu-yocto-rel-Ver1.1-dx/imx-yocto-bsp/build_imx8dx-ccu/tmp/work/x86_64-linux/binutils-native/2.30-r0/recipe-sysroot-native/lib -Wl,-rpath,/home/testsys/Work/test-yocto-ver1-1/Ver1.1/ccu-yocto-rel-Ver1.1-dx/imx-yocto-bsp/build_imx8dx-ccu/tmp/work/x86_64-linux/binutils-native/2.30-r0/recipe-sysroot-native/usr/lib -Wl,-rpath,/home/testsys/Work/test-yocto-ver1-1/Ver1.1/ccu-yocto-rel-Ver1.1-dx/imx-yocto-bsp/build_imx8dx-ccu/tmp/work/x86_64-linux/binutils-native/2.30-r0/recipe-sysroot-native/lib -Wl,-O1" "LIBCFLAGS=-isystem/home/testsys/Work/test-yocto-ver1-1/Ver1.1/ccu-yocto-rel-Ver1.1-dx/imx-yocto-bsp/build_imx8dx-ccu/tmp/work/x86_64-linux/binutils-native/2.30-r0/recipe-sysroot-native/usr/include -O2 -pipe -pie -fpie" "LIBCFLAGS_FOR_TARGET=-g -isystem/home/testsys/Work/test-yocto-ver1-1/Ver1.1/ccu-yocto-rel-Ver1.1-dx/imx-yocto-bsp/build_imx8dx-ccu/tmp/work/x86_64-linux/binutils-native/2.30-r0/recipe-sysroot-native/usr/include -O2 -pipe -pie -fpie" "MAKE=make" "MAKEINFO=makeinfo --split-size=5000000 --split-size=5000000 " "PICFLAG=" "PICFLAG_FOR_TARGET=" "SHELL=/bin/bash" "EXPECT=expect" "RUNTEST=runtest" "RUNTESTFLAGS=" "exec_prefix=/home/testsys/Work/test-yocto-ver1-1/Ver1.1/ccu-yocto-rel-Ver1.1-dx/imx-yocto-bsp/build_imx8dx-ccu/tmp/work/x86_64-linux/binutils-native/2.30-r0/recipe-sysroot-native/usr" "infodir=/home/testsys/Work/test-yocto-ver1-1/Ver1.1/ccu-yocto-rel-Ver1.1-dx/imx-yocto-bsp/build_imx8dx-ccu/tmp/work/x86_64-linux/binutils-native/2.30-r0/recipe-sysroot-native/usr/share/info" "libdir=/home/testsys/Work/test-yocto-ver1-1/Ver1.1/ccu-yocto-rel-Ver1.1-dx/imx-yocto-bsp/build_imx8dx-ccu/tmp/work/x86_64-linux/binutils-native/2.30-r0/recipe-sysroot-native/usr/lib" "prefix=/home/testsys/Work/test-yocto-ver1-1/Ver1.1/ccu-yocto-rel-Ver1.1-dx/imx-yocto-bsp/build_imx8dx-ccu/tmp/work/x86_64-linux/binutils-native/2.30-r0/recipe-sysroot-native/usr" "tooldir=/home/testsys/Work/test-yocto-ver1-1/Ver1.1/ccu-yocto-rel-Ver1.1-dx/imx-yocto-bsp/build_imx8dx-ccu/tmp/work/x86_64-linux/binutils-native/2.30-r0/recipe-sysroot-native/usr/x86_64-linux" "AR=ar" "AS=as " "CC=gcc " "CXX=g++ " "LD=ld " "LIBCFLAGS=-isystem/home/testsys/Work/test-yocto-ver1-1/Ver1.1/ccu-yocto-rel-Ver1.1-dx/imx-yocto-bsp/build_imx8dx-ccu/tmp/work/x86_64-linux/binutils-native/2.30-r0/recipe-sysroot-native/usr/include -O2 -pipe -pie -fpie" "NM=nm" "PICFLAG=" "RANLIB=ranlib" "DESTDIR=" DO=all multi-do # make
| make[2]: Leaving directory '/home/testsys/Work/test-yocto-ver1-1/Ver1.1/ccu-yocto-rel-Ver1.1-dx/imx-yocto-bsp/build_imx8dx-ccu/tmp/work/x86_64-linux/binutils-native/2.30-r0/git/build.x86_64-linux.x86_64-linux/zlib'
| make[2]: Entering directory '/home/testsys/Work/test-yocto-ver1-1/Ver1.1/ccu-yocto-rel-Ver1.1-dx/imx-yocto-bsp/build_imx8dx-ccu/tmp/work/x86_64-linux/binutils-native/2.30-r0/git/build.x86_64-linux.x86_64-linux/etc'
| make[2]: Nothing to be done for 'all'.
| make[2]: Leaving directory '/home/testsys/Work/test-yocto-ver1-1/Ver1.1/ccu-yocto-rel-Ver1.1-dx/imx-yocto-bsp/build_imx8dx-ccu/tmp/work/x86_64-linux/binutils-native/2.30-r0/git/build.x86_64-linux.x86_64-linux/etc'
| make[2]: Entering directory '/home/testsys/Work/test-yocto-ver1-1/Ver1.1/ccu-yocto-rel-Ver1.1-dx/imx-yocto-bsp/build_imx8dx-ccu/tmp/work/x86_64-linux/binutils-native/2.30-r0/git/build.x86_64-linux.x86_64-linux/bfd'
| Making info in doc
| make[3]: Entering directory '/home/testsys/Work/test-yocto-ver1-1/Ver1.1/ccu-yocto-rel-Ver1.1-dx/imx-yocto-bsp/build_imx8dx-ccu/tmp/work/x86_64-linux/binutils-native/2.30-r0/git/build.x86_64-linux.x86_64-linux/bfd/doc'
| make[3]: Leaving directory '/home/testsys/Work/test-yocto-ver1-1/Ver1.1/ccu-yocto-rel-Ver1.1-dx/imx-yocto-bsp/build_imx8dx-ccu/tmp/work/x86_64-linux/binutils-native/2.30-r0/git/build.x86_64-linux.x86_64-linux/bfd/doc'
| Making info in po
| make[3]: Entering directory '/home/testsys/Work/test-yocto-ver1-1/Ver1.1/ccu-yocto-rel-Ver1.1-dx/imx-yocto-bsp/build_imx8dx-ccu/tmp/work/x86_64-linux/binutils-native/2.30-r0/git/build.x86_64-linux.x86_64-linux/bfd/po'
| make[3]: Nothing to be done for 'info'.
| make[3]: Leaving directory '/home/testsys/Work/test-yocto-ver1-1/Ver1.1/ccu-yocto-rel-Ver1.1-dx/imx-yocto-bsp/build_imx8dx-ccu/tmp/work/x86_64-linux/binutils-native/2.30-r0/git/build.x86_64-linux.x86_64-linux/bfd/po'
| make[3]: Entering directory '/home/testsys/Work/test-yocto-ver1-1/Ver1.1/ccu-yocto-rel-Ver1.1-dx/imx-yocto-bsp/build_imx8dx-ccu/tmp/work/x86_64-linux/binutils-native/2.30-r0/git/build.x86_64-linux.x86_64-linux/bfd'
| make[3]: Nothing to be done for 'info-am'.
| make[3]: Leaving directory '/home/testsys/Work/test-yocto-ver1-1/Ver1.1/ccu-yocto-rel-Ver1.1-dx/imx-yocto-bsp/build_imx8dx-ccu/tmp/work/x86_64-linux/binutils-native/2.30-r0/git/build.x86_64-linux.x86_64-linux/bfd'
| make all-recursive
| make[3]: Entering directory '/home/testsys/Work/test-yocto-ver1-1/Ver1.1/ccu-yocto-rel-Ver1.1-dx/imx-yocto-bsp/build_imx8dx-ccu/tmp/work/x86_64-linux/binutils-native/2.30-r0/git/build.x86_64-linux.x86_64-linux/bfd'
| Making all in doc
| make[4]: Entering directory '/home/testsys/Work/test-yocto-ver1-1/Ver1.1/ccu-yocto-rel-Ver1.1-dx/imx-yocto-bsp/build_imx8dx-ccu/tmp/work/x86_64-linux/binutils-native/2.30-r0/git/build.x86_64-linux.x86_64-linux/bfd/doc'
| make[4]: Nothing to be done for 'all'.
| make[4]: Leaving directory '/home/testsys/Work/test-yocto-ver1-1/Ver1.1/ccu-yocto-rel-Ver1.1-dx/imx-yocto-bsp/build_imx8dx-ccu/tmp/work/x86_64-linux/binutils-native/2.30-r0/git/build.x86_64-linux.x86_64-linux/bfd/doc'
| Making all in po
| make[4]: Entering directory '/home/testsys/Work/test-yocto-ver1-1/Ver1.1/ccu-yocto-rel-Ver1.1-dx/imx-yocto-bsp/build_imx8dx-ccu/tmp/work/x86_64-linux/binutils-native/2.30-r0/git/build.x86_64-linux.x86_64-linux/bfd/po'
| make[4]: Nothing to be done for 'all'.
| make[4]: Leaving directory '/home/testsys/Work/test-yocto-ver1-1/Ver1.1/ccu-yocto-rel-Ver1.1-dx/imx-yocto-bsp/build_imx8dx-ccu/tmp/work/x86_64-linux/binutils-native/2.30-r0/git/build.x86_64-linux.x86_64-linux/bfd/po'
| make[4]: Entering directory '/home/testsys/Work/test-yocto-ver1-1/Ver1.1/ccu-yocto-rel-Ver1.1-dx/imx-yocto-bsp/build_imx8dx-ccu/tmp/work/x86_64-linux/binutils-native/2.30-r0/git/build.x86_64-linux.x86_64-linux/bfd'
| /bin/bash ./x86_64-linux-libtool --tag=CC --mode=link gcc -W -Wall -Wstrict-prototypes -Wmissing-prototypes -Wshadow -Wstack-usage=262144 -I../../bfd/../zlib -isystem/home/testsys/Work/test-yocto-ver1-1/Ver1.1/ccu-yocto-rel-Ver1.1-dx/imx-yocto-bsp/build_imx8dx-ccu/tmp/work/x86_64-linux/binutils-native/2.30-r0/recipe-sysroot-native/usr/include -O2 -pipe -pie -fpie -release `cat libtool-soversion` -static-libstdc++ -static-libgcc -L/home/testsys/Work/test-yocto-ver1-1/Ver1.1/ccu-yocto-rel-Ver1.1-dx/imx-yocto-bsp/build_imx8dx-ccu/tmp/work/x86_64-linux/binutils-native/2.30-r0/recipe-sysroot-native/usr/lib -L/home/testsys/Work/test-yocto-ver1-1/Ver1.1/ccu-yocto-rel-Ver1.1-dx/imx-yocto-bsp/build_imx8dx-ccu/tmp/work/x86_64-linux/binutils-native/2.30-r0/recipe-sysroot-native/lib -Wl,-rpath-link,/home/testsys/Work/test-yocto-ver1-1/Ver1.1/ccu-yocto-rel-Ver1.1-dx/imx-yocto-bsp/build_imx8dx-ccu/tmp/work/x86_64-linux/binutils-native/2.30-r0/recipe-sysroot-native/usr/lib -Wl,-rpath-link,/home/testsys/Work/test-yocto-ver1-1/Ver1.1/ccu-yocto-rel-Ver1.1-dx/imx-yocto-bsp/build_imx8dx-ccu/tmp/work/x86_64-linux/binutils-native/2.30-r0/recipe-sysroot-native/lib -Wl,-rpath,/home/testsys/Work/test-yocto-ver1-1/Ver1.1/ccu-yocto-rel-Ver1.1-dx/imx-yocto-bsp/build_imx8dx-ccu/tmp/work/x86_64-linux/binutils-native/2.30-r0/recipe-sysroot-native/usr/lib -Wl,-rpath,/home/testsys/Work/test-yocto-ver1-1/Ver1.1/ccu-yocto-rel-Ver1.1-dx/imx-yocto-bsp/build_imx8dx-ccu/tmp/work/x86_64-linux/binutils-native/2.30-r0/recipe-sysroot-native/lib -Wl,-O1 -o libbfd.la -rpath /home/testsys/Work/test-yocto-ver1-1/Ver1.1/ccu-yocto-rel-Ver1.1-dx/imx-yocto-bsp/build_imx8dx-ccu/tmp/work/x86_64-linux/binutils-native/2.30-r0/recipe-sysroot-native/usr/lib archive.lo archures.lo bfd.lo bfdio.lo bfdwin.lo cache.lo coff-bfd.lo compress.lo corefile.lo format.lo hash.lo init.lo libbfd.lo linker.lo merge.lo opncls.lo reloc.lo section.lo simple.lo stab-syms.lo stabs.lo syms.lo targets.lo binary.lo ihex.lo srec.lo tekhex.lo verilog.lo `cat ofiles` -ldl -L./../zlib -lz -ldl
| x86_64-linux-libtool: link: `elf64-ppc.lo' is not a valid libtool object
| Makefile:1315: recipe for target 'libbfd.la' failed
| make[4]: *** [libbfd.la] Error 1
| make[4]: Leaving directory '/home/testsys/Work/test-yocto-ver1-1/Ver1.1/ccu-yocto-rel-Ver1.1-dx/imx-yocto-bsp/build_imx8dx-ccu/tmp/work/x86_64-linux/binutils-native/2.30-r0/git/build.x86_64-linux.x86_64-linux/bfd'
| Makefile:1748: recipe for target 'all-recursive' failed
| make[3]: *** [all-recursive] Error 1
| make[3]: Leaving directory '/home/testsys/Work/test-yocto-ver1-1/Ver1.1/ccu-yocto-rel-Ver1.1-dx/imx-yocto-bsp/build_imx8dx-ccu/tmp/work/x86_64-linux/binutils-native/2.30-r0/git/build.x86_64-linux.x86_64-linux/bfd'
| Makefile:1213: recipe for target 'all' failed
| make[2]: *** [all] Error 2
| make[2]: Leaving directory '/home/testsys/Work/test-yocto-ver1-1/Ver1.1/ccu-yocto-rel-Ver1.1-dx/imx-yocto-bsp/build_imx8dx-ccu/tmp/work/x86_64-linux/binutils-native/2.30-r0/git/build.x86_64-linux.x86_64-linux/bfd'
| ERROR: oe_runmake failed
| Makefile:2691: recipe for target 'all-bfd' failed
| make[1]: *** [all-bfd] Error 2
| make[1]: Leaving directory '/home/testsys/Work/test-yocto-ver1-1/Ver1.1/ccu-yocto-rel-Ver1.1-dx/imx-yocto-bsp/build_imx8dx-ccu/tmp/work/x86_64-linux/binutils-native/2.30-r0/git/build.x86_64-linux.x86_64-linux'
| Makefile:849: recipe for target 'all' failed
| make: *** [all] Error 2
| WARNING: exit code 1 from a shell command.
| ERROR: Function failed: do_compile (log file is located at /home/testsys/Work/test-yocto-ver1-1/Ver1.1/ccu-yocto-rel-Ver1.1-dx/imx-yocto-bsp/build_imx8dx-ccu/tmp/work/x86_64-linux/binutils-native/2.30-r0/temp/log.do_compile.17545)
ERROR: Task (virtual:native:/home/testsys/Work/test-yocto-ver1-1/Ver1.1/ccu-yocto-rel-Ver1.1-dx/imx-yocto-bsp/sources/poky/meta/recipes-devtools/binutils/binutils_2.30.bb:do_compile) failed with exit code '1'
ERROR: libpciaccess-0.14-r0 do_populate_lic: QA Issue: libpciaccess: The LIC_FILES_CHKSUM does not match for file://COPYING;md5=277aada5222b9a22fbf3471ff3687068
libpciaccess: The new md5 checksum is d41d8cd98f00b204e9800998ecf8427e
libpciaccess: Here is the selected license text:
vvvvvvvvvvvvvvvvvvvvvvvvvvvvvvvvvvvvvvvvvvvvvvvvvvvvvvvvvvvvvvvvvvvvvv
^^^^^^^^^^^^^^^^^^^^^^^^^^^^^^^^^^^^^^^^^^^^^^^^^^^^^^^^^^^^^^^^^^^^^^
libpciaccess: Check if the license information has changed in /home/testsys/Work/test-yocto-ver1-1/Ver1.1/ccu-yocto-rel-Ver1.1-dx/imx-yocto-bsp/build_imx8dx-ccu/tmp/work/aarch64-poky-linux/libpciaccess/0.14-r0/libpciaccess-0.14/COPYING to verify that the LICENSE value "MIT & MIT-style" remains valid [license-checksum]
ERROR: libpciaccess-0.14-r0 do_populate_lic: Fatal QA errors found, failing task.
ERROR: libpciaccess-0.14-r0 do_populate_lic: Function failed: populate_lic_qa_checksum
ERROR: Logfile of failure stored in: /home/testsys/Work/test-yocto-ver1-1/Ver1.1/ccu-yocto-rel-Ver1.1-dx/imx-yocto-bsp/build_imx8dx-ccu/tmp/work/aarch64-poky-linux/libpciaccess/0.14-r0/temp/log.do_populate_lic.17746
ERROR: Task (/home/testsys/Work/test-yocto-ver1-1/Ver1.1/ccu-yocto-rel-Ver1.1-dx/imx-yocto-bsp/sources/poky/meta/recipes-graphics/xorg-lib/libpciaccess_0.14.bb:do_populate_lic) failed with exit code '1'
ERROR: libpthread-stubs-0.4-r0 do_populate_lic: QA Issue: libpthread-stubs: The LIC_FILES_CHKSUM does not match for file://COPYING;md5=6edc1fea03d959f0c2d743fe5ca746ad
libpthread-stubs: The new md5 checksum is d41d8cd98f00b204e9800998ecf8427e
libpthread-stubs: Here is the selected license text:
vvvvvvvvvvvvvvvvvvvvvvvvvvvvvvvvvvvvvvvvvvvvvvvvvvvvvvvvvvvvvvvvvvvvvv
^^^^^^^^^^^^^^^^^^^^^^^^^^^^^^^^^^^^^^^^^^^^^^^^^^^^^^^^^^^^^^^^^^^^^^
libpthread-stubs: Check if the license information has changed in /home/testsys/Work/test-yocto-ver1-1/Ver1.1/ccu-yocto-rel-Ver1.1-dx/imx-yocto-bsp/build_imx8dx-ccu/tmp/work/aarch64-poky-linux/libpthread-stubs/0.4-r0/libpthread-stubs-0.4/COPYING to verify that the LICENSE value "MIT" remains valid [license-checksum]
ERROR: libpthread-stubs-0.4-r0 do_populate_lic: Fatal QA errors found, failing task.
ERROR: libpthread-stubs-0.4-r0 do_populate_lic: Function failed: populate_lic_qa_checksum
ERROR: Logfile of failure stored in: /home/testsys/Work/test-yocto-ver1-1/Ver1.1/ccu-yocto-rel-Ver1.1-dx/imx-yocto-bsp/build_imx8dx-ccu/tmp/work/aarch64-poky-linux/libpthread-stubs/0.4-r0/temp/log.do_populate_lic.17747
ERROR: Task (/home/testsys/Work/test-yocto-ver1-1/Ver1.1/ccu-yocto-rel-Ver1.1-dx/imx-yocto-bsp/sources/poky/meta/recipes-graphics/xorg-lib/libpthread-stubs_0.4.bb:do_populate_lic) failed with exit code '1'
NOTE: Tasks Summary: Attempted 4559 tasks of which 4554 didn't need to be rerun and 5 failed.

Summary: 5 tasks failed:

Outcomes