AnsweredAssumed Answered

VisionSDK_S32V2_RTM_1_2_0_HF1/s32v234_sdk build failed

Question asked by michael wu on Nov 8, 2018
Latest reply on Nov 9, 2018 by michael wu

Hello Sir,

we build below, and fail following, could you help us build success?

Thanks

Michael wu

VisionSDK_S32V2_RTM_1_2_0_HF1/s32v234_sdk/demos/isp/isp_ov10640_default/build-v234ce-gnu-linux-d$ make clean;make allsub

......

 

./kmem.c:2:21: warning: backslash-newline at end of file
 char kmem_srec[] = {\
                      
./kmem.c:3:1: warning: missing terminating " character
 "\
 ^
./kmem.c:3:1: error: missing terminating " character
../../../../../isp/graphs/ov10640_default/src/ov10640_default.c:40:1: error: expected expression before ‘static’
 static SEQ_FdmaCfg_t FastDMA;
 ^~~~~~
../../../../../build/nbuild/helpers.mk:156: recipe for target 'ov10640_default-c.o' failed
make[2]: *** [ov10640_default-c.o] Error 1
make[2]: Leaving directory '/home/michaelwu/VisionSDK_S32V2_RTM_1_2_0_HF1/s32v234_sdk/isp/graphs/ov10640_default/static_ov10640_default/build-v234ce-gnu-linux-d'
../../../../../build/nbuild/sub.mk:73: recipe for target 'allsub' failed
make[1]: *** [allsub] Terminated
make[1]: Leaving directory '/home/michaelwu/VisionSDK_S32V2_RTM_1_2_0_HF1/s32v234_sdk/isp/graphs/ov10640_default/static_ov10640_default/build-v234ce-gnu-linux-d'
../../../../build/nbuild/sub.mk:73: recipe for target 'allsub' failed
make: *** [allsub] Terminated

Outcomes