AnsweredAssumed Answered

ERROR: oe_runmake failed

Question asked by yuelin liu on Nov 6, 2018
Latest reply on Nov 8, 2018 by Bio_TICFSL

before build I'm cleanall abort it. But ……

"If you think the build and/or download caches are corrupt and want bitbake to forget everything it thinks it knows about a component so it can be rebuilt from scratch:

 

bitbake <component> -c cleanall -f"

 

Someone can help me ~

 

 

DEBUG: Executing shell function do_compile
NOTE: make -j 40 depend
ERROR: oe_runmake failed
make[1]: Entering directory `/home/liuyuelin/imx-yocto-bsp/build-x11/tmp/work/x86_64-linux/openjade-native/1.3.2-r5/openjade-1.3.2'
make[2]: Entering directory `/home/liuyuelin/imx-yocto-bsp/build-x11/tmp/work/x86_64-linux/openjade-native/1.3.2-r5/openjade-1.3.2/grove'
g++  -MM -isystem/home/liuyuelin/imx-yocto-bsp/build-x11/tmp/sysroots/x86_64-linux/usr/include -O2 -pipe -D_GLIBCXX_USE_CXX11_ABI=0 -fno-tree-dse -I. -I./../include -I/home/liuyuelin/imx-yocto-bsp/build-x11/tmp/sysroots/x86_64-linux/usr/include/OpenSP -I/home/liuyuelin/imx-yocto-bsp/build-x11/tmp/sysroots/x86_64-linux/usr/include/OpenSP/..   -DPACKAGE_NAME=\"openjade\" -DPACKAGE_TARNAME=\"openjade\" -DPACKAGE_VERSION=\"1.3.2\" -DPACKAGE_STRING=\"openjade\ 1.3.2\" -DPACKAGE_BUGREPORT=\"\" -DPACKAGE_URL=\"\" -DPACKAGE=\"openjade\" -DVERSION=\"1.3.2\" -DSP_DEFINE_TEMPLATES=1 -DSTDC_HEADERS=1 -DHAVE_SYS_TYPES_H=1 -DHAVE_SYS_STAT_H=1 -DHAVE_STDLIB_H=1 -DHAVE_STRING_H=1 -DHAVE_MEMORY_H=1 -DHAVE_STRINGS_H=1 -DHAVE_INTTYPES_H=1 -DHAVE_STDINT_H=1 -DHAVE_UNISTD_H=1 -DHAVE_LIMITS_H=1 -DHAVE_STRUCT_STAT_ST_BLKSIZE=1 -DHAVE_ST_BLKSIZE=1 -DSIZEOF_SIZE_T=8 -DSIZEOF_UNSIGNED_INT=4 -DSP_HAVE_LOCALE=1 -DSP_HAVE_WCHAR=1 -DSP_HAVE_GETTEXT=1 -DSP_HAVE_BOOL=1 -DSP_ANSI_CLASS_INST=1 -DJADE_MIF=1 -DJADE_HTML=1 -DSP_MULTI_BYTE=1 -DHAVE_DLFCN_H=1 -DLT_OBJDIR=\".libs/\" -DDEFAULT_SCHEME_BUILTINS=\"/home/liuyuelin/imx-yocto-bsp/build-x11/tmp/sysroots/x86_64-linux/usr/share/sgml/openjade-1.3.2/builtins.dsl\" -MM Node.cxx LocNode.cxx \
   | sed -e 's; \([^/ ][^/ ]*\)/; $(srcdir)/\1/;g' >depend.temp1
cat depend.temp1 > depend.temp
cat depend.temp1 | sed -e 's/\.o:/.lo:/g' >> depend.temp
rm depend.temp1
mv depend.temp Makefile.dep
make[2]: Leaving directory `/home/liuyuelin/imx-yocto-bsp/build-x11/tmp/work/x86_64-linux/openjade-native/1.3.2-r5/openjade-1.3.2/grove'
make[2]: Entering directory `/home/liuyuelin/imx-yocto-bsp/build-x11/tmp/work/x86_64-linux/openjade-native/1.3.2-r5/openjade-1.3.2/spgrove'
g++  -MM -isystem/home/liuyuelin/imx-yocto-bsp/build-x11/tmp/sysroots/x86_64-linux/usr/include -O2 -pipe -D_GLIBCXX_USE_CXX11_ABI=0 -fno-tree-dse -I. -I./../include -I/home/liuyuelin/imx-yocto-bsp/build-x11/tmp/sysroots/x86_64-linux/usr/include/OpenSP -I/home/liuyuelin/imx-yocto-bsp/build-x11/tmp/sysroots/x86_64-linux/usr/include/OpenSP/.. -I./../grove  -DPACKAGE_NAME=\"openjade\" -DPACKAGE_TARNAME=\"openjade\" -DPACKAGE_VERSION=\"1.3.2\" -DPACKAGE_STRING=\"openjade\ 1.3.2\" -DPACKAGE_BUGREPORT=\"\" -DPACKAGE_URL=\"\" -DPACKAGE=\"openjade\" -DVERSION=\"1.3.2\" -DSP_DEFINE_TEMPLATES=1 -DSTDC_HEADERS=1 -DHAVE_SYS_TYPES_H=1 -DHAVE_SYS_STAT_H=1 -DHAVE_STDLIB_H=1 -DHAVE_STRING_H=1 -DHAVE_MEMORY_H=1 -DHAVE_STRINGS_H=1 -DHAVE_INTTYPES_H=1 -DHAVE_STDINT_H=1 -DHAVE_UNISTD_H=1 -DHAVE_LIMITS_H=1 -DHAVE_STRUCT_STAT_ST_BLKSIZE=1 -DHAVE_ST_BLKSIZE=1 -DSIZEOF_SIZE_T=8 -DSIZEOF_UNSIGNED_INT=4 -DSP_HAVE_LOCALE=1 -DSP_HAVE_WCHAR=1 -DSP_HAVE_GETTEXT=1 -DSP_HAVE_BOOL=1 -DSP_ANSI_CLASS_INST=1 -DJADE_MIF=1 -DJADE_HTML=1 -DSP_MULTI_BYTE=1 -DHAVE_DLFCN_H=1 -DLT_OBJDIR=\".libs/\" -DDEFAULT_SCHEME_BUILTINS=\"/home/liuyuelin/imx-yocto-bsp/build-x11/tmp/sysroots/x86_64-linux/usr/share/sgml/openjade-1.3.2/builtins.dsl\" -MM GroveApp.cxx GroveBuilder.cxx SdNode.cxx \
   | sed -e 's; \([^/ ][^/ ]*\)/; $(srcdir)/\1/;g' >depend.temp1
cat depend.temp1 > depend.temp
cat depend.temp1 | sed -e 's/\.o:/.lo:/g' >> depend.temp
rm depend.temp1
mv depend.temp Makefile.dep
make[2]: Leaving directory `/home/liuyuelin/imx-yocto-bsp/build-x11/tmp/work/x86_64-linux/openjade-native/1.3.2-r5/openjade-1.3.2/spgrove'
make[2]: Entering directory `/home/liuyuelin/imx-yocto-bsp/build-x11/tmp/work/x86_64-linux/openjade-native/1.3.2-r5/openjade-1.3.2/style'
echo 'LT_OBJS='`echo LangObj.o Collector.o DssslApp.o InterpreterMessages.o DssslSpecEventHandler.o ELObj.o ELObjMessageArg.o Expression.o FOTBuilder.o FlowObj.o InheritedC.o Insn.o Interpreter.o NumberCache.o ProcessContext.o ProcessingMode.o SchemeParser.o Style.o StyleEngine.o primitive.o GroveManager.o Pattern.o MacroFlowObj.o style_inst.o MessageModule.o |sed 's/\.o/.lo/g'` >Makefile.lt
make[2]: Leaving directory `/home/liuyuelin/imx-yocto-bsp/build-x11/tmp/work/x86_64-linux/openjade-native/1.3.2-r5/openjade-1.3.2/style'
make[2]: Entering directory `/home/liuyuelin/imx-yocto-bsp/build-x11/tmp/work/x86_64-linux/openjade-native/1.3.2-r5/openjade-1.3.2/style'
rm -f style_inst.cxx
rm -f FlowObj_inst.cxx
/usr/bin/perl ./../instmac.pl style_inst.m4 >style_inst.cxx
/usr/bin/perl ./../instmac.pl FlowObj_inst.m4 >FlowObj_inst.cxx
rm -f primitive_inst.cxx
chmod -w style_inst.cxx
chmod: style_inst.cxx: new permissions are r--rw-r--, not r--r--r--
chmod -w FlowObj_inst.cxx
chmod: FlowObj_inst.cxx: new permissions are r--rw-r--, not r--r--r--
/usr/bin/perl ./../instmac.pl primitive_inst.m4 >primitive_inst.cxx
make[2]: *** [style_inst.cxx] Error 1
make[2]: *** Waiting for unfinished jobs....
make[2]: *** [FlowObj_inst.cxx] Error 1
chmod -w primitive_inst.cxx
chmod: primitive_inst.cxx: new permissions are r--rw-r--, not r--r--r--
make[2]: *** [primitive_inst.cxx] Error 1
make[2]: Leaving directory `/home/liuyuelin/imx-yocto-bsp/build-x11/tmp/work/x86_64-linux/openjade-native/1.3.2-r5/openjade-1.3.2/style'
make[1]: *** [style] Error 2
make[1]: Leaving directory `/home/liuyuelin/imx-yocto-bsp/build-x11/tmp/work/x86_64-linux/openjade-native/1.3.2-r5/openjade-1.3.2'
make: *** [depend] Error 2
WARNING: exit code 1 from a shell command.
ERROR: Function failed: do_compile (log file is located at /home/liuyuelin/imx-yocto-bsp/build-x11/tmp/work/x86_64-linux/openjade-native/1.3.2-r5/temp/log.do_compile.122032)

Attachments

Outcomes