AnsweredAssumed Answered

Docbook utils build issue with QorIQ Linux SDK 2.0

Question asked by sarayu k sivanandam on Aug 18, 2018
Latest reply on Sep 8, 2018 by Yiping Wang

Hi all ,

I am trying to build the QorIQ Linux SDK 2.0 on my ubuntu setup and i am seeing some strange issue with the docbook-utils . Can you please help me with the same.

Log data follows:
| DEBUG: Executing shell function do_compile
| NOTE: make -j 4
| Making all in backends
| make[1]: Entering directory '/home/sarayu/code/yocto_arm/QorIQ-SDK-V2.0-20160527-yocto/build_ls1043ardb/tmp/work/x86_64-linux/docbook-utils-native/0.6.14-r3/build/backends'
| make[1]: Nothing to be done for 'all'.
| make[1]: Leaving directory '/home/sarayu/code/yocto_arm/QorIQ-SDK-V2.0-20160527-yocto/build_ls1043ardb/tmp/work/x86_64-linux/docbook-utils-native/0.6.14-r3/build/backends'
| Making all in bin
| make[1]: Entering directory '/home/sarayu/code/yocto_arm/QorIQ-SDK-V2.0-20160527-yocto/build_ls1043ardb/tmp/work/x86_64-linux/docbook-utils-native/0.6.14-r3/build/bin'
| make[1]: Nothing to be done for 'all'.
| make[1]: Leaving directory '/home/sarayu/code/yocto_arm/QorIQ-SDK-V2.0-20160527-yocto/build_ls1043ardb/tmp/work/x86_64-linux/docbook-utils-native/0.6.14-r3/build/bin'
| Making all in doc
| make[1]: Entering directory '/home/sarayu/code/yocto_arm/QorIQ-SDK-V2.0-20160527-yocto/build_ls1043ardb/tmp/work/x86_64-linux/docbook-utils-native/0.6.14-r3/build/doc'
| Making all in refentry
| make[2]: Entering directory '/home/sarayu/code/yocto_arm/QorIQ-SDK-V2.0-20160527-yocto/build_ls1043ardb/tmp/work/x86_64-linux/docbook-utils-native/0.6.14-r3/build/doc/refentry'
| make[2]: Nothing to be done for 'all'.
| make[2]: Leaving directory '/home/sarayu/code/yocto_arm/QorIQ-SDK-V2.0-20160527-yocto/build_ls1043ardb/tmp/work/x86_64-linux/docbook-utils-native/0.6.14-r3/build/doc/refentry'
| Making all in man
| make[2]: Entering directory '/home/sarayu/code/yocto_arm/QorIQ-SDK-V2.0-20160527-yocto/build_ls1043ardb/tmp/work/x86_64-linux/docbook-utils-native/0.6.14-r3/build/doc/man'
| make[2]: Nothing to be done for 'all'.
| make[2]: Leaving directory '/home/sarayu/code/yocto_arm/QorIQ-SDK-V2.0-20160527-yocto/build_ls1043ardb/tmp/work/x86_64-linux/docbook-utils-native/0.6.14-r3/build/doc/man'
| Making all in HTML
| make[2]: Entering directory '/home/sarayu/code/yocto_arm/QorIQ-SDK-V2.0-20160527-yocto/build_ls1043ardb/tmp/work/x86_64-linux/docbook-utils-native/0.6.14-r3/build/doc/HTML'
| SGML_CATALOG_FILES=/home/sarayu/code/yocto_arm/QorIQ-SDK-V2.0-20160527-yocto/build_ls1043ardb/tmp/sysroots/x86_64-linux/etc/sgml/catalog \
| SGML_SEARCH_PATH=/home/sarayu/code/yocto_arm/QorIQ-SDK-V2.0-20160527-yocto/build_ls1043ardb/tmp/work/x86_64-linux/docbook-utils-native/0.6.14-r3/docbook-utils-0.6.14:/home/sarayu/code/yocto_arm/QorIQ-SDK-V2.0-20160527-yocto/build_ls1043ardb/tmp/work/x86_64-linux/docbook-utils-native/0.6.14-r3/docbook-utils-0.6.14/doc:.. \
|     jade -t sgml -i html -d /home/sarayu/code/yocto_arm/QorIQ-SDK-V2.0-20160527-yocto/build_ls1043ardb/tmp/work/x86_64-linux/docbook-utils-native/0.6.14-r3/docbook-utils-0.6.14/docbook-utils.dsl\#html \
|         -V '%use-id-as-filename%' /home/sarayu/code/yocto_arm/QorIQ-SDK-V2.0-20160527-yocto/build_ls1043ardb/tmp/work/x86_64-linux/docbook-utils-native/0.6.14-r3/docbook-utils-0.6.14/doc/docbook-utils.sgml
| SGML_CATALOG_FILES=/home/sarayu/code/yocto_arm/QorIQ-SDK-V2.0-20160527-yocto/build_ls1043ardb/tmp/sysroots/x86_64-linux/etc/sgml/catalog \
| SGML_SEARCH_PATH=/home/sarayu/code/yocto_arm/QorIQ-SDK-V2.0-20160527-yocto/build_ls1043ardb/tmp/work/x86_64-linux/docbook-utils-native/0.6.14-r3/docbook-utils-0.6.14:/home/sarayu/code/yocto_arm/QorIQ-SDK-V2.0-20160527-yocto/build_ls1043ardb/tmp/work/x86_64-linux/docbook-utils-native/0.6.14-r3/docbook-utils-0.6.14/doc:.. \
|     jade -t sgml -i html -d /home/sarayu/code/yocto_arm/QorIQ-SDK-V2.0-20160527-yocto/build_ls1043ardb/tmp/work/x86_64-linux/docbook-utils-native/0.6.14-r3/docbook-utils-0.6.14/docbook-utils.dsl\#html \
|         -V '%use-id-as-filename%' /home/sarayu/code/yocto_arm/QorIQ-SDK-V2.0-20160527-yocto/build_ls1043ardb/tmp/work/x86_64-linux/docbook-utils-native/0.6.14-r3/docbook-utils-0.6.14/doc/docbook-utils.sgml
| SGML_CATALOG_FILES=/home/sarayu/code/yocto_arm/QorIQ-SDK-V2.0-20160527-yocto/build_ls1043ardb/tmp/sysroots/x86_64-linux/etc/sgml/catalog \
| SGML_SEARCH_PATH=/home/sarayu/code/yocto_arm/QorIQ-SDK-V2.0-20160527-yocto/build_ls1043ardb/tmp/work/x86_64-linux/docbook-utils-native/0.6.14-r3/docbook-utils-0.6.14:/home/sarayu/code/yocto_arm/QorIQ-SDK-V2.0-20160527-yocto/build_ls1043ardb/tmp/work/x86_64-linux/docbook-utils-native/0.6.14-r3/docbook-utils-0.6.14/doc:.. \
|     jade -t sgml -i html -d /home/sarayu/code/yocto_arm/QorIQ-SDK-V2.0-20160527-yocto/build_ls1043ardb/tmp/work/x86_64-linux/docbook-utils-native/0.6.14-r3/docbook-utils-0.6.14/docbook-utils.dsl\#html \
|         -V '%use-id-as-filename%' /home/sarayu/code/yocto_arm/QorIQ-SDK-V2.0-20160527-yocto/build_ls1043ardb/tmp/work/x86_64-linux/docbook-utils-native/0.6.14-r3/docbook-utils-0.6.14/doc/docbook-utils.sgml
| SGML_CATALOG_FILES=/home/sarayu/code/yocto_arm/QorIQ-SDK-V2.0-20160527-yocto/build_ls1043ardb/tmp/sysroots/x86_64-linux/etc/sgml/catalog \
| SGML_SEARCH_PATH=/home/sarayu/code/yocto_arm/QorIQ-SDK-V2.0-20160527-yocto/build_ls1043ardb/tmp/work/x86_64-linux/docbook-utils-native/0.6.14-r3/docbook-utils-0.6.14:/home/sarayu/code/yocto_arm/QorIQ-SDK-V2.0-20160527-yocto/build_ls1043ardb/tmp/work/x86_64-linux/docbook-utils-native/0.6.14-r3/docbook-utils-0.6.14/doc:.. \
|     jade -t sgml -i html -d /home/sarayu/code/yocto_arm/QorIQ-SDK-V2.0-20160527-yocto/build_ls1043ardb/tmp/work/x86_64-linux/docbook-utils-native/0.6.14-r3/docbook-utils-0.6.14/docbook-utils.dsl\#html \
|         -V '%use-id-as-filename%' /home/sarayu/code/yocto_arm/QorIQ-SDK-V2.0-20160527-yocto/build_ls1043ardb/tmp/work/x86_64-linux/docbook-utils-native/0.6.14-r3/docbook-utils-0.6.14/doc/docbook-utils.sgml
| Makefile:458: recipe for target 'docbook2man.html' failed
| make[2]: *** [docbook2man.html] Segmentation fault (core dumped)
| make[2]: *** Waiting for unfinished jobs....
| Makefile:458: recipe for target 'api.html' failed
| make[2]: *** [api.html] Segmentation fault (core dumped)
| Makefile:458: recipe for target 'docbook2texi.html' failed
| make[2]: *** [docbook2texi.html] Segmentation fault (core dumped)
| Makefile:458: recipe for target 'backend-spec.html' failed
| make[2]: *** [backend-spec.html] Segmentation fault (core dumped)
| make[2]: Leaving directory '/home/sarayu/code/yocto_arm/QorIQ-SDK-V2.0-20160527-yocto/build_ls1043ardb/tmp/work/x86_64-linux/docbook-utils-native/0.6.14-r3/build/doc/HTML'
| Makefile:298: recipe for target 'all-recursive' failed
| make[1]: *** [all-recursive] Error 1
| make[1]: Leaving directory '/home/sarayu/code/yocto_arm/QorIQ-SDK-V2.0-20160527-yocto/build_ls1043ardb/tmp/work/x86_64-linux/docbook-utils-native/0.6.14-r3/build/doc'
| Makefile:379: recipe for target 'all-recursive' failed
| make: *** [all-recursive] Error 1
| WARNING: exit code 1 from a shell command.
| ERROR: oe_runmake failed
| ERROR: Function failed: do_compile (log file is located at /home/sarayu/code/yocto_arm/QorIQ-SDK-V2.0-20160527-yocto/build_ls1043ardb/tmp/work/x86_64-linux/docbook-utils-native/0.6.14-r3/temp/log.do_compile.20775)
ERROR: Task 6 (/home/sarayu/code/yocto_arm/QorIQ-SDK-V2.0-20160527-yocto/sources/poky/meta/recipes-devtools/docbook-utils/docbook-utils-native_0.6.14.bb, do_compile) failed with exit code '1'

 

Outcomes