AnsweredAssumed Answered

GTSMediaTestCases/ExoPlayer Test Failures

Question asked by Benjamin Rood on Mar 6, 2018

Hello,

 

We are currently developing an Android N7.1.1 tablet based on the SABRESD i.MX6Q reference design.  We are running though the Android GTS test packages and are getting a number of media codec failures (listed below).

 

It appears as if the codec thinks the streams are corrupt, since it fails decoding the video (looks like it runs out of space in the timestamp queue AND/OR detects a dead loop):

 

03-06 15:21:52.901   244  2717 I OMXPlayer: LEVEL: 1 FUNCTION: ProcessInputBuffer LINE: 628
03-06 15:21:52.901   244  2717 I OMXPlayer: init operation timeout, clip is corrupted !
03-06 15:21:52.901   244  2717 I OMXPlayer: LEVEL: 1 FUNCTION: ProcessInputBuffer LINE: 628
03-06 15:21:52.901   244  2717 I OMXPlayer: init operation timeout, clip is corrupted !
03-06 15:21:52.901  2585  2716 E ACodec  : [OMX.Freescale.std.video_decoder.avc.v3.hw-based] ERROR(0x8000100b)
03-06 15:21:52.901  2585  2716 E ACodec  : signalError(omxError 0x8000100b, internalError -2147483648)
03-06 15:21:52.901  2585  2716 E ACodec  : [OMX.Freescale.std.video_decoder.avc.v3.hw-based] ERROR(0x8000100b)

 

Anyone else experiencing these issues?  Any help from NXP??

 

Begin GTS failures:

 

com.google.android.media.gts.MediaPlayerTest#testM2PS_H264_AAC_480P_WV_MULTI_480P    
fail
    
junit.framework.AssertionFailedError: Failed to validate constraints for http://redirector.gvt1.com/videoplayback?id=f2c1d5442f2b6f0f&itag=114&source=youtube&ip=0.0.0.0&ipbits=0&expire=19000000000&sparams=ip,ipbits,expire&signature=7AB18D7EB47A48B7116A98D7215793869C5E855A.9204FDD73313C5339DDC65E0DD790EB54426FBF4&key=ik0&file=file.wvm
at junit.framework.Assert.fail(Assert.java:50)
at junit.framework.Assert.assertTrue(Assert.java:20)
at com.google.android.media.gts.MediaPlayerTestBase.playWidevineVideo(MediaPlayerTestBase.java:197)
at com.google.android.media.gts.MediaPlayerTestBase.playWidevineVideoStream(MediaPlayerTestBase.java:154)
at com.google.android.media.gts.MediaPlayerTest.stream(MediaPlayerTest.java:122)
at com.google.android.media.gts.MediaPlayerTest.testM2PS_H264_AAC_480P_WV_MULTI_480P(MediaPlayerTest.java:81)
at java.lang.reflect.Method.invoke(Native Method)
at android.test.InstrumentationTestCase.runMethod(InstrumentationTestCase.java:220)
at android.test.InstrumentationTestCase.runTest(InstrumentationTestCase.java:205)
at android.test.ActivityInstrumentationTestCase2.runTest(ActivityInstrumentationTestCase2.java:192)
at junit.framework.TestCase.runBare(TestCase.java:134)
at junit.framework.TestResult$1.protect(TestResult.java:115)
at android.support.test.internal.runner.junit3.AndroidTestResult.runProtected(AndroidTestResult.java:77)
at junit.framework.TestResult.run(TestResult.java:118)
at android.support.test.internal.runner.junit3.AndroidTestResult.run(AndroidTestResult.java:55)
at junit.framework.TestCase.run(TestCase.java:124)
at android.support.test.internal.runner.junit3.NonLeakyTestSuite$NonLeakyTest.run(NonLeakyTestSuite.java:63)
at android.support.test.internal.runner.junit3.AndroidTestSuite$2.run(AndroidTestSuite.java:111)
at java.util.concurrent.Executors$RunnableAdapter.call(Executors.java:428)
at java.util.concurrent.FutureTask.run(FutureTask.java:237)
at java.util.concurrent.ThreadPoolExecutor.runWorker(ThreadPoolExecutor.java:1133)
at java.util.concurrent.ThreadPoolExecutor$Worker.run(ThreadPoolExecutor.java:607)
at java.lang.Thread.run(Thread.java:761)
com.google.android.media.gts.MediaPlayerTest#testM2PS_H264_AAC_HIGH_WV_480P    
fail
    
junit.framework.AssertionFailedError: Failed to validate constraints for http://redirector.gvt1.com/videoplayback?id=f2c1d5442f2b6f0f&itag=62&source=youtube&ip=0.0.0.0&ipbits=0&expire=19000000000&sparams=ip,ipbits,expire&signature=294FB554AF35950750C525582172FB414923F3FC.27B1218DA753E3F6ACD8C017353441736342700D&key=ik0&file=file.wvm
at junit.framework.Assert.fail(Assert.java:50)
at junit.framework.Assert.assertTrue(Assert.java:20)
at com.google.android.media.gts.MediaPlayerTestBase.playWidevineVideo(MediaPlayerTestBase.java:197)
at com.google.android.media.gts.MediaPlayerTestBase.playWidevineVideoStream(MediaPlayerTestBase.java:154)
at com.google.android.media.gts.MediaPlayerTest.stream(MediaPlayerTest.java:122)
at com.google.android.media.gts.MediaPlayerTest.testM2PS_H264_AAC_HIGH_WV_480P(MediaPlayerTest.java:65)
at java.lang.reflect.Method.invoke(Native Method)
at android.test.InstrumentationTestCase.runMethod(InstrumentationTestCase.java:220)
at android.test.InstrumentationTestCase.runTest(InstrumentationTestCase.java:205)
at android.test.ActivityInstrumentationTestCase2.runTest(ActivityInstrumentationTestCase2.java:192)
at junit.framework.TestCase.runBare(TestCase.java:134)
at junit.framework.TestResult$1.protect(TestResult.java:115)
at android.support.test.internal.runner.junit3.AndroidTestResult.runProtected(AndroidTestResult.java:77)
at junit.framework.TestResult.run(TestResult.java:118)
at android.support.test.internal.runner.junit3.AndroidTestResult.run(AndroidTestResult.java:55)
at junit.framework.TestCase.run(TestCase.java:124)
at android.support.test.internal.runner.junit3.NonLeakyTestSuite$NonLeakyTest.run(NonLeakyTestSuite.java:63)
at android.support.test.internal.runner.junit3.AndroidTestSuite$2.run(AndroidTestSuite.java:111)
at java.util.concurrent.Executors$RunnableAdapter.call(Executors.java:428)
at java.util.concurrent.FutureTask.run(FutureTask.java:237)
at java.util.concurrent.ThreadPoolExecutor.runWorker(ThreadPoolExecutor.java:1133)
at java.util.concurrent.ThreadPoolExecutor$Worker.run(ThreadPoolExecutor.java:607)
at java.lang.Thread.run(Thread.java:761)
com.google.android.media.gts.MediaPlayerTest#testM2PS_H264_AAC_HIGH_WV_480P_DOWNLOADED    
fail
    
junit.framework.AssertionFailedError: Failed to validate constraints for http://redirector.gvt1.com/videoplayback?id=a4faa588fcc76327&itag=62&source=youtube&ip=0.0.0.0&ipbits=0&expire=19000000000&sparams=ip,ipbits,expire&signature=32B527C217D93C8DEF079A3537B87B6B8BD9606B.11F392CF88025A759C561D6C7345251B4EEB3937&key=ik0&file=file.wvm
at junit.framework.Assert.fail(Assert.java:50)
at junit.framework.Assert.assertTrue(Assert.java:20)
at com.google.android.media.gts.MediaPlayerTestBase.playWidevineVideo(MediaPlayerTestBase.java:197)
at com.google.android.media.gts.MediaPlayerTestBase.playWidevineVideoDownload(MediaPlayerTestBase.java:170)
at com.google.android.media.gts.MediaPlayerTest.download(MediaPlayerTest.java:128)
at com.google.android.media.gts.MediaPlayerTest.testM2PS_H264_AAC_HIGH_WV_480P_DOWNLOADED(MediaPlayerTest.java:93)
at java.lang.reflect.Method.invoke(Native Method)
at android.test.InstrumentationTestCase.runMethod(InstrumentationTestCase.java:220)
at android.test.InstrumentationTestCase.runTest(InstrumentationTestCase.java:205)
at android.test.ActivityInstrumentationTestCase2.runTest(ActivityInstrumentationTestCase2.java:192)
at junit.framework.TestCase.runBare(TestCase.java:134)
at junit.framework.TestResult$1.protect(TestResult.java:115)
at android.support.test.internal.runner.junit3.AndroidTestResult.runProtected(AndroidTestResult.java:77)
at junit.framework.TestResult.run(TestResult.java:118)
at android.support.test.internal.runner.junit3.AndroidTestResult.run(AndroidTestResult.java:55)
at junit.framework.TestCase.run(TestCase.java:124)
at android.support.test.internal.runner.junit3.NonLeakyTestSuite$NonLeakyTest.run(NonLeakyTestSuite.java:63)
at android.support.test.internal.runner.junit3.AndroidTestSuite$2.run(AndroidTestSuite.java:111)
at java.util.concurrent.Executors$RunnableAdapter.call(Executors.java:428)
at java.util.concurrent.FutureTask.run(FutureTask.java:237)
at java.util.concurrent.ThreadPoolExecutor.runWorker(ThreadPoolExecutor.java:1133)
at java.util.concurrent.ThreadPoolExecutor$Worker.run(ThreadPoolExecutor.java:607)
at java.lang.Thread.run(Thread.java:761)
com.google.android.media.gts.MediaPlayerTest#testM2PS_H264_AAC_MED_WV_360P    
fail
    
junit.framework.AssertionFailedError: Failed to validate constraints for http://redirector.gvt1.com/videoplayback?id=f2c1d5442f2b6f0f&itag=61&source=youtube&ip=0.0.0.0&ipbits=0&expire=19000000000&sparams=ip,ipbits,expire&signature=ADE6264C85D1C8C5320CC3E7B741B7252D89C553.A39902334AB649186184DC110296CE752894C431&key=ik0&file=file.wvm
at junit.framework.Assert.fail(Assert.java:50)
at junit.framework.Assert.assertTrue(Assert.java:20)
at com.google.android.media.gts.MediaPlayerTestBase.playWidevineVideo(MediaPlayerTestBase.java:197)
at com.google.android.media.gts.MediaPlayerTestBase.playWidevineVideoStream(MediaPlayerTestBase.java:154)
at com.google.android.media.gts.MediaPlayerTest.stream(MediaPlayerTest.java:122)
at com.google.android.media.gts.MediaPlayerTest.testM2PS_H264_AAC_MED_WV_360P(MediaPlayerTest.java:61)
at java.lang.reflect.Method.invoke(Native Method)
at android.test.InstrumentationTestCase.runMethod(InstrumentationTestCase.java:220)
at android.test.InstrumentationTestCase.runTest(InstrumentationTestCase.java:205)
at android.test.ActivityInstrumentationTestCase2.runTest(ActivityInstrumentationTestCase2.java:192)
at junit.framework.TestCase.runBare(TestCase.java:134)
at junit.framework.TestResult$1.protect(TestResult.java:115)
at android.support.test.internal.runner.junit3.AndroidTestResult.runProtected(AndroidTestResult.java:77)
at junit.framework.TestResult.run(TestResult.java:118)
at android.support.test.internal.runner.junit3.AndroidTestResult.run(AndroidTestResult.java:55)
at junit.framework.TestCase.run(TestCase.java:124)
at android.support.test.internal.runner.junit3.NonLeakyTestSuite$NonLeakyTest.run(NonLeakyTestSuite.java:63)
at android.support.test.internal.runner.junit3.AndroidTestSuite$2.run(AndroidTestSuite.java:111)
at java.util.concurrent.Executors$RunnableAdapter.call(Executors.java:428)
at java.util.concurrent.FutureTask.run(FutureTask.java:237)
at java.util.concurrent.ThreadPoolExecutor.runWorker(ThreadPoolExecutor.java:1133)
at java.util.concurrent.ThreadPoolExecutor$Worker.run(ThreadPoolExecutor.java:607)
at java.lang.Thread.run(Thread.java:761)
com.google.android.media.gts.WidevineDashPolicyTests#testL30SLicense20SPlayback    
fail
    
java.lang.Exception: Failed components: < Audio Reached Seconds > < Expect Exceptions > < Video Reached Seconds >
at com.google.android.media.gts.GTSTestBase.run(GTSTestBase.java:78)
at com.google.android.media.gts.WidevineDashPolicyTests.testL30SLicense20SPlayback(WidevineDashPolicyTests.java:190)
at java.lang.reflect.Method.invoke(Native Method)
at android.test.InstrumentationTestCase.runMethod(InstrumentationTestCase.java:220)
at android.test.InstrumentationTestCase.runTest(InstrumentationTestCase.java:205)
at android.test.ActivityInstrumentationTestCase2.runTest(ActivityInstrumentationTestCase2.java:192)
at junit.framework.TestCase.runBare(TestCase.java:134)
at junit.framework.TestResult$1.protect(TestResult.java:115)
at android.support.test.internal.runner.junit3.AndroidTestResult.runProtected(AndroidTestResult.java:77)
at junit.framework.TestResult.run(TestResult.java:118)
at android.support.test.internal.runner.junit3.AndroidTestResult.run(AndroidTestResult.java:55)
at junit.framework.TestCase.run(TestCase.java:124)
at android.support.test.internal.runner.junit3.NonLeakyTestSuite$NonLeakyTest.run(NonLeakyTestSuite.java:63)
at android.support.test.internal.runner.junit3.AndroidTestSuite$2.run(AndroidTestSuite.java:111)
at java.util.concurrent.Executors$RunnableAdapter.call(Executors.java:428)
at java.util.concurrent.FutureTask.run(FutureTask.java:237)
at java.util.concurrent.ThreadPoolExecutor.runWorker(ThreadPoolExecutor.java:1133)
at java.util.concurrent.ThreadPoolExecutor$Worker.run(ThreadPoolExecutor.java:607)
at java.lang.Thread.run(Thread.java:761)
com.google.android.media.gts.WidevineDashPolicyTests#testL30SLicense40SPlayback    
fail
    
java.lang.Exception: Failed components: < Audio Reached Seconds > < Expect Exceptions > < Video Reached Seconds >
at com.google.android.media.gts.GTSTestBase.run(GTSTestBase.java:78)
at com.google.android.media.gts.WidevineDashPolicyTests.testL30SLicense40SPlayback(WidevineDashPolicyTests.java:200)
at java.lang.reflect.Method.invoke(Native Method)
at android.test.InstrumentationTestCase.runMethod(InstrumentationTestCase.java:220)
at android.test.InstrumentationTestCase.runTest(InstrumentationTestCase.java:205)
at android.test.ActivityInstrumentationTestCase2.runTest(ActivityInstrumentationTestCase2.java:192)
at junit.framework.TestCase.runBare(TestCase.java:134)
at junit.framework.TestResult$1.protect(TestResult.java:115)
at android.support.test.internal.runner.junit3.AndroidTestResult.runProtected(AndroidTestResult.java:77)
at junit.framework.TestResult.run(TestResult.java:118)
at android.support.test.internal.runner.junit3.AndroidTestResult.run(AndroidTestResult.java:55)
at junit.framework.TestCase.run(TestCase.java:124)
at android.support.test.internal.runner.junit3.NonLeakyTestSuite$NonLeakyTest.run(NonLeakyTestSuite.java:63)
at android.support.test.internal.runner.junit3.AndroidTestSuite$2.run(AndroidTestSuite.java:111)
at java.util.concurrent.Executors$RunnableAdapter.call(Executors.java:428)
at java.util.concurrent.FutureTask.run(FutureTask.java:237)
at java.util.concurrent.ThreadPoolExecutor.runWorker(ThreadPoolExecutor.java:1133)
at java.util.concurrent.ThreadPoolExecutor$Worker.run(ThreadPoolExecutor.java:607)
at java.lang.Thread.run(Thread.java:761)
com.google.android.media.gts.WidevineDashPolicyTests#testL31SecondLicenseDuration    
fail
    
java.lang.Exception: Failed components: < Expect Exceptions >
at com.google.android.media.gts.GTSTestBase.run(GTSTestBase.java:78)
at com.google.android.media.gts.WidevineDashPolicyTests.testL31SecondLicenseDuration(WidevineDashPolicyTests.java:70)
at java.lang.reflect.Method.invoke(Native Method)
at android.test.InstrumentationTestCase.runMethod(InstrumentationTestCase.java:220)
at android.test.InstrumentationTestCase.runTest(InstrumentationTestCase.java:205)
at android.test.ActivityInstrumentationTestCase2.runTest(ActivityInstrumentationTestCase2.java:192)
at junit.framework.TestCase.runBare(TestCase.java:134)
at junit.framework.TestResult$1.protect(TestResult.java:115)
at android.support.test.internal.runner.junit3.AndroidTestResult.runProtected(AndroidTestResult.java:77)
at junit.framework.TestResult.run(TestResult.java:118)
at android.support.test.internal.runner.junit3.AndroidTestResult.run(AndroidTestResult.java:55)
at junit.framework.TestCase.run(TestCase.java:124)
at android.support.test.internal.runner.junit3.NonLeakyTestSuite$NonLeakyTest.run(NonLeakyTestSuite.java:63)
at android.support.test.internal.runner.junit3.AndroidTestSuite$2.run(AndroidTestSuite.java:111)
at java.util.concurrent.Executors$RunnableAdapter.call(Executors.java:428)
at java.util.concurrent.FutureTask.run(FutureTask.java:237)
at java.util.concurrent.ThreadPoolExecutor.runWorker(ThreadPoolExecutor.java:1133)
at java.util.concurrent.ThreadPoolExecutor$Worker.run(ThreadPoolExecutor.java:607)
at java.lang.Thread.run(Thread.java:761)
com.google.android.media.gts.WidevineDashPolicyTests#testL31SecondPlaybackDuration    
fail
    
java.lang.Exception: Failed components: < Audio Reached Seconds > < Expect Exceptions > < Video Reached Seconds >
at com.google.android.media.gts.GTSTestBase.run(GTSTestBase.java:78)
at com.google.android.media.gts.WidevineDashPolicyTests.testL31SecondPlaybackDuration(WidevineDashPolicyTests.java:80)
at java.lang.reflect.Method.invoke(Native Method)
at android.test.InstrumentationTestCase.runMethod(InstrumentationTestCase.java:220)
at android.test.InstrumentationTestCase.runTest(InstrumentationTestCase.java:205)
at android.test.ActivityInstrumentationTestCase2.runTest(ActivityInstrumentationTestCase2.java:192)
at junit.framework.TestCase.runBare(TestCase.java:134)
at junit.framework.TestResult$1.protect(TestResult.java:115)
at android.support.test.internal.runner.junit3.AndroidTestResult.runProtected(AndroidTestResult.java:77)
at junit.framework.TestResult.run(TestResult.java:118)
at android.support.test.internal.runner.junit3.AndroidTestResult.run(AndroidTestResult.java:55)
at junit.framework.TestCase.run(TestCase.java:124)
at android.support.test.internal.runner.junit3.NonLeakyTestSuite$NonLeakyTest.run(NonLeakyTestSuite.java:63)
at android.support.test.internal.runner.junit3.AndroidTestSuite$2.run(AndroidTestSuite.java:111)
at java.util.concurrent.Executors$RunnableAdapter.call(Executors.java:428)
at java.util.concurrent.FutureTask.run(FutureTask.java:237)
at java.util.concurrent.ThreadPoolExecutor.runWorker(ThreadPoolExecutor.java:1133)
at java.util.concurrent.ThreadPoolExecutor$Worker.run(ThreadPoolExecutor.java:607)
at java.lang.Thread.run(Thread.java:761)
com.google.android.media.gts.WidevineDashPolicyTests#testL320SLicense0SPlayback    
fail
    
java.lang.Exception: Failed components: < Audio Reached Seconds > < Expect Exceptions > < Video Reached Seconds >
at com.google.android.media.gts.GTSTestBase.run(GTSTestBase.java:78)
at com.google.android.media.gts.WidevineDashPolicyTests.testL320SLicense0SPlayback(WidevineDashPolicyTests.java:180)
at java.lang.reflect.Method.invoke(Native Method)
at android.test.InstrumentationTestCase.runMethod(InstrumentationTestCase.java:220)
at android.test.InstrumentationTestCase.runTest(InstrumentationTestCase.java:205)
at android.test.ActivityInstrumentationTestCase2.runTest(ActivityInstrumentationTestCase2.java:192)
at junit.framework.TestCase.runBare(TestCase.java:134)
at junit.framework.TestResult$1.protect(TestResult.java:115)
at android.support.test.internal.runner.junit3.AndroidTestResult.runProtected(AndroidTestResult.java:77)
at junit.framework.TestResult.run(TestResult.java:118)
at android.support.test.internal.runner.junit3.AndroidTestResult.run(AndroidTestResult.java:55)
at junit.framework.TestCase.run(TestCase.java:124)
at android.support.test.internal.runner.junit3.NonLeakyTestSuite$NonLeakyTest.run(NonLeakyTestSuite.java:63)
at android.support.test.internal.runner.junit3.AndroidTestSuite$2.run(AndroidTestSuite.java:111)
at java.util.concurrent.Executors$RunnableAdapter.call(Executors.java:428)
at java.util.concurrent.FutureTask.run(FutureTask.java:237)
at java.util.concurrent.ThreadPoolExecutor.runWorker(ThreadPoolExecutor.java:1133)
at java.util.concurrent.ThreadPoolExecutor$Worker.run(ThreadPoolExecutor.java:607)
at java.lang.Thread.run(Thread.java:761)
com.google.android.media.gts.WidevineDashPolicyTests#testL330SecondLicenseDuration    
fail
    
java.lang.Exception: Failed components: < Audio Reached Seconds > < Expect Exceptions > < Video Reached Seconds >
at com.google.android.media.gts.GTSTestBase.run(GTSTestBase.java:78)
at com.google.android.media.gts.WidevineDashPolicyTests.testL330SecondLicenseDuration(WidevineDashPolicyTests.java:50)
at java.lang.reflect.Method.invoke(Native Method)
at android.test.InstrumentationTestCase.runMethod(InstrumentationTestCase.java:220)
at android.test.InstrumentationTestCase.runTest(InstrumentationTestCase.java:205)
at android.test.ActivityInstrumentationTestCase2.runTest(ActivityInstrumentationTestCase2.java:192)
at junit.framework.TestCase.runBare(TestCase.java:134)
at junit.framework.TestResult$1.protect(TestResult.java:115)
at android.support.test.internal.runner.junit3.AndroidTestResult.runProtected(AndroidTestResult.java:77)
at junit.framework.TestResult.run(TestResult.java:118)
at android.support.test.internal.runner.junit3.AndroidTestResult.run(AndroidTestResult.java:55)
at junit.framework.TestCase.run(TestCase.java:124)
at android.support.test.internal.runner.junit3.NonLeakyTestSuite$NonLeakyTest.run(NonLeakyTestSuite.java:63)
at android.support.test.internal.runner.junit3.AndroidTestSuite$2.run(AndroidTestSuite.java:111)
at java.util.concurrent.Executors$RunnableAdapter.call(Executors.java:428)
at java.util.concurrent.FutureTask.run(FutureTask.java:237)
at java.util.concurrent.ThreadPoolExecutor.runWorker(ThreadPoolExecutor.java:1133)
at java.util.concurrent.ThreadPoolExecutor$Worker.run(ThreadPoolExecutor.java:607)
at java.lang.Thread.run(Thread.java:761)
com.google.android.media.gts.WidevineDashPolicyTests#testL360SecondLicenseDuration    
fail
    
java.lang.Exception: Failed components: < Audio Reached Seconds > < Expect Exceptions > < Video Reached Seconds >
at com.google.android.media.gts.GTSTestBase.run(GTSTestBase.java:78)
at com.google.android.media.gts.WidevineDashPolicyTests.testL360SecondLicenseDuration(WidevineDashPolicyTests.java:90)
at java.lang.reflect.Method.invoke(Native Method)
at android.test.InstrumentationTestCase.runMethod(InstrumentationTestCase.java:220)
at android.test.InstrumentationTestCase.runTest(InstrumentationTestCase.java:205)
at android.test.ActivityInstrumentationTestCase2.runTest(ActivityInstrumentationTestCase2.java:192)
at junit.framework.TestCase.runBare(TestCase.java:134)
at junit.framework.TestResult$1.protect(TestResult.java:115)
at android.support.test.internal.runner.junit3.AndroidTestResult.runProtected(AndroidTestResult.java:77)
at junit.framework.TestResult.run(TestResult.java:118)
at android.support.test.internal.runner.junit3.AndroidTestResult.run(AndroidTestResult.java:55)
at junit.framework.TestCase.run(TestCase.java:124)
at android.support.test.internal.runner.junit3.NonLeakyTestSuite$NonLeakyTest.run(NonLeakyTestSuite.java:63)
at android.support.test.internal.runner.junit3.AndroidTestSuite$2.run(AndroidTestSuite.java:111)
at java.util.concurrent.Executors$RunnableAdapter.call(Executors.java:428)
at java.util.concurrent.FutureTask.run(FutureTask.java:237)
at java.util.concurrent.ThreadPoolExecutor.runWorker(ThreadPoolExecutor.java:1133)
at java.util.concurrent.ThreadPoolExecutor$Worker.run(ThreadPoolExecutor.java:607)
at java.lang.Thread.run(Thread.java:761)
com.google.android.media.gts.WidevineDashPolicyTests#testL360SecondPlaybackDuration    
fail
    
java.lang.Exception: Failed components: < Audio Reached Seconds > < Expect Exceptions > < Video Reached Seconds >
at com.google.android.media.gts.GTSTestBase.run(GTSTestBase.java:78)
at com.google.android.media.gts.WidevineDashPolicyTests.testL360SecondPlaybackDuration(WidevineDashPolicyTests.java:100)
at java.lang.reflect.Method.invoke(Native Method)
at android.test.InstrumentationTestCase.runMethod(InstrumentationTestCase.java:220)
at android.test.InstrumentationTestCase.runTest(InstrumentationTestCase.java:205)
at android.test.ActivityInstrumentationTestCase2.runTest(ActivityInstrumentationTestCase2.java:192)
at junit.framework.TestCase.runBare(TestCase.java:134)
at junit.framework.TestResult$1.protect(TestResult.java:115)
at android.support.test.internal.runner.junit3.AndroidTestResult.runProtected(AndroidTestResult.java:77)
at junit.framework.TestResult.run(TestResult.java:118)
at android.support.test.internal.runner.junit3.AndroidTestResult.run(AndroidTestResult.java:55)
at junit.framework.TestCase.run(TestCase.java:124)
at android.support.test.internal.runner.junit3.NonLeakyTestSuite$NonLeakyTest.run(NonLeakyTestSuite.java:63)
at android.support.test.internal.runner.junit3.AndroidTestSuite$2.run(AndroidTestSuite.java:111)
at java.util.concurrent.Executors$RunnableAdapter.call(Executors.java:428)
at java.util.concurrent.FutureTask.run(FutureTask.java:237)
at java.util.concurrent.ThreadPoolExecutor.runWorker(ThreadPoolExecutor.java:1133)
at java.util.concurrent.ThreadPoolExecutor$Worker.run(ThreadPoolExecutor.java:607)
at java.lang.Thread.run(Thread.java:761)
com.google.android.media.gts.WidevineDashPolicyTests#testL3Heartbeat    
fail
    
java.lang.Exception: Failed components: < Audio Reached Seconds > < Continous Video Progress > < No Exceptions > < Video Reached Seconds >
at com.google.android.media.gts.GTSTestBase.run(GTSTestBase.java:78)
at com.google.android.media.gts.WidevineDashPolicyTests.testL3Heartbeat(WidevineDashPolicyTests.java:130)
at java.lang.reflect.Method.invoke(Native Method)
at android.test.InstrumentationTestCase.runMethod(InstrumentationTestCase.java:220)
at android.test.InstrumentationTestCase.runTest(InstrumentationTestCase.java:205)
at android.test.ActivityInstrumentationTestCase2.runTest(ActivityInstrumentationTestCase2.java:192)
at junit.framework.TestCase.runBare(TestCase.java:134)
at junit.framework.TestResult$1.protect(TestResult.java:115)
at android.support.test.internal.runner.junit3.AndroidTestResult.runProtected(AndroidTestResult.java:77)
at junit.framework.TestResult.run(TestResult.java:118)
at android.support.test.internal.runner.junit3.AndroidTestResult.run(AndroidTestResult.java:55)
at junit.framework.TestCase.run(TestCase.java:124)
at android.support.test.internal.runner.junit3.NonLeakyTestSuite$NonLeakyTest.run(NonLeakyTestSuite.java:63)
at android.support.test.internal.runner.junit3.AndroidTestSuite$2.run(AndroidTestSuite.java:111)
at java.util.concurrent.Executors$RunnableAdapter.call(Executors.java:428)
at java.util.concurrent.FutureTask.run(FutureTask.java:237)
at java.util.concurrent.ThreadPoolExecutor.runWorker(ThreadPoolExecutor.java:1133)
at java.util.concurrent.ThreadPoolExecutor$Worker.run(ThreadPoolExecutor.java:607)
at java.lang.Thread.run(Thread.java:761)
com.google.android.media.gts.WidevineDashPolicyTests#testL3LicenseExpired    
fail
    
java.lang.Exception: Failed components: < Expect Exceptions >
at com.google.android.media.gts.GTSTestBase.run(GTSTestBase.java:78)
at com.google.android.media.gts.WidevineDashPolicyTests.testL3LicenseExpired(WidevineDashPolicyTests.java:60)
at java.lang.reflect.Method.invoke(Native Method)
at android.test.InstrumentationTestCase.runMethod(InstrumentationTestCase.java:220)
at android.test.InstrumentationTestCase.runTest(InstrumentationTestCase.java:205)
at android.test.ActivityInstrumentationTestCase2.runTest(ActivityInstrumentationTestCase2.java:192)
at junit.framework.TestCase.runBare(TestCase.java:134)
at junit.framework.TestResult$1.protect(TestResult.java:115)
at android.support.test.internal.runner.junit3.AndroidTestResult.runProtected(AndroidTestResult.java:77)
at junit.framework.TestResult.run(TestResult.java:118)
at android.support.test.internal.runner.junit3.AndroidTestResult.run(AndroidTestResult.java:55)
at junit.framework.TestCase.run(TestCase.java:124)
at android.support.test.internal.runner.junit3.NonLeakyTestSuite$NonLeakyTest.run(NonLeakyTestSuite.java:63)
at android.support.test.internal.runner.junit3.AndroidTestSuite$2.run(AndroidTestSuite.java:111)
at java.util.concurrent.Executors$RunnableAdapter.call(Executors.java:428)
at java.util.concurrent.FutureTask.run(FutureTask.java:237)
at java.util.concurrent.ThreadPoolExecutor.runWorker(ThreadPoolExecutor.java:1133)
at java.util.concurrent.ThreadPoolExecutor$Worker.run(ThreadPoolExecutor.java:607)
at java.lang.Thread.run(Thread.java:761)
com.google.android.media.gts.WidevineDashPolicyTests#testL3LongLicenseShortPlayback    
fail
    
java.lang.Exception: Failed components: < Audio Reached Seconds > < Expect Exceptions > < Video Reached Seconds >
at com.google.android.media.gts.GTSTestBase.run(GTSTestBase.java:78)
at com.google.android.media.gts.WidevineDashPolicyTests.testL3LongLicenseShortPlayback(WidevineDashPolicyTests.java:170)
at java.lang.reflect.Method.invoke(Native Method)
at android.test.InstrumentationTestCase.runMethod(InstrumentationTestCase.java:220)
at android.test.InstrumentationTestCase.runTest(InstrumentationTestCase.java:205)
at android.test.ActivityInstrumentationTestCase2.runTest(ActivityInstrumentationTestCase2.java:192)
at junit.framework.TestCase.runBare(TestCase.java:134)
at junit.framework.TestResult$1.protect(TestResult.java:115)
at android.support.test.internal.runner.junit3.AndroidTestResult.runProtected(AndroidTestResult.java:77)
at junit.framework.TestResult.run(TestResult.java:118)
at android.support.test.internal.runner.junit3.AndroidTestResult.run(AndroidTestResult.java:55)
at junit.framework.TestCase.run(TestCase.java:124)
at android.support.test.internal.runner.junit3.NonLeakyTestSuite$NonLeakyTest.run(NonLeakyTestSuite.java:63)
at android.support.test.internal.runner.junit3.AndroidTestSuite$2.run(AndroidTestSuite.java:111)
at java.util.concurrent.Executors$RunnableAdapter.call(Executors.java:428)
at java.util.concurrent.FutureTask.run(FutureTask.java:237)
at java.util.concurrent.ThreadPoolExecutor.runWorker(ThreadPoolExecutor.java:1133)
at java.util.concurrent.ThreadPoolExecutor$Worker.run(ThreadPoolExecutor.java:607)
at java.lang.Thread.run(Thread.java:761)
com.google.android.media.gts.WidevineDashPolicyTests#testL3PlayHDCPNotRequired    
fail
    
java.lang.Exception: Failed components: < Audio Reached Seconds > < Continous Video Progress > < No Exceptions > < Video Reached Seconds >
at com.google.android.media.gts.GTSTestBase.run(GTSTestBase.java:78)
at com.google.android.media.gts.WidevineDashPolicyTests.testL3PlayHDCPNotRequired(WidevineDashPolicyTests.java:298)
at java.lang.reflect.Method.invoke(Native Method)
at android.test.InstrumentationTestCase.runMethod(InstrumentationTestCase.java:220)
at android.test.InstrumentationTestCase.runTest(InstrumentationTestCase.java:205)
at android.test.ActivityInstrumentationTestCase2.runTest(ActivityInstrumentationTestCase2.java:192)
at junit.framework.TestCase.runBare(TestCase.java:134)
at junit.framework.TestResult$1.protect(TestResult.java:115)
at android.support.test.internal.runner.junit3.AndroidTestResult.runProtected(AndroidTestResult.java:77)
at junit.framework.TestResult.run(TestResult.java:118)
at android.support.test.internal.runner.junit3.AndroidTestResult.run(AndroidTestResult.java:55)
at junit.framework.TestCase.run(TestCase.java:124)
at android.support.test.internal.runner.junit3.NonLeakyTestSuite$NonLeakyTest.run(NonLeakyTestSuite.java:63)
at android.support.test.internal.runner.junit3.AndroidTestSuite$2.run(AndroidTestSuite.java:111)
at java.util.concurrent.Executors$RunnableAdapter.call(Executors.java:428)
at java.util.concurrent.FutureTask.run(FutureTask.java:237)
at java.util.concurrent.ThreadPoolExecutor.runWorker(ThreadPoolExecutor.java:1133)
at java.util.concurrent.ThreadPoolExecutor$Worker.run(ThreadPoolExecutor.java:607)
at java.lang.Thread.run(Thread.java:761)
com.google.android.media.gts.WidevineDashPolicyTests#testL3PlayHDCPNotSpecified    
fail
    
java.lang.Exception: Failed components: < Audio Reached Seconds > < Continous Video Progress > < No Exceptions > < Video Reached Seconds >
at com.google.android.media.gts.GTSTestBase.run(GTSTestBase.java:78)
at com.google.android.media.gts.WidevineDashPolicyTests.testL3PlayHDCPNotSpecified(WidevineDashPolicyTests.java:248)
at java.lang.reflect.Method.invoke(Native Method)
at android.test.InstrumentationTestCase.runMethod(InstrumentationTestCase.java:220)
at android.test.InstrumentationTestCase.runTest(InstrumentationTestCase.java:205)
at android.test.ActivityInstrumentationTestCase2.runTest(ActivityInstrumentationTestCase2.java:192)
at junit.framework.TestCase.runBare(TestCase.java:134)
at junit.framework.TestResult$1.protect(TestResult.java:115)
at android.support.test.internal.runner.junit3.AndroidTestResult.runProtected(AndroidTestResult.java:77)
at junit.framework.TestResult.run(TestResult.java:118)
at android.support.test.internal.runner.junit3.AndroidTestResult.run(AndroidTestResult.java:55)
at junit.framework.TestCase.run(TestCase.java:124)
at android.support.test.internal.runner.junit3.NonLeakyTestSuite$NonLeakyTest.run(NonLeakyTestSuite.java:63)
at android.support.test.internal.runner.junit3.AndroidTestSuite$2.run(AndroidTestSuite.java:111)
at java.util.concurrent.Executors$RunnableAdapter.call(Executors.java:428)
at java.util.concurrent.FutureTask.run(FutureTask.java:237)
at java.util.concurrent.ThreadPoolExecutor.runWorker(ThreadPoolExecutor.java:1133)
at java.util.concurrent.ThreadPoolExecutor$Worker.run(ThreadPoolExecutor.java:607)
at java.lang.Thread.run(Thread.java:761)
com.google.android.media.gts.WidevineDashPolicyTests#testL3PlayHDCPV1Required    
fail
    
java.lang.Exception: Failed components: < Expect Exceptions >
at com.google.android.media.gts.GTSTestBase.run(GTSTestBase.java:78)
at com.google.android.media.gts.WidevineDashPolicyTests.testL3PlayHDCPV1Required(WidevineDashPolicyTests.java:258)
at java.lang.reflect.Method.invoke(Native Method)
at android.test.InstrumentationTestCase.runMethod(InstrumentationTestCase.java:220)
at android.test.InstrumentationTestCase.runTest(InstrumentationTestCase.java:205)
at android.test.ActivityInstrumentationTestCase2.runTest(ActivityInstrumentationTestCase2.java:192)
at junit.framework.TestCase.runBare(TestCase.java:134)
at junit.framework.TestResult$1.protect(TestResult.java:115)
at android.support.test.internal.runner.junit3.AndroidTestResult.runProtected(AndroidTestResult.java:77)
at junit.framework.TestResult.run(TestResult.java:118)
at android.support.test.internal.runner.junit3.AndroidTestResult.run(AndroidTestResult.java:55)
at junit.framework.TestCase.run(TestCase.java:124)
at android.support.test.internal.runner.junit3.NonLeakyTestSuite$NonLeakyTest.run(NonLeakyTestSuite.java:63)
at android.support.test.internal.runner.junit3.AndroidTestSuite$2.run(AndroidTestSuite.java:111)
at java.util.concurrent.Executors$RunnableAdapter.call(Executors.java:428)
at java.util.concurrent.FutureTask.run(FutureTask.java:237)
at java.util.concurrent.ThreadPoolExecutor.runWorker(ThreadPoolExecutor.java:1133)
at java.util.concurrent.ThreadPoolExecutor$Worker.run(ThreadPoolExecutor.java:607)
at java.lang.Thread.run(Thread.java:761)
com.google.android.media.gts.WidevineDashPolicyTests#testL3PlayHDCPV2Required    
fail
    
java.lang.Exception: Failed components: < Expect Exceptions >
at com.google.android.media.gts.GTSTestBase.run(GTSTestBase.java:78)
at com.google.android.media.gts.WidevineDashPolicyTests.testL3PlayHDCPV2Required(WidevineDashPolicyTests.java:268)
at java.lang.reflect.Method.invoke(Native Method)
at android.test.InstrumentationTestCase.runMethod(InstrumentationTestCase.java:220)
at android.test.InstrumentationTestCase.runTest(InstrumentationTestCase.java:205)
at android.test.ActivityInstrumentationTestCase2.runTest(ActivityInstrumentationTestCase2.java:192)
at junit.framework.TestCase.runBare(TestCase.java:134)
at junit.framework.TestResult$1.protect(TestResult.java:115)
at android.support.test.internal.runner.junit3.AndroidTestResult.runProtected(AndroidTestResult.java:77)
at junit.framework.TestResult.run(TestResult.java:118)
at android.support.test.internal.runner.junit3.AndroidTestResult.run(AndroidTestResult.java:55)
at junit.framework.TestCase.run(TestCase.java:124)
at android.support.test.internal.runner.junit3.NonLeakyTestSuite$NonLeakyTest.run(NonLeakyTestSuite.java:63)
at android.support.test.internal.runner.junit3.AndroidTestSuite$2.run(AndroidTestSuite.java:111)
at java.util.concurrent.Executors$RunnableAdapter.call(Executors.java:428)
at java.util.concurrent.FutureTask.run(FutureTask.java:237)
at java.util.concurrent.ThreadPoolExecutor.runWorker(ThreadPoolExecutor.java:1133)
at java.util.concurrent.ThreadPoolExecutor$Worker.run(ThreadPoolExecutor.java:607)
at java.lang.Thread.run(Thread.java:761)
com.google.android.media.gts.WidevineDashPolicyTests#testL3PlayHDCPV2_1Required    
fail
    
java.lang.Exception: Failed components: < Expect Exceptions >
at com.google.android.media.gts.GTSTestBase.run(GTSTestBase.java:78)
at com.google.android.media.gts.WidevineDashPolicyTests.testL3PlayHDCPV2_1Required(WidevineDashPolicyTests.java:278)
at java.lang.reflect.Method.invoke(Native Method)
at android.test.InstrumentationTestCase.runMethod(InstrumentationTestCase.java:220)
at android.test.InstrumentationTestCase.runTest(InstrumentationTestCase.java:205)
at android.test.ActivityInstrumentationTestCase2.runTest(ActivityInstrumentationTestCase2.java:192)
at junit.framework.TestCase.runBare(TestCase.java:134)
at junit.framework.TestResult$1.protect(TestResult.java:115)
at android.support.test.internal.runner.junit3.AndroidTestResult.runProtected(AndroidTestResult.java:77)
at junit.framework.TestResult.run(TestResult.java:118)
at android.support.test.internal.runner.junit3.AndroidTestResult.run(AndroidTestResult.java:55)
at junit.framework.TestCase.run(TestCase.java:124)
at android.support.test.internal.runner.junit3.NonLeakyTestSuite$NonLeakyTest.run(NonLeakyTestSuite.java:63)
at android.support.test.internal.runner.junit3.AndroidTestSuite$2.run(AndroidTestSuite.java:111)
at java.util.concurrent.Executors$RunnableAdapter.call(Executors.java:428)
at java.util.concurrent.FutureTask.run(FutureTask.java:237)
at java.util.concurrent.ThreadPoolExecutor.runWorker(ThreadPoolExecutor.java:1133)
at java.util.concurrent.ThreadPoolExecutor$Worker.run(ThreadPoolExecutor.java:607)
at java.lang.Thread.run(Thread.java:761)
com.google.android.media.gts.WidevineDashPolicyTests#testL3PlayHDCPV2_2Required    
fail
    
java.lang.Exception: Failed components: < Expect Exceptions >
at com.google.android.media.gts.GTSTestBase.run(GTSTestBase.java:78)
at com.google.android.media.gts.WidevineDashPolicyTests.testL3PlayHDCPV2_2Required(WidevineDashPolicyTests.java:288)
at java.lang.reflect.Method.invoke(Native Method)
at android.test.InstrumentationTestCase.runMethod(InstrumentationTestCase.java:220)
at android.test.InstrumentationTestCase.runTest(InstrumentationTestCase.java:205)
at android.test.ActivityInstrumentationTestCase2.runTest(ActivityInstrumentationTestCase2.java:192)
at junit.framework.TestCase.runBare(TestCase.java:134)
at junit.framework.TestResult$1.protect(TestResult.java:115)
at android.support.test.internal.runner.junit3.AndroidTestResult.runProtected(AndroidTestResult.java:77)
at junit.framework.TestResult.run(TestResult.java:118)
at android.support.test.internal.runner.junit3.AndroidTestResult.run(AndroidTestResult.java:55)
at junit.framework.TestCase.run(TestCase.java:124)
at android.support.test.internal.runner.junit3.NonLeakyTestSuite$NonLeakyTest.run(NonLeakyTestSuite.java:63)
at android.support.test.internal.runner.junit3.AndroidTestSuite$2.run(AndroidTestSuite.java:111)
at java.util.concurrent.Executors$RunnableAdapter.call(Executors.java:428)
at java.util.concurrent.FutureTask.run(FutureTask.java:237)
at java.util.concurrent.ThreadPoolExecutor.runWorker(ThreadPoolExecutor.java:1133)
at java.util.concurrent.ThreadPoolExecutor$Worker.run(ThreadPoolExecutor.java:607)
at java.lang.Thread.run(Thread.java:761)
com.google.android.media.gts.WidevineDashPolicyTests#testL3RenewalNoClientId    
fail
    
java.lang.Exception: Failed components: < Audio Reached Seconds > < Continous Video Progress > < No Exceptions > < Video Reached Seconds >
at com.google.android.media.gts.GTSTestBase.run(GTSTestBase.java:78)
at com.google.android.media.gts.WidevineDashPolicyTests.testL3RenewalNoClientId(WidevineDashPolicyTests.java:120)
at java.lang.reflect.Method.invoke(Native Method)
at android.test.InstrumentationTestCase.runMethod(InstrumentationTestCase.java:220)
at android.test.InstrumentationTestCase.runTest(InstrumentationTestCase.java:205)
at android.test.ActivityInstrumentationTestCase2.runTest(ActivityInstrumentationTestCase2.java:192)
at junit.framework.TestCase.runBare(TestCase.java:134)
at junit.framework.TestResult$1.protect(TestResult.java:115)
at android.support.test.internal.runner.junit3.AndroidTestResult.runProtected(AndroidTestResult.java:77)
at junit.framework.TestResult.run(TestResult.java:118)
at android.support.test.internal.runner.junit3.AndroidTestResult.run(AndroidTestResult.java:55)
at junit.framework.TestCase.run(TestCase.java:124)
at android.support.test.internal.runner.junit3.NonLeakyTestSuite$NonLeakyTest.run(NonLeakyTestSuite.java:63)
at android.support.test.internal.runner.junit3.AndroidTestSuite$2.run(AndroidTestSuite.java:111)
at java.util.concurrent.Executors$RunnableAdapter.call(Executors.java:428)
at java.util.concurrent.FutureTask.run(FutureTask.java:237)
at java.util.concurrent.ThreadPoolExecutor.runWorker(ThreadPoolExecutor.java:1133)
at java.util.concurrent.ThreadPoolExecutor$Worker.run(ThreadPoolExecutor.java:607)
at java.lang.Thread.run(Thread.java:761)
com.google.android.media.gts.WidevineDashPolicyTests#testL3RenewalNoUsage    
fail
    
java.lang.Exception: Failed components: < Audio Reached Seconds > < Continous Video Progress > < No Exceptions > < Video Reached Seconds >
at com.google.android.media.gts.GTSTestBase.run(GTSTestBase.java:78)
at com.google.android.media.gts.WidevineDashPolicyTests.testL3RenewalNoUsage(WidevineDashPolicyTests.java:110)
at java.lang.reflect.Method.invoke(Native Method)
at android.test.InstrumentationTestCase.runMethod(InstrumentationTestCase.java:220)
at android.test.InstrumentationTestCase.runTest(InstrumentationTestCase.java:205)
at android.test.ActivityInstrumentationTestCase2.runTest(ActivityInstrumentationTestCase2.java:192)
at junit.framework.TestCase.runBare(TestCase.java:134)
at junit.framework.TestResult$1.protect(TestResult.java:115)
at android.support.test.internal.runner.junit3.AndroidTestResult.runProtected(AndroidTestResult.java:77)
at junit.framework.TestResult.run(TestResult.java:118)
at android.support.test.internal.runner.junit3.AndroidTestResult.run(AndroidTestResult.java:55)
at junit.framework.TestCase.run(TestCase.java:124)
at android.support.test.internal.runner.junit3.NonLeakyTestSuite$NonLeakyTest.run(NonLeakyTestSuite.java:63)
at android.support.test.internal.runner.junit3.AndroidTestSuite$2.run(AndroidTestSuite.java:111)
at java.util.concurrent.Executors$RunnableAdapter.call(Executors.java:428)
at java.util.concurrent.FutureTask.run(FutureTask.java:237)
at java.util.concurrent.ThreadPoolExecutor.runWorker(ThreadPoolExecutor.java:1133)
at java.util.concurrent.ThreadPoolExecutor$Worker.run(ThreadPoolExecutor.java:607)
at java.lang.Thread.run(Thread.java:761)
com.google.android.media.gts.WidevineDashPolicyTests#testL3RenewalOutsideRecoveryWindow    
fail
    
java.lang.Exception: Failed components: < Audio Reached Seconds > < Expect Exceptions > < Video Reached Seconds >
at com.google.android.media.gts.GTSTestBase.run(GTSTestBase.java:78)
at com.google.android.media.gts.WidevineDashPolicyTests.testL3RenewalOutsideRecoveryWindow(WidevineDashPolicyTests.java:160)
at java.lang.reflect.Method.invoke(Native Method)
at android.test.InstrumentationTestCase.runMethod(InstrumentationTestCase.java:220)
at android.test.InstrumentationTestCase.runTest(InstrumentationTestCase.java:205)
at android.test.ActivityInstrumentationTestCase2.runTest(ActivityInstrumentationTestCase2.java:192)
at junit.framework.TestCase.runBare(TestCase.java:134)
at junit.framework.TestResult$1.protect(TestResult.java:115)
at android.support.test.internal.runner.junit3.AndroidTestResult.runProtected(AndroidTestResult.java:77)
at junit.framework.TestResult.run(TestResult.java:118)
at android.support.test.internal.runner.junit3.AndroidTestResult.run(AndroidTestResult.java:55)
at junit.framework.TestCase.run(TestCase.java:124)
at android.support.test.internal.runner.junit3.NonLeakyTestSuite$NonLeakyTest.run(NonLeakyTestSuite.java:63)
at android.support.test.internal.runner.junit3.AndroidTestSuite$2.run(AndroidTestSuite.java:111)
at java.util.concurrent.Executors$RunnableAdapter.call(Executors.java:428)
at java.util.concurrent.FutureTask.run(FutureTask.java:237)
at java.util.concurrent.ThreadPoolExecutor.runWorker(ThreadPoolExecutor.java:1133)
at java.util.concurrent.ThreadPoolExecutor$Worker.run(ThreadPoolExecutor.java:607)
at java.lang.Thread.run(Thread.java:761)
com.google.android.media.gts.WidevineDashPolicyTests#testL3RenewalWithClientId    
fail
    
java.lang.Exception: Failed components: < Audio Reached Seconds > < Continous Video Progress > < No Exceptions > < Video Reached Seconds >
at com.google.android.media.gts.GTSTestBase.run(GTSTestBase.java:78)
at com.google.android.media.gts.WidevineDashPolicyTests.testL3RenewalWithClientId(WidevineDashPolicyTests.java:150)
at java.lang.reflect.Method.invoke(Native Method)
at android.test.InstrumentationTestCase.runMethod(InstrumentationTestCase.java:220)
at android.test.InstrumentationTestCase.runTest(InstrumentationTestCase.java:205)
at android.test.ActivityInstrumentationTestCase2.runTest(ActivityInstrumentationTestCase2.java:192)
at junit.framework.TestCase.runBare(TestCase.java:134)
at junit.framework.TestResult$1.protect(TestResult.java:115)
at android.support.test.internal.runner.junit3.AndroidTestResult.runProtected(AndroidTestResult.java:77)
at junit.framework.TestResult.run(TestResult.java:118)
at android.support.test.internal.runner.junit3.AndroidTestResult.run(AndroidTestResult.java:55)
at junit.framework.TestCase.run(TestCase.java:124)
at android.support.test.internal.runner.junit3.NonLeakyTestSuite$NonLeakyTest.run(NonLeakyTestSuite.java:63)
at android.support.test.internal.runner.junit3.AndroidTestSuite$2.run(AndroidTestSuite.java:111)
at java.util.concurrent.Executors$RunnableAdapter.call(Executors.java:428)
at java.util.concurrent.FutureTask.run(FutureTask.java:237)
at java.util.concurrent.ThreadPoolExecutor.runWorker(ThreadPoolExecutor.java:1133)
at java.util.concurrent.ThreadPoolExecutor$Worker.run(ThreadPoolExecutor.java:607)
at java.lang.Thread.run(Thread.java:761)
com.google.android.media.gts.WidevineDashPolicyTests#testL3RenewalWithUsage    
fail
    
java.lang.Exception: Failed components: < Audio Reached Seconds > < Continous Video Progress > < No Exceptions > < Video Reached Seconds >
at com.google.android.media.gts.GTSTestBase.run(GTSTestBase.java:78)
at com.google.android.media.gts.WidevineDashPolicyTests.testL3RenewalWithUsage(WidevineDashPolicyTests.java:140)
at java.lang.reflect.Method.invoke(Native Method)
at android.test.InstrumentationTestCase.runMethod(InstrumentationTestCase.java:220)
at android.test.InstrumentationTestCase.runTest(InstrumentationTestCase.java:205)
at android.test.ActivityInstrumentationTestCase2.runTest(ActivityInstrumentationTestCase2.java:192)
at junit.framework.TestCase.runBare(TestCase.java:134)
at junit.framework.TestResult$1.protect(TestResult.java:115)
at android.support.test.internal.runner.junit3.AndroidTestResult.runProtected(AndroidTestResult.java:77)
at junit.framework.TestResult.run(TestResult.java:118)
at android.support.test.internal.runner.junit3.AndroidTestResult.run(AndroidTestResult.java:55)
at junit.framework.TestCase.run(TestCase.java:124)
at android.support.test.internal.runner.junit3.NonLeakyTestSuite$NonLeakyTest.run(NonLeakyTestSuite.java:63)
at android.support.test.internal.runner.junit3.AndroidTestSuite$2.run(AndroidTestSuite.java:111)
at java.util.concurrent.Executors$RunnableAdapter.call(Executors.java:428)
at java.util.concurrent.FutureTask.run(FutureTask.java:237)
at java.util.concurrent.ThreadPoolExecutor.runWorker(ThreadPoolExecutor.java:1133)
at java.util.concurrent.ThreadPoolExecutor$Worker.run(ThreadPoolExecutor.java:607)
at java.lang.Thread.run(Thread.java:761)
com.google.android.media.gts.WidevineDashPolicyTests#testL3SoftwareSecureCryptoRequired    
fail
    
java.lang.Exception: Failed components: < Audio Reached Seconds > < Continous Video Progress > < No Exceptions > < Video Reached Seconds >
at com.google.android.media.gts.GTSTestBase.run(GTSTestBase.java:78)
at com.google.android.media.gts.WidevineDashPolicyTests.testL3SoftwareSecureCryptoRequired(WidevineDashPolicyTests.java:214)
at java.lang.reflect.Method.invoke(Native Method)
at android.test.InstrumentationTestCase.runMethod(InstrumentationTestCase.java:220)
at android.test.InstrumentationTestCase.runTest(InstrumentationTestCase.java:205)
at android.test.ActivityInstrumentationTestCase2.runTest(ActivityInstrumentationTestCase2.java:192)
at junit.framework.TestCase.runBare(TestCase.java:134)
at junit.framework.TestResult$1.protect(TestResult.java:115)
at android.support.test.internal.runner.junit3.AndroidTestResult.runProtected(AndroidTestResult.java:77)
at junit.framework.TestResult.run(TestResult.java:118)
at android.support.test.internal.runner.junit3.AndroidTestResult.run(AndroidTestResult.java:55)
at junit.framework.TestCase.run(TestCase.java:124)
at android.support.test.internal.runner.junit3.NonLeakyTestSuite$NonLeakyTest.run(NonLeakyTestSuite.java:63)
at android.support.test.internal.runner.junit3.AndroidTestSuite$2.run(AndroidTestSuite.java:111)
at java.util.concurrent.Executors$RunnableAdapter.call(Executors.java:428)
at java.util.concurrent.FutureTask.run(FutureTask.java:237)
at java.util.concurrent.ThreadPoolExecutor.runWorker(ThreadPoolExecutor.java:1133)
at java.util.concurrent.ThreadPoolExecutor$Worker.run(ThreadPoolExecutor.java:607)
at java.lang.Thread.run(Thread.java:761)
com.google.android.media.gts.WidevineFailureTests#testL1ContentWithL3    
fail
    
java.lang.Exception: Failed components: < Expect Exceptions >
at com.google.android.media.gts.GTSTestBase.run(GTSTestBase.java:78)
at com.google.android.media.gts.WidevineFailureTests.testL1ContentWithL3(WidevineFailureTests.java:32)
at java.lang.reflect.Method.invoke(Native Method)
at android.test.InstrumentationTestCase.runMethod(InstrumentationTestCase.java:220)
at android.test.InstrumentationTestCase.runTest(InstrumentationTestCase.java:205)
at android.test.ActivityInstrumentationTestCase2.runTest(ActivityInstrumentationTestCase2.java:192)
at junit.framework.TestCase.runBare(TestCase.java:134)
at junit.framework.TestResult$1.protect(TestResult.java:115)
at android.support.test.internal.runner.junit3.AndroidTestResult.runProtected(AndroidTestResult.java:77)
at junit.framework.TestResult.run(TestResult.java:118)
at android.support.test.internal.runner.junit3.AndroidTestResult.run(AndroidTestResult.java:55)
at junit.framework.TestCase.run(TestCase.java:124)
at android.support.test.internal.runner.junit3.NonLeakyTestSuite$NonLeakyTest.run(NonLeakyTestSuite.java:63)
at android.support.test.internal.runner.junit3.AndroidTestSuite$2.run(AndroidTestSuite.java:111)
at java.util.concurrent.Executors$RunnableAdapter.call(Executors.java:428)
at java.util.concurrent.FutureTask.run(FutureTask.java:237)
at java.util.concurrent.ThreadPoolExecutor.runWorker(ThreadPoolExecutor.java:1133)
at java.util.concurrent.ThreadPoolExecutor$Worker.run(ThreadPoolExecutor.java:607)
at java.lang.Thread.run(Thread.java:761)
com.google.android.media.gts.WidevineGenericOpsTests#testL3    
fail
    
java.lang.Exception: Failed components: < Audio Reached Seconds > < Continous Video Progress > < No Exceptions > < Video Reached Seconds >
at com.google.android.media.gts.GTSTestBase.run(GTSTestBase.java:78)
at com.google.android.media.gts.WidevineGenericOpsTests.testL3(WidevineGenericOpsTests.java:32)
at java.lang.reflect.Method.invoke(Native Method)
at android.test.InstrumentationTestCase.runMethod(InstrumentationTestCase.java:220)
at android.test.InstrumentationTestCase.runTest(InstrumentationTestCase.java:205)
at android.test.ActivityInstrumentationTestCase2.runTest(ActivityInstrumentationTestCase2.java:192)
at junit.framework.TestCase.runBare(TestCase.java:134)
at junit.framework.TestResult$1.protect(TestResult.java:115)
at android.support.test.internal.runner.junit3.AndroidTestResult.runProtected(AndroidTestResult.java:77)
at junit.framework.TestResult.run(TestResult.java:118)
at android.support.test.internal.runner.junit3.AndroidTestResult.run(AndroidTestResult.java:55)
at junit.framework.TestCase.run(TestCase.java:124)
at android.support.test.internal.runner.junit3.NonLeakyTestSuite$NonLeakyTest.run(NonLeakyTestSuite.java:63)
at android.support.test.internal.runner.junit3.AndroidTestSuite$2.run(AndroidTestSuite.java:111)
at java.util.concurrent.Executors$RunnableAdapter.call(Executors.java:428)
at java.util.concurrent.FutureTask.run(FutureTask.java:237)
at java.util.concurrent.ThreadPoolExecutor.runWorker(ThreadPoolExecutor.java:1133)
at java.util.concurrent.ThreadPoolExecutor$Worker.run(ThreadPoolExecutor.java:607)
at java.lang.Thread.run(Thread.java:761)
com.google.android.media.gts.WidevineH264PlaybackTests#testL3With1080P30    
fail
    
java.lang.Exception: Failed components: < Audio Reached Seconds > < Continous Video Progress > < No Exceptions > < Video Reached Seconds >
at com.google.android.media.gts.GTSTestBase.run(GTSTestBase.java:78)
at com.google.android.media.gts.WidevineH264PlaybackTests.testL3With1080P30(WidevineH264PlaybackTests.java:86)
at java.lang.reflect.Method.invoke(Native Method)
at android.test.InstrumentationTestCase.runMethod(InstrumentationTestCase.java:220)
at android.test.InstrumentationTestCase.runTest(InstrumentationTestCase.java:205)
at android.test.ActivityInstrumentationTestCase2.runTest(ActivityInstrumentationTestCase2.java:192)
at junit.framework.TestCase.runBare(TestCase.java:134)
at junit.framework.TestResult$1.protect(TestResult.java:115)
at android.support.test.internal.runner.junit3.AndroidTestResult.runProtected(AndroidTestResult.java:77)
at junit.framework.TestResult.run(TestResult.java:118)
at android.support.test.internal.runner.junit3.AndroidTestResult.run(AndroidTestResult.java:55)
at junit.framework.TestCase.run(TestCase.java:124)
at android.support.test.internal.runner.junit3.NonLeakyTestSuite$NonLeakyTest.run(NonLeakyTestSuite.java:63)
at android.support.test.internal.runner.junit3.AndroidTestSuite$2.run(AndroidTestSuite.java:111)
at java.util.concurrent.Executors$RunnableAdapter.call(Executors.java:428)
at java.util.concurrent.FutureTask.run(FutureTask.java:237)
at java.util.concurrent.ThreadPoolExecutor.runWorker(ThreadPoolExecutor.java:1133)
at java.util.concurrent.ThreadPoolExecutor$Worker.run(ThreadPoolExecutor.java:607)
at java.lang.Thread.run(Thread.java:761)
com.google.android.media.gts.WidevineH264PlaybackTests#testL3With240P30    
fail
    
java.lang.Exception: Failed components: < Audio Reached Seconds > < Continous Video Progress > < No Exceptions > < Video Reached Seconds >
at com.google.android.media.gts.GTSTestBase.run(GTSTestBase.java:78)
at com.google.android.media.gts.WidevineH264PlaybackTests.testL3With240P30(WidevineH264PlaybackTests.java:66)
at java.lang.reflect.Method.invoke(Native Method)
at android.test.InstrumentationTestCase.runMethod(InstrumentationTestCase.java:220)
at android.test.InstrumentationTestCase.runTest(InstrumentationTestCase.java:205)
at android.test.ActivityInstrumentationTestCase2.runTest(ActivityInstrumentationTestCase2.java:192)
at junit.framework.TestCase.runBare(TestCase.java:134)
at junit.framework.TestResult$1.protect(TestResult.java:115)
at android.support.test.internal.runner.junit3.AndroidTestResult.runProtected(AndroidTestResult.java:77)
at junit.framework.TestResult.run(TestResult.java:118)
at android.support.test.internal.runner.junit3.AndroidTestResult.run(AndroidTestResult.java:55)
at junit.framework.TestCase.run(TestCase.java:124)
at android.support.test.internal.runner.junit3.NonLeakyTestSuite$NonLeakyTest.run(NonLeakyTestSuite.java:63)
at android.support.test.internal.runner.junit3.AndroidTestSuite$2.run(AndroidTestSuite.java:111)
at java.util.concurrent.Executors$RunnableAdapter.call(Executors.java:428)
at java.util.concurrent.FutureTask.run(FutureTask.java:237)
at java.util.concurrent.ThreadPoolExecutor.runWorker(ThreadPoolExecutor.java:1133)
at java.util.concurrent.ThreadPoolExecutor$Worker.run(ThreadPoolExecutor.java:607)
at java.lang.Thread.run(Thread.java:761)
com.google.android.media.gts.WidevineH264PlaybackTests#testL3With480P30    
fail
    
java.lang.Exception: Failed components: < Audio Reached Seconds > < Continous Video Progress > < No Exceptions > < Video Reached Seconds >
at com.google.android.media.gts.GTSTestBase.run(GTSTestBase.java:78)
at com.google.android.media.gts.WidevineH264PlaybackTests.testL3With480P30(WidevineH264PlaybackTests.java:71)
at java.lang.reflect.Method.invoke(Native Method)
at android.test.InstrumentationTestCase.runMethod(InstrumentationTestCase.java:220)
at android.test.InstrumentationTestCase.runTest(InstrumentationTestCase.java:205)
at android.test.ActivityInstrumentationTestCase2.runTest(ActivityInstrumentationTestCase2.java:192)
at junit.framework.TestCase.runBare(TestCase.java:134)
at junit.framework.TestResult$1.protect(TestResult.java:115)
at android.support.test.internal.runner.junit3.AndroidTestResult.runProtected(AndroidTestResult.java:77)
at junit.framework.TestResult.run(TestResult.java:118)
at android.support.test.internal.runner.junit3.AndroidTestResult.run(AndroidTestResult.java:55)
at junit.framework.TestCase.run(TestCase.java:124)
at android.support.test.internal.runner.junit3.NonLeakyTestSuite$NonLeakyTest.run(NonLeakyTestSuite.java:63)
at android.support.test.internal.runner.junit3.AndroidTestSuite$2.run(AndroidTestSuite.java:111)
at java.util.concurrent.Executors$RunnableAdapter.call(Executors.java:428)
at java.util.concurrent.FutureTask.run(FutureTask.java:237)
at java.util.concurrent.ThreadPoolExecutor.runWorker(ThreadPoolExecutor.java:1133)
at java.util.concurrent.ThreadPoolExecutor$Worker.run(ThreadPoolExecutor.java:607)
at java.lang.Thread.run(Thread.java:761)
com.google.android.media.gts.WidevineH264PlaybackTests#testL3With720P30    
fail
    
java.lang.Exception: Failed components: < Audio Reached Seconds > < Continous Video Progress > < No Exceptions > < Video Reached Seconds >
at com.google.android.media.gts.GTSTestBase.run(GTSTestBase.java:78)
at com.google.android.media.gts.WidevineH264PlaybackTests.testL3With720P30(WidevineH264PlaybackTests.java:77)
at java.lang.reflect.Method.invoke(Native Method)
at android.test.InstrumentationTestCase.runMethod(InstrumentationTestCase.java:220)
at android.test.InstrumentationTestCase.runTest(InstrumentationTestCase.java:205)
at android.test.ActivityInstrumentationTestCase2.runTest(ActivityInstrumentationTestCase2.java:192)
at junit.framework.TestCase.runBare(TestCase.java:134)
at junit.framework.TestResult$1.protect(TestResult.java:115)
at android.support.test.internal.runner.junit3.AndroidTestResult.runProtected(AndroidTestResult.java:77)
at junit.framework.TestResult.run(TestResult.java:118)
at android.support.test.internal.runner.junit3.AndroidTestResult.run(AndroidTestResult.java:55)
at junit.framework.TestCase.run(TestCase.java:124)
at android.support.test.internal.runner.junit3.NonLeakyTestSuite$NonLeakyTest.run(NonLeakyTestSuite.java:63)
at android.support.test.internal.runner.junit3.AndroidTestSuite$2.run(AndroidTestSuite.java:111)
at java.util.concurrent.Executors$RunnableAdapter.call(Executors.java:428)
at java.util.concurrent.FutureTask.run(FutureTask.java:237)
at java.util.concurrent.ThreadPoolExecutor.runWorker(ThreadPoolExecutor.java:1133)
at java.util.concurrent.ThreadPoolExecutor$Worker.run(ThreadPoolExecutor.java:607)
at java.lang.Thread.run(Thread.java:761)
com.google.android.media.gts.WidevineHEVCPlaybackTests#testClearWith1080P30    
fail
    
java.lang.Exception: Failed components: < Video Reached Seconds >
at com.google.android.media.gts.GTSTestBase.run(GTSTestBase.java:78)
at com.google.android.media.gts.WidevineHEVCPlaybackTests.testClearWith1080P30(WidevineHEVCPlaybackTests.java:138)
at java.lang.reflect.Method.invoke(Native Method)
at android.test.InstrumentationTestCase.runMethod(InstrumentationTestCase.java:220)
at android.test.InstrumentationTestCase.runTest(InstrumentationTestCase.java:205)
at android.test.ActivityInstrumentationTestCase2.runTest(ActivityInstrumentationTestCase2.java:192)
at junit.framework.TestCase.runBare(TestCase.java:134)
at junit.framework.TestResult$1.protect(TestResult.java:115)
at android.support.test.internal.runner.junit3.AndroidTestResult.runProtected(AndroidTestResult.java:77)
at junit.framework.TestResult.run(TestResult.java:118)
at android.support.test.internal.runner.junit3.AndroidTestResult.run(AndroidTestResult.java:55)
at junit.framework.TestCase.run(TestCase.java:124)
at android.support.test.internal.runner.junit3.NonLeakyTestSuite$NonLeakyTest.run(NonLeakyTestSuite.java:63)
at android.support.test.internal.runner.junit3.AndroidTestSuite$2.run(AndroidTestSuite.java:111)
at java.util.concurrent.Executors$RunnableAdapter.call(Executors.java:428)
at java.util.concurrent.FutureTask.run(FutureTask.java:237)
at java.util.concurrent.ThreadPoolExecutor.runWorker(ThreadPoolExecutor.java:1133)
at java.util.concurrent.ThreadPoolExecutor$Worker.run(ThreadPoolExecutor.java:607)
at java.lang.Thread.run(Thread.java:761)
com.google.android.media.gts.WidevineHEVCPlaybackTests#testL3With1080P30    
fail
    
java.lang.Exception: Failed components: < Audio Reached Seconds > < Continous Video Progress > < Video Reached Seconds >
at com.google.android.media.gts.GTSTestBase.run(GTSTestBase.java:78)
at com.google.android.media.gts.WidevineHEVCPlaybackTests.testL3With1080P30(WidevineHEVCPlaybackTests.java:96)
at java.lang.reflect.Method.invoke(Native Method)
at android.test.InstrumentationTestCase.runMethod(InstrumentationTestCase.java:220)
at android.test.InstrumentationTestCase.runTest(InstrumentationTestCase.java:205)
at android.test.ActivityInstrumentationTestCase2.runTest(ActivityInstrumentationTestCase2.java:192)
at junit.framework.TestCase.runBare(TestCase.java:134)
at junit.framework.TestResult$1.protect(TestResult.java:115)
at android.support.test.internal.runner.junit3.AndroidTestResult.runProtected(AndroidTestResult.java:77)
at junit.framework.TestResult.run(TestResult.java:118)
at android.support.test.internal.runner.junit3.AndroidTestResult.run(AndroidTestResult.java:55)
at junit.framework.TestCase.run(TestCase.java:124)
at android.support.test.internal.runner.junit3.NonLeakyTestSuite$NonLeakyTest.run(NonLeakyTestSuite.java:63)
at android.support.test.internal.runner.junit3.AndroidTestSuite$2.run(AndroidTestSuite.java:111)
at java.util.concurrent.Executors$RunnableAdapter.call(Executors.java:428)
at java.util.concurrent.FutureTask.run(FutureTask.java:237)
at java.util.concurrent.ThreadPoolExecutor.runWorker(ThreadPoolExecutor.java:1133)
at java.util.concurrent.ThreadPoolExecutor$Worker.run(ThreadPoolExecutor.java:607)
at java.lang.Thread.run(Thread.java:761)
com.google.android.media.gts.WidevineHEVCPlaybackTests#testL3With240P30    
fail
    
java.lang.Exception: Failed components: < Audio Reached Seconds > < Continous Video Progress > < Video Reached Seconds >
at com.google.android.media.gts.GTSTestBase.run(GTSTestBase.java:78)
at com.google.android.media.gts.WidevineHEVCPlaybackTests.testL3With240P30(WidevineHEVCPlaybackTests.java:71)
at java.lang.reflect.Method.invoke(Native Method)
at android.test.InstrumentationTestCase.runMethod(InstrumentationTestCase.java:220)
at android.test.InstrumentationTestCase.runTest(InstrumentationTestCase.java:205)
at android.test.ActivityInstrumentationTestCase2.runTest(ActivityInstrumentationTestCase2.java:192)
at junit.framework.TestCase.runBare(TestCase.java:134)
at junit.framework.TestResult$1.protect(TestResult.java:115)
at android.support.test.internal.runner.junit3.AndroidTestResult.runProtected(AndroidTestResult.java:77)
at junit.framework.TestResult.run(TestResult.java:118)
at android.support.test.internal.runner.junit3.AndroidTestResult.run(AndroidTestResult.java:55)
at junit.framework.TestCase.run(TestCase.java:124)
at android.support.test.internal.runner.junit3.NonLeakyTestSuite$NonLeakyTest.run(NonLeakyTestSuite.java:63)
at android.support.test.internal.runner.junit3.AndroidTestSuite$2.run(AndroidTestSuite.java:111)
at java.util.concurrent.Executors$RunnableAdapter.call(Executors.java:428)
at java.util.concurrent.FutureTask.run(FutureTask.java:237)
at java.util.concurrent.ThreadPoolExecutor.runWorker(ThreadPoolExecutor.java:1133)
at java.util.concurrent.ThreadPoolExecutor$Worker.run(ThreadPoolExecutor.java:607)
at java.lang.Thread.run(Thread.java:761)
com.google.android.media.gts.WidevineHEVCPlaybackTests#testL3With360P30    
fail
    
java.lang.Exception: Failed components: < Audio Reached Seconds > < Continous Video Progress > < Video Reached Seconds >
at com.google.android.media.gts.GTSTestBase.run(GTSTestBase.java:78)
at com.google.android.media.gts.WidevineHEVCPlaybackTests.testL3With360P30(WidevineHEVCPlaybackTests.java:76)
at java.lang.reflect.Method.invoke(Native Method)
at android.test.InstrumentationTestCase.runMethod(InstrumentationTestCase.java:220)
at android.test.InstrumentationTestCase.runTest(InstrumentationTestCase.java:205)
at android.test.ActivityInstrumentationTestCase2.runTest(ActivityInstrumentationTestCase2.java:192)
at junit.framework.TestCase.runBare(TestCase.java:134)
at junit.framework.TestResult$1.protect(TestResult.java:115)
at android.support.test.internal.runner.junit3.AndroidTestResult.runProtected(AndroidTestResult.java:77)
at junit.framework.TestResult.run(TestResult.java:118)
at android.support.test.internal.runner.junit3.AndroidTestResult.run(AndroidTestResult.java:55)
at junit.framework.TestCase.run(TestCase.java:124)
at android.support.test.internal.runner.junit3.NonLeakyTestSuite$NonLeakyTest.run(NonLeakyTestSuite.java:63)
at android.support.test.internal.runner.junit3.AndroidTestSuite$2.run(AndroidTestSuite.java:111)
at java.util.concurrent.Executors$RunnableAdapter.call(Executors.java:428)
at java.util.concurrent.FutureTask.run(FutureTask.java:237)
at java.util.concurrent.ThreadPoolExecutor.runWorker(ThreadPoolExecutor.java:1133)
at java.util.concurrent.ThreadPoolExecutor$Worker.run(ThreadPoolExecutor.java:607)
at java.lang.Thread.run(Thread.java:761)
com.google.android.media.gts.WidevineHEVCPlaybackTests#testL3With480P30    
fail
    
java.lang.Exception: Failed components: < Audio Reached Seconds > < Continous Video Progress > < Video Reached Seconds >
at com.google.android.media.gts.GTSTestBase.run(GTSTestBase.java:78)
at com.google.android.media.gts.WidevineHEVCPlaybackTests.testL3With480P30(WidevineHEVCPlaybackTests.java:81)
at java.lang.reflect.Method.invoke(Native Method)
at android.test.InstrumentationTestCase.runMethod(InstrumentationTestCase.java:220)
at android.test.InstrumentationTestCase.runTest(InstrumentationTestCase.java:205)
at android.test.ActivityInstrumentationTestCase2.runTest(ActivityInstrumentationTestCase2.java:192)
at junit.framework.TestCase.runBare(TestCase.java:134)
at junit.framework.TestResult$1.protect(TestResult.java:115)
at android.support.test.internal.runner.junit3.AndroidTestResult.runProtected(AndroidTestResult.java:77)
at junit.framework.TestResult.run(TestResult.java:118)
at android.support.test.internal.runner.junit3.AndroidTestResult.run(AndroidTestResult.java:55)
at junit.framework.TestCase.run(TestCase.java:124)
at android.support.test.internal.runner.junit3.NonLeakyTestSuite$NonLeakyTest.run(NonLeakyTestSuite.java:63)
at android.support.test.internal.runner.junit3.AndroidTestSuite$2.run(AndroidTestSuite.java:111)
at java.util.concurrent.Executors$RunnableAdapter.call(Executors.java:428)
at java.util.concurrent.FutureTask.run(FutureTask.java:237)
at java.util.concurrent.ThreadPoolExecutor.runWorker(ThreadPoolExecutor.java:1133)
at java.util.concurrent.ThreadPoolExecutor$Worker.run(ThreadPoolExecutor.java:607)
at java.lang.Thread.run(Thread.java:761)
com.google.android.media.gts.WidevineHEVCPlaybackTests#testL3With720P30    
fail
    
java.lang.Exception: Failed components: < Audio Reached Seconds > < Continous Video Progress > < Video Reached Seconds >
at com.google.android.media.gts.GTSTestBase.run(GTSTestBase.java:78)
at com.google.android.media.gts.WidevineHEVCPlaybackTests.testL3With720P30(WidevineHEVCPlaybackTests.java:87)
at java.lang.reflect.Method.invoke(Native Method)
at android.test.InstrumentationTestCase.runMethod(InstrumentationTestCase.java:220)
at android.test.InstrumentationTestCase.runTest(InstrumentationTestCase.java:205)
at android.test.ActivityInstrumentationTestCase2.runTest(ActivityInstrumentationTestCase2.java:192)
at junit.framework.TestCase.runBare(TestCase.java:134)
at junit.framework.TestResult$1.protect(TestResult.java:115)
at android.support.test.internal.runner.junit3.AndroidTestResult.runProtected(AndroidTestResult.java:77)
at junit.framework.TestResult.run(TestResult.java:118)
at android.support.test.internal.runner.junit3.AndroidTestResult.run(AndroidTestResult.java:55)
at junit.framework.TestCase.run(TestCase.java:124)
at android.support.test.internal.runner.junit3.NonLeakyTestSuite$NonLeakyTest.run(NonLeakyTestSuite.java:63)
at android.support.test.internal.runner.junit3.AndroidTestSuite$2.run(AndroidTestSuite.java:111)
at java.util.concurrent.Executors$RunnableAdapter.call(Executors.java:428)
at java.util.concurrent.FutureTask.run(FutureTask.java:237)
at java.util.concurrent.ThreadPoolExecutor.runWorker(ThreadPoolExecutor.java:1133)
at java.util.concurrent.ThreadPoolExecutor$Worker.run(ThreadPoolExecutor.java:607)
at java.lang.Thread.run(Thread.java:761)
com.google.android.media.gts.WidevineYouTubePerformanceTests#testL3Cenc1080P30    
fail
    
java.lang.Exception: Failed components: < Audio Reached Seconds > < Continous Video Progress > < No Exceptions > < Performance Test > < Video Reached Seconds >
at com.google.android.media.gts.GTSTestBase.run(GTSTestBase.java:78)
at com.google.android.media.gts.WidevineYouTubePerformanceTests.testL3Cenc1080P30(WidevineYouTubePerformanceTests.java:97)
at java.lang.reflect.Method.invoke(Native Method)
at android.test.InstrumentationTestCase.runMethod(InstrumentationTestCase.java:220)
at android.test.InstrumentationTestCase.runTest(InstrumentationTestCase.java:205)
at android.test.ActivityInstrumentationTestCase2.runTest(ActivityInstrumentationTestCase2.java:192)
at junit.framework.TestCase.runBare(TestCase.java:134)
at junit.framework.TestResult$1.protect(TestResult.java:115)
at android.support.test.internal.runner.junit3.AndroidTestResult.runProtected(AndroidTestResult.java:77)
at junit.framework.TestResult.run(TestResult.java:118)
at android.support.test.internal.runner.junit3.AndroidTestResult.run(AndroidTestResult.java:55)
at junit.framework.TestCase.run(TestCase.java:124)
at android.support.test.internal.runner.junit3.NonLeakyTestSuite$NonLeakyTest.run(NonLeakyTestSuite.java:63)
at android.support.test.internal.runner.junit3.AndroidTestSuite$2.run(AndroidTestSuite.java:111)
at java.util.concurrent.Executors$RunnableAdapter.call(Executors.java:428)
at java.util.concurrent.FutureTask.run(FutureTask.java:237)
at java.util.concurrent.ThreadPoolExecutor.runWorker(ThreadPoolExecutor.java:1133)
at java.util.concurrent.ThreadPoolExecutor$Worker.run(ThreadPoolExecutor.java:607)
at java.lang.Thread.run(Thread.java:761)
com.google.android.media.gts.WidevineYouTubePerformanceTests#testL3Cenc240P30    
fail
    
java.lang.Exception: Failed components: < Audio Reached Seconds > < Continous Video Progress > < No Exceptions > < Performance Test > < Video Reached Seconds >
at com.google.android.media.gts.GTSTestBase.run(GTSTestBase.java:78)
at com.google.android.media.gts.WidevineYouTubePerformanceTests.testL3Cenc240P30(WidevineYouTubePerformanceTests.java:77)
at java.lang.reflect.Method.invoke(Native Method)
at android.test.InstrumentationTestCase.runMethod(InstrumentationTestCase.java:220)
at android.test.InstrumentationTestCase.runTest(InstrumentationTestCase.java:205)
at android.test.ActivityInstrumentationTestCase2.runTest(ActivityInstrumentationTestCase2.java:192)
at junit.framework.TestCase.runBare(TestCase.java:134)
at junit.framework.TestResult$1.protect(TestResult.java:115)
at android.support.test.internal.runner.junit3.AndroidTestResult.runProtected(AndroidTestResult.java:77)
at junit.framework.TestResult.run(TestResult.java:118)
at android.support.test.internal.runner.junit3.AndroidTestResult.run(AndroidTestResult.java:55)
at junit.framework.TestCase.run(TestCase.java:124)
at android.support.test.internal.runner.junit3.NonLeakyTestSuite$NonLeakyTest.run(NonLeakyTestSuite.java:63)
at android.support.test.internal.runner.junit3.AndroidTestSuite$2.run(AndroidTestSuite.java:111)
at java.util.concurrent.Executors$RunnableAdapter.call(Executors.java:428)
at java.util.concurrent.FutureTask.run(FutureTask.java:237)
at java.util.concurrent.ThreadPoolExecutor.runWorker(ThreadPoolExecutor.java:1133)
at java.util.concurrent.ThreadPoolExecutor$Worker.run(ThreadPoolExecutor.java:607)
at java.lang.Thread.run(Thread.java:761)
com.google.android.media.gts.WidevineYouTubePerformanceTests#testL3Cenc360P30    
fail
    
java.lang.Exception: Failed components: < Audio Reached Seconds > < Continous Video Progress > < No Exceptions > < Performance Test > < Video Reached Seconds >
at com.google.android.media.gts.GTSTestBase.run(GTSTestBase.java:78)
at com.google.android.media.gts.WidevineYouTubePerformanceTests.testL3Cenc360P30(WidevineYouTubePerformanceTests.java:82)
at java.lang.reflect.Method.invoke(Native Method)
at android.test.InstrumentationTestCase.runMethod(InstrumentationTestCase.java:220)
at android.test.InstrumentationTestCase.runTest(InstrumentationTestCase.java:205)
at android.test.ActivityInstrumentationTestCase2.runTest(ActivityInstrumentationTestCase2.java:192)
at junit.framework.TestCase.runBare(TestCase.java:134)
at junit.framework.TestResult$1.protect(TestResult.java:115)
at android.support.test.internal.runner.junit3.AndroidTestResult.runProtected(AndroidTestResult.java:77)
at junit.framework.TestResult.run(TestResult.java:118)
at android.support.test.internal.runner.junit3.AndroidTestResult.run(AndroidTestResult.java:55)
at junit.framework.TestCase.run(TestCase.java:124)
at android.support.test.internal.runner.junit3.NonLeakyTestSuite$NonLeakyTest.run(NonLeakyTestSuite.java:63)
at android.support.test.internal.runner.junit3.AndroidTestSuite$2.run(AndroidTestSuite.java:111)
at java.util.concurrent.Executors$RunnableAdapter.call(Executors.java:428)
at java.util.concurrent.FutureTask.run(FutureTask.java:237)
at java.util.concurrent.ThreadPoolExecutor.runWorker(ThreadPoolExecutor.java:1133)
at java.util.concurrent.ThreadPoolExecutor$Worker.run(ThreadPoolExecutor.java:607)
at java.lang.Thread.run(Thread.java:761)
com.google.android.media.gts.WidevineYouTubePerformanceTests#testL3Cenc480P30    
fail
    
java.lang.Exception: Failed components: < Audio Reached Seconds > < Continous Video Progress > < No Exceptions > < Performance Test > < Video Reached Seconds >
at com.google.android.media.gts.GTSTestBase.run(GTSTestBase.java:78)
at com.google.android.media.gts.WidevineYouTubePerformanceTests.testL3Cenc480P30(WidevineYouTubePerformanceTests.java:87)
at java.lang.reflect.Method.invoke(Native Method)
at android.test.InstrumentationTestCase.runMethod(InstrumentationTestCase.java:220)
at android.test.InstrumentationTestCase.runTest(InstrumentationTestCase.java:205)
at android.test.ActivityInstrumentationTestCase2.runTest(ActivityInstrumentationTestCase2.java:192)
at junit.framework.TestCase.runBare(TestCase.java:134)
at junit.framework.TestResult$1.protect(TestResult.java:115)
at android.support.test.internal.runner.junit3.AndroidTestResult.runProtected(AndroidTestResult.java:77)
at junit.framework.TestResult.run(TestResult.java:118)
at android.support.test.internal.runner.junit3.AndroidTestResult.run(AndroidTestResult.java:55)
at junit.framework.TestCase.run(TestCase.java:124)
at android.support.test.internal.runner.junit3.NonLeakyTestSuite$NonLeakyTest.run(NonLeakyTestSuite.java:63)
at android.support.test.internal.runner.junit3.AndroidTestSuite$2.run(AndroidTestSuite.java:111)
at java.util.concurrent.Executors$RunnableAdapter.call(Executors.java:428)
at java.util.concurrent.FutureTask.run(FutureTask.java:237)
at java.util.concurrent.ThreadPoolExecutor.runWorker(ThreadPoolExecutor.java:1133)
at java.util.concurrent.ThreadPoolExecutor$Worker.run(ThreadPoolExecutor.java:607)
at java.lang.Thread.run(Thread.java:761)
com.google.android.media.gts.WidevineYouTubePerformanceTests#testL3Cenc720P30    
fail
    
java.lang.Exception: Failed components: < Audio Reached Seconds > < Continous Video Progress > < No Exceptions > < Performance Test > < Video Reached Seconds >
at com.google.android.media.gts.GTSTestBase.run(GTSTestBase.java:78)
at com.google.android.media.gts.WidevineYouTubePerformanceTests.testL3Cenc720P30(WidevineYouTubePerformanceTests.java:92)
at java.lang.reflect.Method.invoke(Native Method)
at android.test.InstrumentationTestCase.runMethod(InstrumentationTestCase.java:220)
at android.test.InstrumentationTestCase.runTest(InstrumentationTestCase.java:205)
at android.test.ActivityInstrumentationTestCase2.runTest(ActivityInstrumentationTestCase2.java:192)
at junit.framework.TestCase.runBare(TestCase.java:134)
at junit.framework.TestResult$1.protect(TestResult.java:115)
at android.support.test.internal.runner.junit3.AndroidTestResult.runProtected(AndroidTestResult.java:77)
at junit.framework.TestResult.run(TestResult.java:118)
at android.support.test.internal.runner.junit3.AndroidTestResult.run(AndroidTestResult.java:55)
at junit.framework.TestCase.run(TestCase.java:124)
at android.support.test.internal.runner.junit3.NonLeakyTestSuite$NonLeakyTest.run(NonLeakyTestSuite.java:63)
at android.support.test.internal.runner.junit3.AndroidTestSuite$2.run(AndroidTestSuite.java:111)
at java.util.concurrent.Executors$RunnableAdapter.call(Executors.java:428)
at java.util.concurrent.FutureTask.run(FutureTask.java:237)
at java.util.concurrent.ThreadPoolExecutor.runWorker(ThreadPoolExecutor.java:1133)
at java.util.concurrent.ThreadPoolExecutor$Worker.run(ThreadPoolExecutor.java:607)
at java.lang.Thread.run(Thread.java:761)

Outcomes