AnsweredAssumed Answered

building VSDK demos error!

Question asked by shi feilong on Nov 22, 2017

hello!

  while I try to build the demos on windows by MSYS2 ,it shows the errors as fellows:

 

  Administrator@USER-20171122YZ MSYS /c/NXP/VisionSDK_S32V2xx_EAR_0_9_7/s32v234_sdk/demos/apex/apex_add/build-v234ce-gnu-linux-d
$ make allsub
Current SDK ROOT is /c/NXP/VisionSDK_S32V2xx_EAR_0_9_7/s32v234_sdk
make[1]: 进入目录“/c/NXP/VisionSDK_S32V2xx_EAR_0_9_7/s32v234_sdk/demos/apex/apex_add/graphs/build-apu-tct-sa-d”
make[-]: skipping directory /c/NXP/VisionSDK_S32V2xx_EAR_0_9_7/s32v234_sdk/libs/apex/acf_target/build-apu-tct-sa-d
make[-]: skipping directory /c/NXP/VisionSDK_S32V2xx_EAR_0_9_7/s32v234_sdk/libs/apex/acf_offline/build-x86-gnu-windows-d
make[-]: skipping directory /c/NXP/VisionSDK_S32V2xx_EAR_0_9_7/s32v234_sdk/libs/apex/common/build-apu-tct-sa-d
make[2]: 进入目录“/c/NXP/VisionSDK_S32V2xx_EAR_0_9_7/s32v234_sdk/kernels/apu/arithmetic_kernels/build-apu-tct-sa-d”
apu/chess CX add_acf-cpp.o
/bin/bash: chesscc: 未找到命令
make[2]: *** [../../../../build/nbuild/helpers.mk:174:add_acf-cpp.o] 错误 1
make[2]: 离开目录“/c/NXP/VisionSDK_S32V2xx_EAR_0_9_7/s32v234_sdk/kernels/apu/arithmetic_kernels/build-apu-tct-sa-d”
make[1]: *** [/c/NXP/VisionSDK_S32V2xx_EAR_0_9_7/s32v234_sdk/build/nbuild/sub.mk:75: allsub] Terminated
make[1]: 离开目录“/c/NXP/VisionSDK_S32V2xx_EAR_0_9_7/s32v234_sdk/demos/apex/apex_add/graphs/build-apu-tct-sa-d”
make: *** [/c/NXP/VisionSDK_S32V2xx_EAR_0_9_7/s32v234_sdk/build/nbuild/platforms/coordinator.mk:57: allsub] Terminated

 

what should do now?Thank you anyone helps!

Attachments

Outcomes