AnsweredAssumed Answered

Build Error: collect2.exe: error: ld returned 1 exit status

Question asked by michaelsteffenfae Employee on May 11, 2017
Latest reply on May 11, 2017 by Jing Pan

I created a project FRDM-KL25 and built it in MCUXpresso (just installed). 

 

Got this error after compiling...Project is attached.

 

collect2.exe: error: ld returned 1 exit status

make: *** [MKL25Z128xxx4_Project.axf] Error 1

 

Any idea how to solve or fix this?

 

Michael Steffen

Senior Field Applications Engineer

Member of the Technical Staff

NXP Semiconductors

 

Original Attachment has been moved to: SIP.zip

Outcomes