AnsweredAssumed Answered

LTIB Compilation issues on rpm-4.0.4 package

Question asked by Kamaraj P on Mar 16, 2017
Latest reply on Mar 21, 2017 by Kamaraj P

LTIB Compilation issues on rpm-4.0.4 package:

 

ake[2]: Leaving directory `/tmp/rpm-kamp/BUILD/rpm-4.0.4/misc'
Making all in python
make[2]: Entering directory `/tmp/rpm-kamp/BUILD/rpm-4.0.4/python'
cd .. && automake --foreign --include-deps python/Makefile
configure.in:1147: warning: AC_CONFIG_SUBDIRS: you should use literals
../../lib/autoconf/status.m4:1090: AC_CONFIG_SUBDIRS is expanded from...
configure.in:1147: the top level
configure.in:10: your implementation of AM_INIT_AUTOMAKE comes from an
configure.in:10: old Automake version. You should recreate aclocal.m4
configure.in:10: with aclocal and run automake again.
python/Makefile.am: required file `./depcomp' not found
python/Makefile.am: `automake --add-missing' can install `depcomp'
/usr/share/automake-1.11/am/depend2.am: am__fastdepCC does not appear in AM_CONDITIONAL
/usr/share/automake-1.11/am/depend2.am: The usual way to define `am__fastdepCC' is to add `AC_PROG_CC'
/usr/share/automake-1.11/am/depend2.am: to `configure.in' and run `aclocal' and `autoconf' again.
/usr/share/automake-1.11/am/depend2.am: AMDEP does not appear in AM_CONDITIONAL
/usr/share/automake-1.11/am/depend2.am: The usual way to define `AMDEP' is to add one of the compiler tests
/usr/share/automake-1.11/am/depend2.am: AC_PROG_CC, AC_PROG_CXX, AC_PROG_CXX, AC_PROG_OBJC,
/usr/share/automake-1.11/am/depend2.am: AM_PROG_AS, AM_PROG_GCJ, AM_PROG_UPC
/usr/share/automake-1.11/am/depend2.am: to `configure.in' and run `aclocal' and `autoconf' again.
make[2]: *** [Makefile.in] Error 63
make[2]: Leaving directory `/tmp/rpm-kamp/BUILD/rpm-4.0.4/python'
make[1]: *** [all-recursive] Error 1
make[1]: Leaving directory `/tmp/rpm-kamp/BUILD/rpm-4.0.4'
make: *** [all-recursive-am] Error 2
error: Bad exit status from /home/kamp/ltib/ltib-p1021mds-20101122/tmp/rpm-tmp.tA65AG (%build)


RPM build errors:
Bad exit status from /home/kamp/ltib/ltib-p1021mds-20101122/tmp/rpm-tmp.tA65AG (%build)
Build time for rpm-fs: 11 seconds

 

kamp@kamp-desktop:~/ltib/ltib-p1021mds-20101122$ cat /etc/issue
Ubuntu 10.04 LTS \n \l

 

Anyone faced this issue ?  

 

Thanks.

Outcomes