AnsweredAssumed Answered

ERROR: oe_runmake failed

Question asked by ma haiyang on Feb 27, 2017

tosail@Inspiron-660s:/media/tosail/PHDisk_Vol1/imx-4.1.15-1.0.0_ga/build-fb$ bitbake fsl-image-qt5

Welcome to Freescale Community BSP

 

The Yocto Project has extensive documentation about OE including a
reference manual which can be found at:
    http://yoctoproject.org/documentation

 

For more information about OpenEmbedded see their website:
    http://www.openembedded.org/

 

You can now run 'bitbake <target>'

 

Common targets are:
    core-image-minimal
    meta-toolchain
    meta-toolchain-sdk
    adt-installer
    meta-ide-support

 

Your configuration files at build-fb/ have not been touched.
tosail@Inspiron-660s:/media/tosail/PHDisk_Vol1/imx-4.1.15-1.0.0_ga/build-fb$ bitbake fsl-image-qt5
Loading cache: 100% |########################################################################################################################################################################| ETA:  00:00:00
Loaded 2828 entries from dependency cache.
NOTE: Resolving any missing task queue dependencies
NOTE: multiple providers are available for jpeg (jpeg, libjpeg-turbo)
NOTE: consider defining a PREFERRED_PROVIDER entry to match jpeg
NOTE: multiple providers are available for jpeg-native (jpeg-native, libjpeg-turbo-native)
NOTE: consider defining a PREFERRED_PROVIDER entry to match jpeg-native

 

Build Configuration:
BB_VERSION        = "1.28.0"
BUILD_SYS         = "x86_64-linux"
NATIVELSBSTRING   = "Ubuntu-14.04"
TARGET_SYS        = "arm-poky-linux-gnueabi"
MACHINE           = "imx6qsabresd"
DISTRO            = "poky"
DISTRO_VERSION    = "2.0.1"
TUNE_FEATURES     = "arm armv7a vfp thumb neon callconvention-hard cortexa9"
TARGET_FPU        = "vfp-neon"
meta              
meta-yocto        = "HEAD:dd0ba9ea4a11ab15348d4fe3574e4b28784db82f"
meta-oe           
meta-multimedia   = "HEAD:ad6133a2e95f4b83b6b3ea413598e2cd5fb3fd90"
meta-fsl-arm      = "HEAD:35b8b9bd9863de208ab60e33b55f10ee43e2619b"
meta-fsl-arm-extra = "HEAD:e200df91b70da254461c59082ddd5db0a3c415a2"
meta-fsl-demos    = "HEAD:2231e946e7a94d096394f2b2477e8184c9bbde7b"
meta-bsp          
meta-sdk          = "HEAD:dfbc90ee74624ce3be636c8bd2a47114fa2b71aa"
meta-browser      = "HEAD:b6d46d69a261fe6bd7c1e9811dc2a9bbd0b79aeb"
meta-gnome        
meta-networking   
meta-python       
meta-ruby         
meta-filesystems  
meta-xfce         = "HEAD:ad6133a2e95f4b83b6b3ea413598e2cd5fb3fd90"
meta-qt5          = "HEAD:d5536e34ec985c82b621448ab4325e5cbba38560"

 

NOTE: Preparing RunQueue
NOTE: Executing SetScene Tasks
NOTE: Executing RunQueue Tasks
ERROR: oe_runmake failed
ERROR: Function failed: do_compile (log file is located at /media/tosail/PHDisk_Vol1/imx-4.1.15-1.0.0_ga/build-fb/tmp/work/x86_64-linux/openjade-native/1.3.2-r5/temp/log.do_compile.31447)
ERROR: Logfile of failure stored in: /media/tosail/PHDisk_Vol1/imx-4.1.15-1.0.0_ga/build-fb/tmp/work/x86_64-linux/openjade-native/1.3.2-r5/temp/log.do_compile.31447
Log data follows:
| DEBUG: Executing shell function do_compile
| NOTE: make -j 4 depend
| make[1]: Entering directory `/media/tosail/PHDisk_Vol1/imx-4.1.15-1.0.0_ga/build-fb/tmp/work/x86_64-linux/openjade-native/1.3.2-r5/openjade-1.3.2'
| make[2]: Entering directory `/media/tosail/PHDisk_Vol1/imx-4.1.15-1.0.0_ga/build-fb/tmp/work/x86_64-linux/openjade-native/1.3.2-r5/openjade-1.3.2/grove'
| g++  -MM -isystem/media/tosail/PHDisk_Vol1/imx-4.1.15-1.0.0_ga/build-fb/tmp/sysroots/x86_64-linux/usr/include -O2 -pipe -I. -I./../include -I/media/tosail/PHDisk_Vol1/imx-4.1.15-1.0.0_ga/build-fb/tmp/sysroots/x86_64-linux/usr/include/OpenSP -I/media/tosail/PHDisk_Vol1/imx-4.1.15-1.0.0_ga/build-fb/tmp/sysroots/x86_64-linux/usr/include/OpenSP/..   -DPACKAGE_NAME=\"openjade\" -DPACKAGE_TARNAME=\"openjade\" -DPACKAGE_VERSION=\"1.3.2\" -DPACKAGE_STRING=\"openjade\ 1.3.2\" -DPACKAGE_BUGREPORT=\"\" -DPACKAGE_URL=\"\" -DPACKAGE=\"openjade\" -DVERSION=\"1.3.2\" -DSP_DEFINE_TEMPLATES=1 -DSTDC_HEADERS=1 -DHAVE_SYS_TYPES_H=1 -DHAVE_SYS_STAT_H=1 -DHAVE_STDLIB_H=1 -DHAVE_STRING_H=1 -DHAVE_MEMORY_H=1 -DHAVE_STRINGS_H=1 -DHAVE_INTTYPES_H=1 -DHAVE_STDINT_H=1 -DHAVE_UNISTD_H=1 -DHAVE_LIMITS_H=1 -DHAVE_STRUCT_STAT_ST_BLKSIZE=1 -DHAVE_ST_BLKSIZE=1 -DSIZEOF_SIZE_T=8 -DSIZEOF_UNSIGNED_INT=4 -DSP_HAVE_LOCALE=1 -DSP_HAVE_WCHAR=1 -DSP_HAVE_GETTEXT=1 -DSP_HAVE_BOOL=1 -DSP_ANSI_CLASS_INST=1 -DJADE_MIF=1 -DJADE_HTML=1 -DSP_MULTI_BYTE=1 -DHAVE_DLFCN_H=1 -DLT_OBJDIR=\".libs/\" -DDEFAULT_SCHEME_BUILTINS=\"/media/tosail/PHDisk_Vol1/imx-4.1.15-1.0.0_ga/build-fb/tmp/sysroots/x86_64-linux/usr/share/sgml/openjade-1.3.2/builtins.dsl\" -MM Node.cxx LocNode.cxx \
|       | sed -e 's; \([^/ ][^/ ]*\)/; $(srcdir)/\1/;g' >depend.temp1
| cat depend.temp1 > depend.temp
| cat depend.temp1 | sed -e 's/\.o:/.lo:/g' >> depend.temp
| rm depend.temp1
| mv depend.temp Makefile.dep
| make[2]: Leaving directory `/media/tosail/PHDisk_Vol1/imx-4.1.15-1.0.0_ga/build-fb/tmp/work/x86_64-linux/openjade-native/1.3.2-r5/openjade-1.3.2/grove'
| make[2]: Entering directory `/media/tosail/PHDisk_Vol1/imx-4.1.15-1.0.0_ga/build-fb/tmp/work/x86_64-linux/openjade-native/1.3.2-r5/openjade-1.3.2/spgrove'
| g++  -MM -isystem/media/tosail/PHDisk_Vol1/imx-4.1.15-1.0.0_ga/build-fb/tmp/sysroots/x86_64-linux/usr/include -O2 -pipe -I. -I./../include -I/media/tosail/PHDisk_Vol1/imx-4.1.15-1.0.0_ga/build-fb/tmp/sysroots/x86_64-linux/usr/include/OpenSP -I/media/tosail/PHDisk_Vol1/imx-4.1.15-1.0.0_ga/build-fb/tmp/sysroots/x86_64-linux/usr/include/OpenSP/.. -I./../grove  -DPACKAGE_NAME=\"openjade\" -DPACKAGE_TARNAME=\"openjade\" -DPACKAGE_VERSION=\"1.3.2\" -DPACKAGE_STRING=\"openjade\ 1.3.2\" -DPACKAGE_BUGREPORT=\"\" -DPACKAGE_URL=\"\" -DPACKAGE=\"openjade\" -DVERSION=\"1.3.2\" -DSP_DEFINE_TEMPLATES=1 -DSTDC_HEADERS=1 -DHAVE_SYS_TYPES_H=1 -DHAVE_SYS_STAT_H=1 -DHAVE_STDLIB_H=1 -DHAVE_STRING_H=1 -DHAVE_MEMORY_H=1 -DHAVE_STRINGS_H=1 -DHAVE_INTTYPES_H=1 -DHAVE_STDINT_H=1 -DHAVE_UNISTD_H=1 -DHAVE_LIMITS_H=1 -DHAVE_STRUCT_STAT_ST_BLKSIZE=1 -DHAVE_ST_BLKSIZE=1 -DSIZEOF_SIZE_T=8 -DSIZEOF_UNSIGNED_INT=4 -DSP_HAVE_LOCALE=1 -DSP_HAVE_WCHAR=1 -DSP_HAVE_GETTEXT=1 -DSP_HAVE_BOOL=1 -DSP_ANSI_CLASS_INST=1 -DJADE_MIF=1 -DJADE_HTML=1 -DSP_MULTI_BYTE=1 -DHAVE_DLFCN_H=1 -DLT_OBJDIR=\".libs/\" -DDEFAULT_SCHEME_BUILTINS=\"/media/tosail/PHDisk_Vol1/imx-4.1.15-1.0.0_ga/build-fb/tmp/sysroots/x86_64-linux/usr/share/sgml/openjade-1.3.2/builtins.dsl\" -MM GroveApp.cxx GroveBuilder.cxx SdNode.cxx \
|       | sed -e 's; \([^/ ][^/ ]*\)/; $(srcdir)/\1/;g' >depend.temp1
| cat depend.temp1 > depend.temp
| cat depend.temp1 | sed -e 's/\.o:/.lo:/g' >> depend.temp
| rm depend.temp1
| mv depend.temp Makefile.dep
| make[2]: Leaving directory `/media/tosail/PHDisk_Vol1/imx-4.1.15-1.0.0_ga/build-fb/tmp/work/x86_64-linux/openjade-native/1.3.2-r5/openjade-1.3.2/spgrove'
| make[2]: Entering directory `/media/tosail/PHDisk_Vol1/imx-4.1.15-1.0.0_ga/build-fb/tmp/work/x86_64-linux/openjade-native/1.3.2-r5/openjade-1.3.2/style'
| echo 'LT_OBJS='`echo LangObj.o Collector.o DssslApp.o InterpreterMessages.o DssslSpecEventHandler.o ELObj.o ELObjMessageArg.o Expression.o FOTBuilder.o FlowObj.o InheritedC.o Insn.o Interpreter.o NumberCache.o ProcessContext.o ProcessingMode.o SchemeParser.o Style.o StyleEngine.o primitive.o GroveManager.o Pattern.o MacroFlowObj.o style_inst.o MessageModule.o |sed 's/\.o/.lo/g'` >Makefile.lt
| make[2]: Leaving directory `/media/tosail/PHDisk_Vol1/imx-4.1.15-1.0.0_ga/build-fb/tmp/work/x86_64-linux/openjade-native/1.3.2-r5/openjade-1.3.2/style'
| make[2]: Entering directory `/media/tosail/PHDisk_Vol1/imx-4.1.15-1.0.0_ga/build-fb/tmp/work/x86_64-linux/openjade-native/1.3.2-r5/openjade-1.3.2/style'
| rm -f style_inst.cxx
| rm -f FlowObj_inst.cxx
| /usr/bin/perl ./../instmac.pl style_inst.m4 >style_inst.cxx
| /usr/bin/perl ./../instmac.pl FlowObj_inst.m4 >FlowObj_inst.cxx
| rm -f primitive_inst.cxx
| /usr/bin/perl -w ./../msggen.pl -l jstyleModule InterpreterMessages.msg
| /usr/bin/perl ./../instmac.pl primitive_inst.m4 >primitive_inst.cxx
| chmod -w primitive_inst.cxx
| chmod -w style_inst.cxx
| chmod: primitive_inst.cxx: new permissions are r-xr-xrwx, not r-xr-xr-x
| chmod -w FlowObj_inst.cxx
| chmod: style_inst.cxx: new permissions are r-xr-xrwx, not r-xr-xr-x
| make[2]: *** [primitive_inst.cxx] Error 1
| make[2]: *** Waiting for unfinished jobs....
| make[2]: *** [style_inst.cxx] Error 1
| chmod: FlowObj_inst.cxx: new permissions are r-xr-xrwx, not r-xr-xr-x
| make[2]: *** [FlowObj_inst.cxx] Error 1
| make[2]: Leaving directory `/media/tosail/PHDisk_Vol1/imx-4.1.15-1.0.0_ga/build-fb/tmp/work/x86_64-linux/openjade-native/1.3.2-r5/openjade-1.3.2/style'
| make[1]: *** [style] Error 2
| make[1]: Leaving directory `/media/tosail/PHDisk_Vol1/imx-4.1.15-1.0.0_ga/build-fb/tmp/work/x86_64-linux/openjade-native/1.3.2-r5/openjade-1.3.2'
| make: *** [depend] Error 2
| ERROR: oe_runmake failed
| ERROR: Function failed: do_compile (log file is located at /media/tosail/PHDisk_Vol1/imx-4.1.15-1.0.0_ga/build-fb/tmp/work/x86_64-linux/openjade-native/1.3.2-r5/temp/log.do_compile.31447)
ERROR: Task 4784 (/media/tosail/PHDisk_Vol1/imx-4.1.15-1.0.0_ga/sources/poky/meta/recipes-devtools/openjade/openjade-native_1.3.2.bb, do_compile) failed with exit code '1'
NOTE: Tasks Summary: Attempted 1066 tasks of which 1062 didn't need to be rerun and 1 failed.
Waiting for 0 running tasks to finish:

 

Summary: 1 task failed:
  /media/tosail/PHDisk_Vol1/imx-4.1.15-1.0.0_ga/sources/poky/meta/recipes-devtools/openjade/openjade-native_1.3.2.bb, do_compile
Summary: There were 2 ERROR messages shown, returning a non-zero exit code.

 

 

 

 

Tell me what to do!

Outcomes