AnsweredAssumed Answered

Build failure in SDKV2.0 & SDKv1.7 for T1024RDB BUILDS.

Question asked by Sreekumar TP on Sep 19, 2016

I get the following build error when building T1024RDB configuration. T1024RDB-64B does not throw any error during the build.

 

pes -Wno-missing-field-initializers -Wredundant-decls -Wsign-compare -Wtype-limits -Wuninitialized -Wunused-but-set-parameter -Wunused-but-set-variable -Wunused-parameter -Wunused-variable -Wnested-externs -Wpointer-arith -Wstrict-prototypes -I/home/clouduser/QorIQ-SDK-V1.7-20141218-yocto/build_t1024rdb_release/tmp/sysroots/x86_64-linux/usr/include -isystem/home/clouduser/QorIQ-SDK-V1.7-20141218-yocto/build_t1024rdb_release/tmp/sysroots/x86_64-linux/usr/include -O2 -pipe -c -o misc-utils/cal-cal.o `test -f 'misc-utils/cal.c' || echo '/home/clouduser/QorIQ-SDK-V1.7-20141218-yocto/build_t1024rdb_release/tmp/work/x86_64-linux/util-linux-native/2.24.1-r0/util-linux-2.24.1/'`misc-utils/cal.c
| In file included from /home/clouduser/QorIQ-SDK-V1.7-20141218-yocto/build_t1024rdb_release/tmp/work/x86_64-linux/util-linux-native/2.24.1-r0/util-linux-2.24.1/sys-utils/unshare.c:36:
| /home/clouduser/QorIQ-SDK-V1.7-20141218-yocto/build_t1024rdb_release/tmp/work/x86_64-linux/util-linux-native/2.24.1-r0/util-linux-2.24.1/include/namespace.h: In function 'setns':
| /home/clouduser/QorIQ-SDK-V1.7-20141218-yocto/build_t1024rdb_release/tmp/work/x86_64-linux/util-linux-native/2.24.1-r0/util-linux-2.24.1/include/namespace.h:40: error: '__NR_setns' undeclared (first use in this function)
| /home/clouduser/QorIQ-SDK-V1.7-20141218-yocto/build_t1024rdb_release/tmp/work/x86_64-linux/util-linux-native/2.24.1-r0/util-linux-2.24.1/include/namespace.h:40: error: (Each undeclared identifier is reported only once
| /home/clouduser/QorIQ-SDK-V1.7-20141218-yocto/build_t1024rdb_release/tmp/work/x86_64-linux/util-linux-native/2.24.1-r0/util-linux-2.24.1/include/namespace.h:40: error: for each function it appears in.)
| make[2]: *** [sys-utils/unshare-unshare.o] Error 1
| make[2]: *** Waiting for unfinished jobs....
| make[2]: Leaving directory `/home/clouduser/QorIQ-SDK-V1.7-20141218-yocto/build_t1024rdb_release/tmp/work/x86_64-linux/util-linux-native/2.24.1-r0/build'
| make[1]: *** [all-recursive] Error 1
| make[1]: Leaving directory `/home/clouduser/QorIQ-SDK-V1.7-20141218-yocto/build_t1024rdb_release/tmp/work/x86_64-linux/util-linux-native/2.24.1-r0/build'
| make: *** [all] Error 2
| ERROR: oe_runmake failed
| WARNING: /home/clouduser/QorIQ-SDK-V1.7-20141218-yocto/build_t1024rdb_release/tmp/work/x86_64-linux/util-linux-native/2.24.1-r0/temp/run.do_compile.61693:1 exit 1 from
| exit 1
| ERROR: Function failed: do_compile (log file is located at /home/clouduser/QorIQ-SDK-V1.7-20141218-yocto/build_t1024rdb_release/tmp/work/x86_64-linux/util-linux-native/2.24.1-r0/temp/log.do_compile.61693)
ERROR: Task 359 (virtual:native:/home/clouduser/QorIQ-SDK-V1.7-20141218-yocto/poky/meta/recipes-core/util-linux/util-linux_2.24.1.bb, do_compile) failed with exit code '1'

Original Attachment has been moved to: log.do_compile.61693.zip

Outcomes