AnsweredAssumed Answered

Trying to integrate meta-telephony  on p2020 rdb board.

Question asked by MOHIT DUGGAL on Feb 27, 2016
Latest reply on May 24, 2016 by MOHIT DUGGAL

usiing Hob trying add telephony to fsl-image-core with yocto 1.7 sdk and getting following errors:

 

DEBUG: Executing shell function do_compile

NOTE: make -j 6 -e MAKEFLAGS= KSRC= KERNEL_PATH=/home/tasl-emb/QorIQ-SDK-V1.7-20141218-yocto/poky/build_p2020rdb_release/tmp/sysroots/p2020rdb/usr/src/kernel KERNEL_SRC=/home/tasl-emb/QorIQ-SDK-V1.7-20141218-yocto/poky/build_p2020rdb_release/tmp/sysroots/p2020rdb/usr/src/kernel KERNEL_VERSION=3.12.19-rt30-QorIQ-SDK-V1.7+g6619b8b CC=powerpc-fsl-linux-gnuspe-gcc  LD=powerpc-fsl-linux-gnuspe-ld.bfd  AR=powerpc-fsl-linux-gnuspe-ar

make -C drivers/dahdi/firmware firmware-loaders

make[1]: Entering directory `/home/tasl-emb/QorIQ-SDK-V1.7-20141218-yocto/poky/build_p2020rdb_release/tmp/work/p2020rdb-fsl-linux-gnuspe/dahdi-linux/2.10.2-r0/dahdi-linux-2.10.2/drivers/dahdi/firmware'

make[1]: Leaving directory `/home/tasl-emb/QorIQ-SDK-V1.7-20141218-yocto/poky/build_p2020rdb_release/tmp/work/p2020rdb-fsl-linux-gnuspe/dahdi-linux/2.10.2-r0/dahdi-linux-2.10.2/drivers/dahdi/firmware'

You do not appear to have the sources for the 3.13.0-24-generic kernel installed.

make: *** [modules] Error 1

ERROR: oe_runmake failed

WARNING: exit code 1 from a shell command.

ERROR: Function failed: do_compile (log file is located at /home/tasl-emb/QorIQ-SDK-V1.7-20141218-yocto/poky/build_p2020rdb_release/tmp/work/p2020rdb-fsl-linux-gnuspe/dahdi-linux/2.10.2-r0/temp/log.do_compile.3609)

 

DEBUG: SITE files ['endian-big', 'bit-32', 'powerpc-common', 'common-linux', 'common-glibc', 'powerpc-linux', 'powerpc32-linux', 'powerpc-linux-gnuspe', 'common']
DEBUG: Executing shell function do_compile
NOTE: make -j 6
   [CC] res_calendar_ews.c -> res_calendar_ews.o
   [CC] res_clialiases.c -> res_clialiases.o
   [CC] res_clioriginate.c -> res_clioriginate.o
   [CC] res_config_sqlite3.c -> res_config_sqlite3.o
   [CC] res_convert.c -> res_convert.o
res_calendar_ews.c:32:24: fatal error: ne_request.h: No such file or directory
#include <ne_request.h> !
                        ^
compilation terminated.
make[1]: *** [res_calendar_ews.o] Error 1
make[1]: *** Waiting for unfinished jobs....
make: *** [res] Error 2
ERROR: oe_runmake failed
WARNING: exit code 1 from a shell command.
ERROR: Function failed: do_compile (log file is located at /home/tasl-emb/QorIQ-SDK-V1.7-20141218-yocto/poky/build_p2020rdb_release/tmp/work/ppce500v2-fsl-linux-gnuspe/asterisk/13.5.0-r0/temp/log.do_compile.3610

Outcomes