AnsweredAssumed Answered

a problem when bitbake devel-image(p4080pcie)

Question asked by shan feifei on Jul 29, 2015
Latest reply on Aug 13, 2015 by Pavel Chubakov

According to release-notes-sdk-1.0.pdf,when i was building the image of  p4080pcie on ubuntu 14.04,there came a problem as followed:

 

freescale@freescale-sdk:~/P4080-PCIE-SDK-1.0-05-03-2012/QorIQ-DPAA-SDK-20110609-

systembuilder$  bitbake devel-image

NOTE: Psyco JIT Compiler (http://psyco.sf.net) not available. Install it to increase performance.

NOTE: Handling BitBake files: \ (0394/0394) [100 %]

Parsing of 394 .bb files complete (388 cached, 6 parsed). 521 targets, 1 skipped, 0 masked, 0 errors.

NOTE: Resolving any missing task queue dependencies

NOTE: preferred version 2010.12 of u-boot not available (for item u-boot)

NOTE: Preparing runqueue

NOTE: Executing runqueue

NOTE: Running task 605 of 1738 (ID: 1526, /home/freescale/P4080-PCIE-SDK-1.0-05-03-2012/QorIQ-DPAA-SDK-20110609-systembuilder/oe-core/recipes/db/db_5.0.21.bb, do_compile)

NOTE: Running task 608 of 1738 (ID: 1487, /home/freescale/P4080-PCIE-SDK-1.0-05-03-2012/QorIQ-DPAA-SDK-20110609-systembuilder/sb-core/recipes/binutils/binutils-oprofile_2.20.1.bb, do_compile)

NOTE: package db-5.0.21-r1: task do_compile: Started

ERROR: TaskFailed event exception, aborting

ERROR: Build of /home/freescale/P4080-PCIE-SDK-1.0-05-03-2012/QorIQ-DPAA-SDK-20110609-systembuilder/oe-core/recipes/db/db_5.0.21.bb do_compile failed

ERROR: Task 1526 (/home/freescale/P4080-PCIE-SDK-1.0-05-03-2012/QorIQ-DPAA-SDK-20110609-systembuilder/oe-core/recipes/db/db_5.0.21.bb, do_compile) failed with 256

ERROR: Function do_compile failed

NOTE: Task failed: ('function do_compile failed', '/home/freescale/P4080-PCIE-SDK-1.0-05-03-2012/QorIQ-DPAA-SDK-20110609-systembuilder/build_p4080n710_release/work/ppce500mc-linux/db-5.0.21-r1/temp/log.do_compile.2837')

ERROR: Logfile of failure stored in: /home/freescale/P4080-PCIE-SDK-1.0-05-03-2012/QorIQ-DPAA-SDK-20110609-systembuilder/build_p4080n710_release/work/ppce500mc-linux/db-5.0.21-r1/temp/log.do_compile.2837

Log data follows:

| NOTE: make -j 4

| ./libtool --mode=link powerpc-linux-gnu-gcc -mcpu=e500mc -maix-struct-return --sysroot=/home/freescale/P4080-PCIE-SDK-1.0-05-03-2012/QorIQ-DPAA-SDK-20110609-systembuilder/build_p4080n710_release/sysroots/ppce500mc-linux -fexpensive-optimizations -frename-registers -fomit-frame-pointer -O2 -g0  -o db_archive -L/home/freescale/P4080-PCIE-SDK-1.0-05-03-2012/QorIQ-DPAA-SDK-20110609-systembuilder/build_p4080n710_release/sysroots/ppce500mc-linux/usr/lib -Wl,-rpath-link,/home/freescale/P4080-PCIE-SDK-1.0-05-03-2012/QorIQ-DPAA-SDK-20110609-systembuilder/build_p4080n710_release/sysroots/ppce500mc-linux/usr/lib -Wl,-O1 -Wl,--hash-style=gnu -B/home/freescale/P4080-PCIE-SDK-1.0-05-03-2012/QorIQ-DPAA-SDK-20110609-systembuilder/build_p4080n710_release/sysroots/ppce500mc-linux/usr/lib \

|    db_archive.lo util_sig.lo libdb-5.0.la -lpthread

| ./libtool --mode=link powerpc-linux-gnu-gcc -mcpu=e500mc -maix-struct-return --sysroot=/home/freescale/P4080-PCIE-SDK-1.0-05-03-2012/QorIQ-DPAA-SDK-20110609-systembuilder/build_p4080n710_release/sysroots/ppce500mc-linux -fexpensive-optimizations -frename-registers -fomit-frame-pointer -O2 -g0  -o db_checkpoint -L/home/freescale/P4080-PCIE-SDK-1.0-05-03-2012/QorIQ-DPAA-SDK-20110609-systembuilder/build_p4080n710_release/sysroots/ppce500mc-linux/usr/lib -Wl,-rpath-link,/home/freescale/P4080-PCIE-SDK-1.0-05-03-2012/QorIQ-DPAA-SDK-20110609-systembuilder/build_p4080n710_release/sysroots/ppce500mc-linux/usr/lib -Wl,-O1 -Wl,--hash-style=gnu -B/home/freescale/P4080-PCIE-SDK-1.0-05-03-2012/QorIQ-DPAA-SDK-20110609-systembuilder/build_p4080n710_release/sysroots/ppce500mc-linux/usr/lib \

|    db_checkpoint.lo util_log.lo util_sig.lo libdb-5.0.la -lpthread

| ./libtool --mode=link powerpc-linux-gnu-gcc -mcpu=e500mc -maix-struct-return --sysroot=/home/freescale/P4080-PCIE-SDK-1.0-05-03-2012/QorIQ-DPAA-SDK-20110609-systembuilder/build_p4080n710_release/sysroots/ppce500mc-linux -fexpensive-optimizations -frename-registers -fomit-frame-pointer -O2 -g0  -o db_deadlock -L/home/freescale/P4080-PCIE-SDK-1.0-05-03-2012/QorIQ-DPAA-SDK-20110609-systembuilder/build_p4080n710_release/sysroots/ppce500mc-linux/usr/lib -Wl,-rpath-link,/home/freescale/P4080-PCIE-SDK-1.0-05-03-2012/QorIQ-DPAA-SDK-20110609-systembuilder/build_p4080n710_release/sysroots/ppce500mc-linux/usr/lib -Wl,-O1 -Wl,--hash-style=gnu -B/home/freescale/P4080-PCIE-SDK-1.0-05-03-2012/QorIQ-DPAA-SDK-20110609-systembuilder/build_p4080n710_release/sysroots/ppce500mc-linux/usr/lib \

|    db_deadlock.lo util_log.lo util_sig.lo libdb-5.0.la -lpthread

| ./libtool --mode=link powerpc-linux-gnu-gcc -mcpu=e500mc -maix-struct-return --sysroot=/home/freescale/P4080-PCIE-SDK-1.0-05-03-2012/QorIQ-DPAA-SDK-20110609-systembuilder/build_p4080n710_release/sysroots/ppce500mc-linux -fexpensive-optimizations -frename-registers -fomit-frame-pointer -O2 -g0  -o db_dump -L/home/freescale/P4080-PCIE-SDK-1.0-05-03-2012/QorIQ-DPAA-SDK-20110609-systembuilder/build_p4080n710_release/sysroots/ppce500mc-linux/usr/lib -Wl,-rpath-link,/home/freescale/P4080-PCIE-SDK-1.0-05-03-2012/QorIQ-DPAA-SDK-20110609-systembuilder/build_p4080n710_release/sysroots/ppce500mc-linux/usr/lib -Wl,-O1 -Wl,--hash-style=gnu -B/home/freescale/P4080-PCIE-SDK-1.0-05-03-2012/QorIQ-DPAA-SDK-20110609-systembuilder/build_p4080n710_release/sysroots/ppce500mc-linux/usr/lib \

|    db_dump.lo util_cache.lo util_sig.lo libdb-5.0.la -lpthread

| libtool: link: powerpc-linux-gnu-gcc -mcpu=e500mc -maix-struct-return --sysroot=/home/freescale/P4080-PCIE-SDK-1.0-05-03-2012/QorIQ-DPAA-SDK-20110609-systembuilder/build_p4080n710_release/sysroots/ppce500mc-linux -fexpensive-optimizations -frename-registers -fomit-frame-pointer -O2 -g0 -o .libs/db_dump -Wl,-rpath-link -Wl,/home/freescale/P4080-PCIE-SDK-1.0-05-03-2012/QorIQ-DPAA-SDK-20110609-systembuilder/build_p4080n710_release/sysroots/ppce500mc-linux/usr/lib -Wl,-O1 -Wl,--hash-style=gnu -B/home/freescale/P4080-PCIE-SDK-1.0-05-03-2012/QorIQ-DPAA-SDK-20110609-systembuilder/build_p4080n710_release/sysroots/ppce500mc-linux/usr/lib .libs/db_dump.o .libs/util_cache.o .libs/util_sig.o  -L/home/freescale/P4080-PCIE-SDK-1.0-05-03-2012/QorIQ-DPAA-SDK-20110609-systembuilder/build_p4080n710_release/sysroots/ppce500mc-linux/usr/lib ./.libs/libdb-5.0.so -lpthread

| libtool: link: powerpc-linux-gnu-gcc -mcpu=e500mc -maix-struct-return --sysroot=/home/freescale/P4080-PCIE-SDK-1.0-05-03-2012/QorIQ-DPAA-SDK-20110609-systembuilder/build_p4080n710_release/sysroots/ppce500mc-linux -fexpensive-optimizations -frename-registers -fomit-frame-pointer -O2 -g0 -o .libs/db_deadlock -Wl,-rpath-link -Wl,/home/freescale/P4080-PCIE-SDK-1.0-05-03-2012/QorIQ-DPAA-SDK-20110609-systembuilder/build_p4080n710_release/sysroots/ppce500mc-linux/usr/lib -Wl,-O1 -Wl,--hash-style=gnu -B/home/freescale/P4080-PCIE-SDK-1.0-05-03-2012/QorIQ-DPAA-SDK-20110609-systembuilder/build_p4080n710_release/sysroots/ppce500mc-linux/usr/lib .libs/db_deadlock.o .libs/util_log.o .libs/util_sig.o  -L/home/freescale/P4080-PCIE-SDK-1.0-05-03-2012/QorIQ-DPAA-SDK-20110609-systembuilder/build_p4080n710_release/sysroots/ppce500mc-linux/usr/lib ./.libs/libdb-5.0.so -lpthread

| libtool: link: powerpc-linux-gnu-gcc -mcpu=e500mc -maix-struct-return --sysroot=/home/freescale/P4080-PCIE-SDK-1.0-05-03-2012/QorIQ-DPAA-SDK-20110609-systembuilder/build_p4080n710_release/sysroots/ppce500mc-linux -fexpensive-optimizations -frename-registers -fomit-frame-pointer -O2 -g0 -o .libs/db_checkpoint -Wl,-rpath-link -Wl,/home/freescale/P4080-PCIE-SDK-1.0-05-03-2012/QorIQ-DPAA-SDK-20110609-systembuilder/build_p4080n710_release/sysroots/ppce500mc-linux/usr/lib -Wl,-O1 -Wl,--hash-style=gnu -B/home/freescale/P4080-PCIE-SDK-1.0-05-03-2012/QorIQ-DPAA-SDK-20110609-systembuilder/build_p4080n710_release/sysroots/ppce500mc-linux/usr/lib .libs/db_checkpoint.o .libs/util_log.o .libs/util_sig.o  -L/home/freescale/P4080-PCIE-SDK-1.0-05-03-2012/QorIQ-DPAA-SDK-20110609-systembuilder/build_p4080n710_release/sysroots/ppce500mc-linux/usr/lib ./.libs/libdb-5.0.so -lpthread

| libtool: link: powerpc-linux-gnu-gcc -mcpu=e500mc -maix-struct-return --sysroot=/home/freescale/P4080-PCIE-SDK-1.0-05-03-2012/QorIQ-DPAA-SDK-20110609-systembuilder/build_p4080n710_release/sysroots/ppce500mc-linux -fexpensive-optimizations -frename-registers -fomit-frame-pointer -O2 -g0 -o .libs/db_archive -Wl,-rpath-link -Wl,/home/freescale/P4080-PCIE-SDK-1.0-05-03-2012/QorIQ-DPAA-SDK-20110609-systembuilder/build_p4080n710_release/sysroots/ppce500mc-linux/usr/lib -Wl,-O1 -Wl,--hash-style=gnu -B/home/freescale/P4080-PCIE-SDK-1.0-05-03-2012/QorIQ-DPAA-SDK-20110609-systembuilder/build_p4080n710_release/sysroots/ppce500mc-linux/usr/lib .libs/db_archive.o .libs/util_sig.o  -L/home/freescale/P4080-PCIE-SDK-1.0-05-03-2012/QorIQ-DPAA-SDK-20110609-systembuilder/build_p4080n710_release/sysroots/ppce500mc-linux/usr/lib ./.libs/libdb-5.0.so -lpthread

| ./.libs/libdb-5.0.so: undefined reference to `__txn_getactive'

| ./.libs/libdb-5.0.so: undefined reference to `__txn_regop_42_recover'

| ./.libs/libdb-5.0.so: undefined reference to `__txn_stat_print_pp'

| ./.libs/libdb-5.0.so: undefined reference to `__txn_ckp_desc'

| ./.libs/libdb-5.0.so: undefined reference to `__txn_ckp_42_recover'

| ./.libs/libdb-5.0.so: undefined reference to `__txn_closeevent'

| ./.libs/libdb-5.0.so: undefined reference to `__txn_set_tx_max'

| ./.libs/libdb-5.0.so: undefined reference to `__txn_region_mutex_count'

| ./.libs/libdb-5.0.so: undefined reference to `__txn_init_recover'

| ./.libs/libdb-5.0.so: undefined reference to `__txn_env_create'

| ./.libs/libdb-5.0.so: undefined reference to `__txn_env_refresh'

| ./.libs/libdb-5.0.so: undefined reference to `__txn_findlastckp'

| ./.libs/libdb-5.0.so: undefined reference to `__txn_reset'

| ./.libs/libdb-5.0.so: undefined reference to `__txn_remrem'

| ./.libs/libdb-5.0.so: undefined reference to `__txn_set_tx_timestamp'

| ./.libs/libdb-5.0.so: undefined reference to `__txn_lockevent'

| ./.libs/libdb-5.0.so: undefined reference to `__txn_begin'

| ./.libs/libdb-5.0.so: undefined reference to `__txn_get_tx_timestamp'

| ./.libs/libdb-5.0.so: undefined reference to `__txn_applied_pp'

| ./.libs/libdb-5.0.so: undefined reference to `__txn_failchk'

| ./.libs/libdb-5.0.so: undefined reference to `__txn_activekids'

| ./.libs/libdb-5.0.so: undefined reference to `__txn_open'

| ./.libs/libdb-5.0.so: undefined reference to `__txn_recycle_id'

| ./.libs/libdb-5.0.so: undefined reference to `__txn_record_fname'

| ./.libs/libdb-5.0.so: undefined reference to `__txn_begin_pp'

| ./.libs/libdb-5.0.so: undefined reference to `__txn_recover_pp'

| ./.libs/libdb-5.0.so: undefined reference to `__txn_force_abort'

| ./.libs/libdb-5.0.so: undefined reference to `__txn_getckp'

| ./.libs/libdb-5.0.so: undefined reference to `__txn_remlock'

| ./.libs/libdb-5.0.so: undefined reference to `__txn_commit'

| ./.libs/libdb-5.0.so: undefined reference to `__txn_remove_buffer'

| ./.libs/libdb-5.0.so: undefined reference to `__txn_abort'

| ./.libs/libdb-5.0.so: undefined reference to `__txn_get_tx_max'

| ./.libs/libdb-5.0.so: undefined reference to `__txn_env_destroy'

| ./.libs/libdb-5.0.so: undefined reference to `__txn_stat_pp'

| ./.libs/libdb-5.0.so: undefined reference to `__txn_remevent'

| ./.libs/libdb-5.0.so: undefined reference to `__txn_checkpoint'

| ./.libs/libdb-5.0.so: undefined reference to `__txn_oldest_reader'

| ./.libs/libdb-5.0.so: undefined reference to `__txn_checkpoint_pp'

| ./.libs/libdb-5.0.so: undefined reference to `__txn_preclose'

| ./.libs/libdb-5.0.so: undefined reference to `__txn_add_buffer'

| ./.libs/libdb-5.0.so: undefined reference to `__txn_get_name'

| ./.libs/libdb-5.0.so: undefined reference to `__txn_set_timeout'

| collect2: ld returned 1 exit status

| ./.libs/libdb-5.0.so: undefined reference to `__txn_getactive'

| ./.libs/libdb-5.0.so: undefined reference to `__txn_regop_42_recover'

| ./.libs/libdb-5.0.so: undefined reference to `__txn_stat_print_pp'

| ./.libs/libdb-5.0.so: undefined reference to `__txn_ckp_desc'

| ./.libs/libdb-5.0.so: undefined reference to `__txn_ckp_42_recover'

| ./.libs/libdb-5.0.so: undefined reference to `__txn_closeevent'

| ./.libs/libdb-5.0.so: undefined reference to `__txn_set_tx_max'

| ./.libs/libdb-5.0.so: undefined reference to `__txn_region_mutex_count'

| ./.libs/libdb-5.0.so: undefined reference to `__txn_init_recover'

| ./.libs/libdb-5.0.so: undefined reference to `__txn_env_create'

| ./.libs/libdb-5.0.so: undefined reference to `__txn_env_refresh'

| ./.libs/libdb-5.0.so: undefined reference to `__txn_findlastckp'

| ./.libs/libdb-5.0.so: undefined reference to `__txn_reset'

| ./.libs/libdb-5.0.so: undefined reference to `__txn_remrem'

| ./.libs/libdb-5.0.so: undefined reference to `__txn_set_tx_timestamp'

| ./.libs/libdb-5.0.so: undefined reference to `__txn_lockevent'

| ./.libs/libdb-5.0.so: undefined reference to `__txn_begin'

| ./.libs/libdb-5.0.so: undefined reference to `__txn_get_tx_timestamp'

| ./.libs/libdb-5.0.so: undefined reference to `__txn_applied_pp'

| ./.libs/libdb-5.0.so: undefined reference to `__txn_failchk'

| ./.libs/libdb-5.0.so: undefined reference to `__txn_activekids'

| ./.libs/libdb-5.0.so: undefined reference to `__txn_open'

| ./.libs/libdb-5.0.so: undefined reference to `__txn_recycle_id'

| ./.libs/libdb-5.0.so: undefined reference to `__txn_record_fname'

| ./.libs/libdb-5.0.so: undefined reference to `__txn_begin_pp'

| ./.libs/libdb-5.0.so: undefined reference to `__txn_recover_pp'

| ./.libs/libdb-5.0.so: undefined reference to `__txn_force_abort'

| ./.libs/libdb-5.0.so: undefined reference to `__txn_getckp'

| ./.libs/libdb-5.0.so: undefined reference to `__txn_remlock'

| ./.libs/libdb-5.0.so: undefined reference to `__txn_commit'

| ./.libs/libdb-5.0.so: undefined reference to `__txn_remove_buffer'

| ./.libs/libdb-5.0.so: undefined reference to `__txn_abort'

| ./.libs/libdb-5.0.so: undefined reference to `__txn_get_tx_max'

| ./.libs/libdb-5.0.so: undefined reference to `__txn_env_destroy'

| ./.libs/libdb-5.0.so: undefined reference to `__txn_stat_pp'

| ./.libs/libdb-5.0.so: undefined reference to `__txn_remevent'

| ./.libs/libdb-5.0.so: undefined reference to `__txn_checkpoint'

| ./.libs/libdb-5.0.so: undefined reference to `__txn_oldest_reader'

| ./.libs/libdb-5.0.so: undefined reference to `__txn_checkpoint_pp'

| ./.libs/libdb-5.0.so: undefined reference to `__txn_preclose'

| ./.libs/libdb-5.0.so: undefined reference to `__txn_add_buffer'

| ./.libs/libdb-5.0.so: undefined reference to `__txn_get_name'

| ./.libs/libdb-5.0.so: undefined reference to `__txn_set_timeout'

| collect2: ld returned 1 exit status

| ./.libs/libdb-5.0.so: undefined reference to `__txn_getactive'

| ./.libs/libdb-5.0.so: undefined reference to `__txn_regop_42_recover'

| ./.libs/libdb-5.0.so: undefined reference to `__txn_stat_print_pp'

| ./.libs/libdb-5.0.so: undefined reference to `__txn_ckp_desc'

| ./.libs/libdb-5.0.so: undefined reference to `__txn_ckp_42_recover'

| ./.libs/libdb-5.0.so: undefined reference to `__txn_closeevent'

| ./.libs/libdb-5.0.so: undefined reference to `__txn_set_tx_max'

| ./.libs/libdb-5.0.so: undefined reference to `__txn_region_mutex_count'

| ./.libs/libdb-5.0.so: undefined reference to `__txn_init_recover'

| ./.libs/libdb-5.0.so: undefined reference to `__txn_env_create'

| ./.libs/libdb-5.0.so: undefined reference to `__txn_env_refresh'

| ./.libs/libdb-5.0.so: undefined reference to `__txn_findlastckp'

| ./.libs/libdb-5.0.so: undefined reference to `__txn_reset'

| ./.libs/libdb-5.0.so: undefined reference to `__txn_remrem'

| ./.libs/libdb-5.0.so: undefined reference to `__txn_set_tx_timestamp'

| ./.libs/libdb-5.0.so: undefined reference to `__txn_lockevent'

| ./.libs/libdb-5.0.so: undefined reference to `__txn_begin'

| ./.libs/libdb-5.0.so: undefined reference to `__txn_get_tx_timestamp'

| ./.libs/libdb-5.0.so: undefined reference to `__txn_applied_pp'

| ./.libs/libdb-5.0.so: undefined reference to `__txn_failchk'

| ./.libs/libdb-5.0.so: undefined reference to `__txn_activekids'

| ./.libs/libdb-5.0.so: undefined reference to `__txn_open'

| ./.libs/libdb-5.0.so: undefined reference to `__txn_recycle_id'

| ./.libs/libdb-5.0.so: undefined reference to `__txn_record_fname'

| ./.libs/libdb-5.0.so: undefined reference to `__txn_begin_pp'

| ./.libs/libdb-5.0.so: undefined reference to `__txn_recover_pp'

| ./.libs/libdb-5.0.so: undefined reference to `__txn_force_abort'

| ./.libs/libdb-5.0.so: undefined reference to `__txn_getckp'

| ./.libs/libdb-5.0.so: undefined reference to `__txn_remlock'

| ./.libs/libdb-5.0.so: undefined reference to `__txn_commit'

| ./.libs/libdb-5.0.so: undefined reference to `__txn_remove_buffer'

| ./.libs/libdb-5.0.so: undefined reference to `__txn_abort'

| ./.libs/libdb-5.0.so: undefined reference to `__txn_get_tx_max'

| ./.libs/libdb-5.0.so: undefined reference to `__txn_env_destroy'

| ./.libs/libdb-5.0.so: undefined reference to `__txn_stat_pp'

| ./.libs/libdb-5.0.so: undefined reference to `__txn_remevent'

| ./.libs/libdb-5.0.so: undefined reference to `__txn_checkpoint'

| ./.libs/libdb-5.0.so: undefined reference to `__txn_oldest_reader'

| ./.libs/libdb-5.0.so: undefined reference to `__txn_checkpoint_pp'

| ./.libs/libdb-5.0.so: undefined reference to `__txn_preclose'

| ./.libs/libdb-5.0.so: undefined reference to `__txn_add_buffer'

| ./.libs/libdb-5.0.so: undefined reference to `__txn_get_name'

| ./.libs/libdb-5.0.so: undefined reference to `__txn_set_timeout'

| collect2: ld returned 1 exit status

| make: *** [db_dump] Error 1

| make: *** Waiting for unfinished jobs....

| make: *** [db_deadlock] Error 1

| ./.libs/libdb-5.0.so: undefined reference to `__txn_getactive'

| ./.libs/libdb-5.0.so: undefined reference to `__txn_regop_42_recover'

| ./.libs/libdb-5.0.so: undefined reference to `__txn_stat_print_pp'

| ./.libs/libdb-5.0.so: undefined reference to `__txn_ckp_desc'

| ./.libs/libdb-5.0.so: undefined reference to `__txn_ckp_42_recover'

| ./.libs/libdb-5.0.so: undefined reference to `__txn_closeevent'

| ./.libs/libdb-5.0.so: undefined reference to `__txn_set_tx_max'

| ./.libs/libdb-5.0.so: undefined reference to `__txn_region_mutex_count'

| ./.libs/libdb-5.0.so: undefined reference to `__txn_init_recover'

| ./.libs/libdb-5.0.so: undefined reference to `__txn_env_create'

| ./.libs/libdb-5.0.so: undefined reference to `__txn_env_refresh'

| ./.libs/libdb-5.0.so: undefined reference to `__txn_findlastckp'

| ./.libs/libdb-5.0.so: undefined reference to `__txn_reset'

| ./.libs/libdb-5.0.so: undefined reference to `__txn_remrem'

| ./.libs/libdb-5.0.so: undefined reference to `__txn_set_tx_timestamp'

| ./.libs/libdb-5.0.so: undefined reference to `__txn_lockevent'

| ./.libs/libdb-5.0.so: undefined reference to `__txn_begin'

| ./.libs/libdb-5.0.so: undefined reference to `__txn_get_tx_timestamp'

| ./.libs/libdb-5.0.so: undefined reference to `__txn_applied_pp'

| ./.libs/libdb-5.0.so: undefined reference to `__txn_failchk'

| ./.libs/libdb-5.0.so: undefined reference to `__txn_activekids'

| ./.libs/libdb-5.0.so: undefined reference to `__txn_open'

| ./.libs/libdb-5.0.so: undefined reference to `__txn_recycle_id'

| ./.libs/libdb-5.0.so: undefined reference to `__txn_record_fname'

| ./.libs/libdb-5.0.so: undefined reference to `__txn_begin_pp'

| ./.libs/libdb-5.0.so: undefined reference to `__txn_recover_pp'

| ./.libs/libdb-5.0.so: undefined reference to `__txn_force_abort'

| ./.libs/libdb-5.0.so: undefined reference to `__txn_getckp'

| ./.libs/libdb-5.0.so: undefined reference to `__txn_remlock'

| ./.libs/libdb-5.0.so: undefined reference to `__txn_commit'

| ./.libs/libdb-5.0.so: undefined reference to `__txn_remove_buffer'

| ./.libs/libdb-5.0.so: undefined reference to `__txn_abort'

| ./.libs/libdb-5.0.so: undefined reference to `__txn_get_tx_max'

| ./.libs/libdb-5.0.so: undefined reference to `__txn_env_destroy'

| ./.libs/libdb-5.0.so: undefined reference to `__txn_stat_pp'

| ./.libs/libdb-5.0.so: undefined reference to `__txn_remevent'

| ./.libs/libdb-5.0.so: undefined reference to `__txn_checkpoint'

| ./.libs/libdb-5.0.so: undefined reference to `__txn_oldest_reader'

| ./.libs/libdb-5.0.so: undefined reference to `__txn_checkpoint_pp'

| ./.libs/libdb-5.0.so: undefined reference to `__txn_preclose'

| ./.libs/libdb-5.0.so: undefined reference to `__txn_add_buffer'

| ./.libs/libdb-5.0.so: undefined reference to `__txn_get_name'

| ./.libs/libdb-5.0.so: undefined reference to `__txn_set_timeout'

| collect2: ld returned 1 exit status

| make: *** [db_archive] Error 1

| make: *** [db_checkpoint] Error 1

| FATAL: oe_runmake failed

| ERROR: Function do_compile failed

NOTE: package db-5.0.21-r1: task do_compile: Failed

ERROR: TaskFailed event exception, aborting

ERROR: Build of /home/freescale/P4080-PCIE-SDK-1.0-05-03-2012/QorIQ-DPAA-SDK-20110609-systembuilder/oe-core/recipes/db/db_5.0.21.bb do_compile failed

ERROR: Task 1526 (/home/freescale/P4080-PCIE-SDK-1.0-05-03-2012/QorIQ-DPAA-SDK-20110609-systembuilder/oe-core/recipes/db/db_5.0.21.bb, do_compile) failed with 256

Waiting for 1 active tasks to finish:

1: binutils-oprofile-2.20.1-r0.2 do_compile (pid 2838)

NOTE: package binutils-oprofile-2.20.1-r0.2: task do_compile: Started

ERROR: TaskFailed event exception, aborting

ERROR: Build of /home/freescale/P4080-PCIE-SDK-1.0-05-03-2012/QorIQ-DPAA-SDK-20110609-systembuilder/sb-core/recipes/binutils/binutils-oprofile_2.20.1.bb do_compile failed

ERROR: Function do_compile failed

NOTE: Task failed: ('function do_compile failed', '/home/freescale/P4080-PCIE-SDK-1.0-05-03-2012/QorIQ-DPAA-SDK-20110609-systembuilder/build_p4080n710_release/work/ppce500mc-linux/binutils-oprofile-2.20.1-r0.2/temp/log.do_compile.2838')

ERROR: Logfile of failure stored in: /home/freescale/P4080-PCIE-SDK-1.0-05-03-2012/QorIQ-DPAA-SDK-20110609-systembuilder/build_p4080n710_release/work/ppce500mc-linux/binutils-oprofile-2.20.1-r0.2/temp/log.do_compile.2838

Log data follows:

| NOTE: make -j 4 configure-build-libiberty all

| make[1]: Entering directory `/home/freescale/P4080-PCIE-SDK-1.0-05-03-2012/QorIQ-DPAA-SDK-20110609-systembuilder/build_p4080n710_release/work/ppce500mc-linux/binutils-oprofile-2.20.1-r0.2/binutils-2.20.1/build.powerpc-linux.powerpc-linux'

| make[1]: Nothing to be done for `all-target'.

| make[2]: Entering directory `/home/freescale/P4080-PCIE-SDK-1.0-05-03-2012/QorIQ-DPAA-SDK-20110609-systembuilder/build_p4080n710_release/work/ppce500mc-linux/binutils-oprofile-2.20.1-r0.2/binutils-2.20.1/build.powerpc-linux.powerpc-linux/intl'

| make[2]: Nothing to be done for `all'.

| make[2]: Leaving directory `/home/freescale/P4080-PCIE-SDK-1.0-05-03-2012/QorIQ-DPAA-SDK-20110609-systembuilder/build_p4080n710_release/work/ppce500mc-linux/binutils-oprofile-2.20.1-r0.2/binutils-2.20.1/build.powerpc-linux.powerpc-linux/intl'

| make[2]: Entering directory `/home/freescale/P4080-PCIE-SDK-1.0-05-03-2012/QorIQ-DPAA-SDK-20110609-systembuilder/build_p4080n710_release/work/ppce500mc-linux/binutils-oprofile-2.20.1-r0.2/binutils-2.20.1/build.powerpc-linux.powerpc-linux/libiberty'

| make[2]: Entering directory `/home/freescale/P4080-PCIE-SDK-1.0-05-03-2012/QorIQ-DPAA-SDK-20110609-systembuilder/build_p4080n710_release/work/ppce500mc-linux/binutils-oprofile-2.20.1-r0.2/binutils-2.20.1/build.powerpc-linux.powerpc-linux/etc'

| for f in standards.info configure.info; do \

|  if test -f /home/freescale/P4080-PCIE-SDK-1.0-05-03-2012/QorIQ-DPAA-SDK-20110609-systembuilder/build_p4080n710_release/work/ppce500mc-linux/binutils-oprofile-2.20.1-r0.2/binutils-2.20.1/etc/`echo $f | sed -e 's/.info$/.texi/'`; then \

|    if make "MAKEINFO=makeinfo --split-size=5000000 --split-size=5000000" $f; then \

|      true; \

|    else \

|      exit 1; \

|    fi; \

|  fi; \

| done

| make[3]: Entering directory `/home/freescale/P4080-PCIE-SDK-1.0-05-03-2012/QorIQ-DPAA-SDK-20110609-systembuilder/build_p4080n710_release/work/ppce500mc-linux/binutils-oprofile-2.20.1-r0.2/binutils-2.20.1/build.powerpc-linux.powerpc-linux/libiberty/testsuite'

| make[3]: Nothing to be done for `all'.

| make[3]: Leaving directory `/home/freescale/P4080-PCIE-SDK-1.0-05-03-2012/QorIQ-DPAA-SDK-20110609-systembuilder/build_p4080n710_release/work/ppce500mc-linux/binutils-oprofile-2.20.1-r0.2/binutils-2.20.1/build.powerpc-linux.powerpc-linux/libiberty/testsuite'

| make[2]: Leaving directory `/home/freescale/P4080-PCIE-SDK-1.0-05-03-2012/QorIQ-DPAA-SDK-20110609-systembuilder/build_p4080n710_release/work/ppce500mc-linux/binutils-oprofile-2.20.1-r0.2/binutils-2.20.1/build.powerpc-linux.powerpc-linux/libiberty'

| make[3]: Entering directory `/home/freescale/P4080-PCIE-SDK-1.0-05-03-2012/QorIQ-DPAA-SDK-20110609-systembuilder/build_p4080n710_release/work/ppce500mc-linux/binutils-oprofile-2.20.1-r0.2/binutils-2.20.1/build.powerpc-linux.powerpc-linux/etc'

| make[3]: `/home/freescale/P4080-PCIE-SDK-1.0-05-03-2012/QorIQ-DPAA-SDK-20110609-systembuilder/build_p4080n710_release/work/ppce500mc-linux/binutils-oprofile-2.20.1-r0.2/binutils-2.20.1/etc/standards.info' is up to date.

| make[3]: Leaving directory `/home/freescale/P4080-PCIE-SDK-1.0-05-03-2012/QorIQ-DPAA-SDK-20110609-systembuilder/build_p4080n710_release/work/ppce500mc-linux/binutils-oprofile-2.20.1-r0.2/binutils-2.20.1/build.powerpc-linux.powerpc-linux/etc'

| make[3]: Entering directory `/home/freescale/P4080-PCIE-SDK-1.0-05-03-2012/QorIQ-DPAA-SDK-20110609-systembuilder/build_p4080n710_release/work/ppce500mc-linux/binutils-oprofile-2.20.1-r0.2/binutils-2.20.1/build.powerpc-linux.powerpc-linux/etc'

| make[3]: `/home/freescale/P4080-PCIE-SDK-1.0-05-03-2012/QorIQ-DPAA-SDK-20110609-systembuilder/build_p4080n710_release/work/ppce500mc-linux/binutils-oprofile-2.20.1-r0.2/binutils-2.20.1/etc/configure.info' is up to date.

| make[3]: Leaving directory `/home/freescale/P4080-PCIE-SDK-1.0-05-03-2012/QorIQ-DPAA-SDK-20110609-systembuilder/build_p4080n710_release/work/ppce500mc-linux/binutils-oprofile-2.20.1-r0.2/binutils-2.20.1/build.powerpc-linux.powerpc-linux/etc'

| make[2]: Leaving directory `/home/freescale/P4080-PCIE-SDK-1.0-05-03-2012/QorIQ-DPAA-SDK-20110609-systembuilder/build_p4080n710_release/work/ppce500mc-linux/binutils-oprofile-2.20.1-r0.2/binutils-2.20.1/build.powerpc-linux.powerpc-linux/etc'

| make[2]: Entering directory `/home/freescale/P4080-PCIE-SDK-1.0-05-03-2012/QorIQ-DPAA-SDK-20110609-systembuilder/build_p4080n710_release/work/ppce500mc-linux/binutils-oprofile-2.20.1-r0.2/binutils-2.20.1/build.powerpc-linux.powerpc-linux/bfd'

| Making info in doc

| make[3]: Entering directory `/home/freescale/P4080-PCIE-SDK-1.0-05-03-2012/QorIQ-DPAA-SDK-20110609-systembuilder/build_p4080n710_release/work/ppce500mc-linux/binutils-oprofile-2.20.1-r0.2/binutils-2.20.1/build.powerpc-linux.powerpc-linux/bfd/doc'

| restore=: && backupdir=".am$$" && \

| rm -rf $backupdir && mkdir $backupdir && \

| if (makeinfo --split-size=5000000 --split-size=5000000 --version) >/dev/null 2>&1; then \

|  for f in bfd.info bfd.info-[0-9] bfd.info-[0-9][0-9] bfd.i[0-9] bfd.i[0-9][0-9]; do \

|    if test -f $f; then mv $f $backupdir; restore=mv; else :; fi; \

|  done; \

| else :; fi && \

| if makeinfo --split-size=5000000 --split-size=5000000   -I /home/freescale/P4080-PCIE-SDK-1.0-05-03-2012/QorIQ-DPAA-SDK-20110609-systembuilder/build_p4080n710_release/work/ppce500mc-linux/binutils-oprofile-2.20.1-r0.2/binutils-2.20.1/bfd/doc \

| -o bfd.info `test -f 'bfd.texinfo' || echo '/home/freescale/P4080-PCIE-SDK-1.0-05-03-2012/QorIQ-DPAA-SDK-20110609-systembuilder/build_p4080n710_release/work/ppce500mc-linux/binutils-oprofile-2.20.1-r0.2/binutils-2.20.1/bfd/doc/'`bfd.texinfo; \

| then \

|  rc=0; \

| else \

|  rc=$?; \

|  $restore $backupdir/* `echo "./bfd.info" | sed 's|[^/]*$||'`; \

| fi; \

| rm -rf $backupdir; exit $rc

| /home/freescale/P4080-PCIE-SDK-1.0-05-03-2012/QorIQ-DPAA-SDK-20110609-systembuilder/build_p4080n710_release/work/ppce500mc-linux/binutils-oprofile-2.20.1-r0.2/binutils-2.20.1/bfd/doc/bfd.texinfo:326: unknown command `colophon'

| /home/freescale/P4080-PCIE-SDK-1.0-05-03-2012/QorIQ-DPAA-SDK-20110609-systembuilder/build_p4080n710_release/work/ppce500mc-linux/binutils-oprofile-2.20.1-r0.2/binutils-2.20.1/bfd/doc/bfd.texinfo:337: unknown command `cygnus'

| make[3]: *** [bfd.info] Error 1

| make[3]: Leaving directory `/home/freescale/P4080-PCIE-SDK-1.0-05-03-2012/QorIQ-DPAA-SDK-20110609-systembuilder/build_p4080n710_release/work/ppce500mc-linux/binutils-oprofile-2.20.1-r0.2/binutils-2.20.1/build.powerpc-linux.powerpc-linux/bfd/doc'

| Making info in po

| make[3]: Entering directory `/home/freescale/P4080-PCIE-SDK-1.0-05-03-2012/QorIQ-DPAA-SDK-20110609-systembuilder/build_p4080n710_release/work/ppce500mc-linux/binutils-oprofile-2.20.1-r0.2/binutils-2.20.1/build.powerpc-linux.powerpc-linux/bfd/po'

| make[3]: Nothing to be done for `info'.

| make[3]: Leaving directory `/home/freescale/P4080-PCIE-SDK-1.0-05-03-2012/QorIQ-DPAA-SDK-20110609-systembuilder/build_p4080n710_release/work/ppce500mc-linux/binutils-oprofile-2.20.1-r0.2/binutils-2.20.1/build.powerpc-linux.powerpc-linux/bfd/po'

| make[3]: Entering directory `/home/freescale/P4080-PCIE-SDK-1.0-05-03-2012/QorIQ-DPAA-SDK-20110609-systembuilder/build_p4080n710_release/work/ppce500mc-linux/binutils-oprofile-2.20.1-r0.2/binutils-2.20.1/build.powerpc-linux.powerpc-linux/bfd'

| make[3]: Nothing to be done for `info-am'.

| make[3]: Leaving directory `/home/freescale/P4080-PCIE-SDK-1.0-05-03-2012/QorIQ-DPAA-SDK-20110609-systembuilder/build_p4080n710_release/work/ppce500mc-linux/binutils-oprofile-2.20.1-r0.2/binutils-2.20.1/build.powerpc-linux.powerpc-linux/bfd'

| make[2]: *** [info-recursive] Error 1

| make[2]: Leaving directory `/home/freescale/P4080-PCIE-SDK-1.0-05-03-2012/QorIQ-DPAA-SDK-20110609-systembuilder/build_p4080n710_release/work/ppce500mc-linux/binutils-oprofile-2.20.1-r0.2/binutils-2.20.1/build.powerpc-linux.powerpc-linux/bfd'

| make[1]: *** [all-bfd] Error 2

| make[1]: Leaving directory `/home/freescale/P4080-PCIE-SDK-1.0-05-03-2012/QorIQ-DPAA-SDK-20110609-systembuilder/build_p4080n710_release/work/ppce500mc-linux/binutils-oprofile-2.20.1-r0.2/binutils-2.20.1/build.powerpc-linux.powerpc-linux'

| make: *** [all] Error 2

| FATAL: oe_runmake failed

| ERROR: Function do_compile failed

NOTE: package binutils-oprofile-2.20.1-r0.2: task do_compile: Failed

ERROR: TaskFailed event exception, aborting

ERROR: Task 1487 (/home/freescale/P4080-PCIE-SDK-1.0-05-03-2012/QorIQ-DPAA-SDK-20110609-systembuilder/sb-core/recipes/binutils/binutils-oprofile_2.20.1.bb, do_compile) failed with 256

ERROR: '/home/freescale/P4080-PCIE-SDK-1.0-05-03-2012/QorIQ-DPAA-SDK-20110609-systembuilder/oe-core/recipes/db/db_5.0.21.bb' failed

ERROR: '/home/freescale/P4080-PCIE-SDK-1.0-05-03-2012/QorIQ-DPAA-SDK-20110609-systembuilder/sb-core/recipes/binutils/binutils-oprofile_2.20.1.bb' failed

ERROR: Build of /home/freescale/P4080-PCIE-SDK-1.0-05-03-2012/QorIQ-DPAA-SDK-20110609-systembuilder/sb-core/recipes/binutils/binutils-oprofile_2.20.1.bb do_compile failed

ERROR: Task 1487 (/home/freescale/P4080-PCIE-SDK-1.0-05-03-2012/QorIQ-DPAA-SDK-20110609-systembuilder/sb-core/recipes/binutils/binutils-oprofile_2.20.1.bb, do_compile) failed with 256

ERROR: '/home/freescale/P4080-PCIE-SDK-1.0-05-03-2012/QorIQ-DPAA-SDK-20110609-systembuilder/oe-core/recipes/db/db_5.0.21.bb' failed

ERROR: '/home/freescale/P4080-PCIE-SDK-1.0-05-03-2012/QorIQ-DPAA-SDK-20110609-systembuilder/sb-core/recipes/binutils/binutils-oprofile_2.20.1.bb' failed

ERROR: '/home/freescale/P4080-PCIE-SDK-1.0-05-03-2012/QorIQ-DPAA-SDK-20110609-systembuilder/oe-core/recipes/db/db_5.0.21.bb' failed

ERROR: '/home/freescale/P4080-PCIE-SDK-1.0-05-03-2012/QorIQ-DPAA-SDK-20110609-systembuilder/sb-core/recipes/binutils/binutils-oprofile_2.20.1.bb' failed

freescale@freescale-sdk:~/P4080-PCIE-SDK-1.0-05-03-2012/QorIQ-DPAA-SDK-20110609-systembuilder$

Outcomes