AnsweredAssumed Answered

QorIQ-v1.8 fix a patch failure that occured during bitbake? (0001-arm-ls102xa-Adjust-the-features-supported-in-SD-boot.patch)

Question asked by Dat Ho on Jul 16, 2015
Latest reply on Jul 21, 2015 by Dat Ho

I was running a bitbake fsl-image-core to build the images for the ls1021atwr release build and it completed with this error message.

 

If I don't have an SD card to boot from, should I be concerned about this issue?

 

NOTE: Applying patch '0001-arm-ls102xa-Adjust-the-features-supported-in-SD-boot.patch' (../../meta-fsl-arm/recipes-bsp/u-boot/u-boot-ls1/0001-arm-ls102xa-Adjust-the-features-supported-in-SD-boot.patch)

ERROR: Command Error: exit status: 1  Output:

Applying patch 0001-arm-ls102xa-Adjust-the-features-supported-in-SD-boot.patch

patching file board/freescale/ls1021aqds/ls1021aqds.c

Hunk #1 FAILED at 70.

Hunk #2 FAILED at 227.

Hunk #3 succeeded at 256 with fuzz 2 (offset 11 lines).

2 out of 3 hunks FAILED -- rejects in file board/freescale/ls1021aqds/ls1021aqds.c

patching file board/freescale/ls1021aqds/ls102xa_rcw_sd.cfg

Hunk #1 FAILED at 2.

1 out of 1 hunk FAILED -- rejects in file board/freescale/ls1021aqds/ls102xa_rcw_sd.cfg

patching file board/freescale/ls1021atwr/ls1021atwr.c

Hunk #1 FAILED at 82.

Hunk #2 FAILED at 123.

Hunk #3 FAILED at 234.

Hunk #4 FAILED at 446.

Hunk #5 FAILED at 537.

5 out of 5 hunks FAILED -- rejects in file board/freescale/ls1021atwr/ls1021atwr.c

patching file board/freescale/ls1021atwr/ls102xa_rcw_sd.cfg

Hunk #1 FAILED at 2.

1 out of 1 hunk FAILED -- rejects in file board/freescale/ls1021atwr/ls102xa_rcw_sd.cfg

patching file include/configs/ls1021aqds.h

Hunk #1 FAILED at 49.

Hunk #2 FAILED at 75.

Hunk #3 FAILED at 90.

Hunk #4 FAILED at 166.

Hunk #5 FAILED at 413.

Hunk #6 succeeded at 433 with fuzz 2 (offset -3 lines).

Hunk #7 FAILED at 527.

6 out of 7 hunks FAILED -- rejects in file include/configs/ls1021aqds.h

patching file include/configs/ls1021atwr.h

Hunk #1 FAILED at 102.

Hunk #2 FAILED at 131.

Hunk #3 FAILED at 265.

Hunk #4 succeeded at 267 with fuzz 2 (offset -10 lines).

Hunk #5 FAILED at 350.

4 out of 5 hunks FAILED -- rejects in file include/configs/ls1021atwr.h

Patch 0001-arm-ls102xa-Adjust-the-features-supported-in-SD-boot.patch does not apply (enforce with -f)

DEBUG: Python function patch_do_patch finished

DEBUG: Python function do_patch finished

ERROR: Function failed: patch_do_patch

Outcomes