AnsweredAssumed Answered

LTIB compile question!!!

Question asked by 宁 朱 on Nov 29, 2014
Latest reply on Nov 30, 2014 by Yuri Muhin

Hi!

I am a newer in imx6q,when i compile the LTIB, occur a question! how to sovle this problem !thanks a lot!

 

 

/usr/include/gnu/stubs.h:7:27: fatal error: gnu/stubs-32.h: No such file or directory

compilation terminated.

In file included from /usr/include/features.h:389:0,

                 from /usr/include/string.h:27,

                 from htmlanchor.c:25:

/usr/include/gnu/stubs.h:7:27: fatal error: gnu/stubs-32.h: No such file or directory

compilation terminated.

make[2]: *** [gtkhtml-embedded.lo] Error 1

make[2]: *** [htmlanchor.lo] Error 1

make[2]: Leaving directory `/opt/freescale/ltib/ltib/rpm/BUILD/gtkhtml-3.24.2/gtkhtml'

make[1]: *** [all-recursive] Error 1

make[1]: Leaving directory `/opt/freescale/ltib/ltib/rpm/BUILD/gtkhtml-3.24.2'

make: *** [all] Error 2

error: Bad exit status from /opt/freescale/ltib/ltib/tmp/rpm-tmp.62634 (%build)

 

 

RPM build errors:

    Bad exit status from /opt/freescale/ltib/ltib/tmp/rpm-tmp.62634 (%build)

Build time for gtkhtml: 10 seconds

 

Failed building gtkhtml

 

 

f_buildrpms() returned an error, exiting

traceback:

main:572

 

 

Started: Sun Nov 30 00:28:15 2014

Ended:   Sun Nov 30 00:28:27 2014

Elapsed: 12 seconds

 

These packages failed to build:

gtkhtml

 

Build Failed

Outcomes