AnsweredAssumed Answered

imx6_L3.0.35_4.1.0_130816_source_hal_Error

Question asked by allen lai on Sep 19, 2014
Latest reply on Sep 23, 2014 by alejandrolozano

Dear All :

I'm try to build 『hal』, but it show error message as follows.

why ?

 

 

make[4]: *** [create_cache.o] Error 1

make[4]: Leaving directory `/home/shinsoft/ltib/rpm/BUILD/hal-0.5.10/hald'

make[3]: *** [all-recursive] Error 1

make[3]: Leaving directory `/home/shinsoft/ltib/rpm/BUILD/hal-0.5.10/hald'

make[2]: *** [all] Error 2

make[2]: Leaving directory `/home/shinsoft/ltib/rpm/BUILD/hal-0.5.10/hald'

make[1]: *** [all-recursive] Error 1

make[1]: Leaving directory `/home/shinsoft/ltib/rpm/BUILD/hal-0.5.10'

make: *** [all] Error 2

error: Bad exit status from /home/shinsoft/ltib/tmp/rpm-tmp.70364 (%build)

 

RPM build errors:

    Bad exit status from /home/shinsoft/ltib/tmp/rpm-tmp.70364 (%build)

Build time for hal: 6 seconds

 

Failed building hal

 

f_buildrpms() returned an error, exiting

traceback:

main:572

 

Started: Fri Sep 19 15:48:52 2014

Ended:   Fri Sep 19 15:49:27 2014

Elapsed: 35 seconds

 

These packages failed to build:

hal

 

Build Failed

 

Exiting on error or interrupt

Outcomes