AnsweredAssumed Answered

fsl-image-x11 target is not building...

Question asked by SANJEET KARN on Jul 29, 2014
Latest reply on Jul 10, 2015 by Tom Hochstein

I am trying to build fsl-image-x11 target.... we are getting following error....

but when we are building core-image-minimal , it is building successfully in same procedure.

 

bitbake -k fsl-image-x11

Loading cache: 100% |##########################################################################################################| ETA:  00:00:00

Loaded 2005 entries from dependency cache.

NOTE: Resolving any missing task queue dependencies

NOTE: multiple providers are available for jpeg (jpeg, libjpeg-turbo)

NOTE: consider defining a PREFERRED_PROVIDER entry to match jpeg

NOTE: multiple providers are available for jpeg-native (jpeg-native, libjpeg-turbo-native)

NOTE: consider defining a PREFERRED_PROVIDER entry to match jpeg-native

 

Build Configuration:

BB_VERSION        = "1.20.0"

BUILD_SYS         = "i686-linux"

NATIVELSBSTRING   = "Ubuntu-12.04"

TARGET_SYS        = "arm-poky-linux-gnueabi"

MACHINE           = "imx6slevk"

DISTRO            = "poky"

DISTRO_VERSION    = "1.5.1"

TUNE_FEATURES     = "armv7a vfp neon callconvention-hard cortexa9"

TARGET_FPU        = "vfp-neon"

meta             

meta-yocto        = "(nobranch):bee7e3756adf70edaeabe9d43166707aab84f581"

meta-oe           = "(nobranch):eb4563b83be0a57ede4269ab19688af6baa62cd2"

meta-fsl-arm      = "(nobranch):af392c22bf6b563525ede4a81b6755ff1dd2c1c6"

meta-fsl-arm-extra = "(nobranch):07ad83db0fb67c5023bd627a61efb7f474c52622"

meta-fsl-demos    = "(nobranch):5a12677ad000a926d23c444266722a778ea228a7"

meta-fsl-arm     

meta-fsl-demos    = "(nobranch):16c911d80ade96702e3c42ce97f1d69069576bdc"

meta-browser      = "(nobranch):fc3969f63bda343c38c40a23f746c560c4735f3e"

meta-gnome       

meta-networking   = "(nobranch):eb4563b83be0a57ede4269ab19688af6baa62cd2"

 

NOTE: Preparing runqueue

NOTE: Executing SetScene Tasks

NOTE: Executing RunQueue Tasks

ERROR: Function failed: do_compile (log file is located at /u01/project/imx6SoloLite/imx6QtBuild/fsl-release-bsp/build/tmp/work/i686-linux/docbook-utils-native/0.6.14-r3/temp/log.do_compile.30640)

ERROR: Logfile of failure stored in: /u01/project/imx6SoloLite/imx6QtBuild/fsl-release-bsp/build/tmp/work/i686-linux/docbook-utils-native/0.6.14-r3/temp/log.do_compile.30640

Log data follows:

| DEBUG: Executing shell function do_compile

| NOTE: make -j 4

| Making all in backends

| make[1]: Entering directory `/u01/project/imx6SoloLite/imx6QtBuild/fsl-release-bsp/build/tmp/work/i686-linux/docbook-utils-native/0.6.14-r3/build/backends'

| make[1]: Nothing to be done for `all'.

| make[1]: Leaving directory `/u01/project/imx6SoloLite/imx6QtBuild/fsl-release-bsp/build/tmp/work/i686-linux/docbook-utils-native/0.6.14-r3/build/backends'

| Making all in bin

| make[1]: Entering directory `/u01/project/imx6SoloLite/imx6QtBuild/fsl-release-bsp/build/tmp/work/i686-linux/docbook-utils-native/0.6.14-r3/build/bin'

| make[1]: Nothing to be done for `all'.

| make[1]: Leaving directory `/u01/project/imx6SoloLite/imx6QtBuild/fsl-release-bsp/build/tmp/work/i686-linux/docbook-utils-native/0.6.14-r3/build/bin'

| Making all in doc

| make[1]: Entering directory `/u01/project/imx6SoloLite/imx6QtBuild/fsl-release-bsp/build/tmp/work/i686-linux/docbook-utils-native/0.6.14-r3/build/doc'

| Making all in refentry

| make[2]: Entering directory `/u01/project/imx6SoloLite/imx6QtBuild/fsl-release-bsp/build/tmp/work/i686-linux/docbook-utils-native/0.6.14-r3/build/doc/refentry'

| make[2]: Nothing to be done for `all'.

| make[2]: Leaving directory `/u01/project/imx6SoloLite/imx6QtBuild/fsl-release-bsp/build/tmp/work/i686-linux/docbook-utils-native/0.6.14-r3/build/doc/refentry'

| Making all in man

| make[2]: Entering directory `/u01/project/imx6SoloLite/imx6QtBuild/fsl-release-bsp/build/tmp/work/i686-linux/docbook-utils-native/0.6.14-r3/build/doc/man'

| make[2]: Nothing to be done for `all'.

| make[2]: Leaving directory `/u01/project/imx6SoloLite/imx6QtBuild/fsl-release-bsp/build/tmp/work/i686-linux/docbook-utils-native/0.6.14-r3/build/doc/man'

| Making all in HTML

| make[2]: Entering directory `/u01/project/imx6SoloLite/imx6QtBuild/fsl-release-bsp/build/tmp/work/i686-linux/docbook-utils-native/0.6.14-r3/build/doc/HTML'

| SGML_CATALOG_FILES=/u01/project/imx6SoloLite/imx6QtBuild/fsl-release-bsp/build/tmp/sysroots/i686-linux/etc/sgml/catalog \

|     SGML_SEARCH_PATH=/u01/project/imx6SoloLite/imx6QtBuild/fsl-release-bsp/build/tmp/work/i686-linux/docbook-utils-native/0.6.14-r3/docbook-utils-0.6.14:/u01/project/imx6SoloLite/imx6QtBuild/fsl-release-bsp/build/tmp/work/i686-linux/docbook-utils-native/0.6.14-r3/docbook-utils-0.6.14/doc:.. \

|         jade -t sgml -i html -d /u01/project/imx6SoloLite/imx6QtBuild/fsl-release-bsp/build/tmp/work/i686-linux/docbook-utils-native/0.6.14-r3/docbook-utils-0.6.14/docbook-utils.dsl\#html \

|             -V '%use-id-as-filename%' /u01/project/imx6SoloLite/imx6QtBuild/fsl-release-bsp/build/tmp/work/i686-linux/docbook-utils-native/0.6.14-r3/docbook-utils-0.6.14/doc/docbook-utils.sgml

| SGML_CATALOG_FILES=/u01/project/imx6SoloLite/imx6QtBuild/fsl-release-bsp/build/tmp/sysroots/i686-linux/etc/sgml/catalog \

|     SGML_SEARCH_PATH=/u01/project/imx6SoloLite/imx6QtBuild/fsl-release-bsp/build/tmp/work/i686-linux/docbook-utils-native/0.6.14-r3/docbook-utils-0.6.14:/u01/project/imx6SoloLite/imx6QtBuild/fsl-release-bsp/build/tmp/work/i686-linux/docbook-utils-native/0.6.14-r3/docbook-utils-0.6.14/doc:.. \

|         jade -t sgml -i html -d /u01/project/imx6SoloLite/imx6QtBuild/fsl-release-bsp/build/tmp/work/i686-linux/docbook-utils-native/0.6.14-r3/docbook-utils-0.6.14/docbook-utils.dsl\#html \

|             -V '%use-id-as-filename%' /u01/project/imx6SoloLite/imx6QtBuild/fsl-release-bsp/build/tmp/work/i686-linux/docbook-utils-native/0.6.14-r3/docbook-utils-0.6.14/doc/docbook-utils.sgml

| SGML_CATALOG_FILES=/u01/project/imx6SoloLite/imx6QtBuild/fsl-release-bsp/build/tmp/sysroots/i686-linux/etc/sgml/catalog \

|     SGML_SEARCH_PATH=/u01/project/imx6SoloLite/imx6QtBuild/fsl-release-bsp/build/tmp/work/i686-linux/docbook-utils-native/0.6.14-r3/docbook-utils-0.6.14:/u01/project/imx6SoloLite/imx6QtBuild/fsl-release-bsp/build/tmp/work/i686-linux/docbook-utils-native/0.6.14-r3/docbook-utils-0.6.14/doc:.. \

|         jade -t sgml -i html -d /u01/project/imx6SoloLite/imx6QtBuild/fsl-release-bsp/build/tmp/work/i686-linux/docbook-utils-native/0.6.14-r3/docbook-utils-0.6.14/docbook-utils.dsl\#html \

|             -V '%use-id-as-filename%' /u01/project/imx6SoloLite/imx6QtBuild/fsl-release-bsp/build/tmp/work/i686-linux/docbook-utils-native/0.6.14-r3/docbook-utils-0.6.14/doc/docbook-utils.sgml

| SGML_CATALOG_FILES=/u01/project/imx6SoloLite/imx6QtBuild/fsl-release-bsp/build/tmp/sysroots/i686-linux/etc/sgml/catalog \

|     SGML_SEARCH_PATH=/u01/project/imx6SoloLite/imx6QtBuild/fsl-release-bsp/build/tmp/work/i686-linux/docbook-utils-native/0.6.14-r3/docbook-utils-0.6.14:/u01/project/imx6SoloLite/imx6QtBuild/fsl-release-bsp/build/tmp/work/i686-linux/docbook-utils-native/0.6.14-r3/docbook-utils-0.6.14/doc:.. \

|         jade -t sgml -i html -d /u01/project/imx6SoloLite/imx6QtBuild/fsl-release-bsp/build/tmp/work/i686-linux/docbook-utils-native/0.6.14-r3/docbook-utils-0.6.14/docbook-utils.dsl\#html \

|             -V '%use-id-as-filename%' /u01/project/imx6SoloLite/imx6QtBuild/fsl-release-bsp/build/tmp/work/i686-linux/docbook-utils-native/0.6.14-r3/docbook-utils-0.6.14/doc/docbook-utils.sgml

| jade: symbol lookup error: /u01/project/imx6SoloLite/imx6QtBuild/fsl-release-bsp/build/tmp/sysroots/i686-linux/usr/bin/../../usr/lib/libospgrove.so.0: undefined symbol: _ZN14OpenJade_Grove8ClassDef12sgmlDocumentE

| jade: symbol lookup error: /u01/project/imx6SoloLite/imx6QtBuild/fsl-release-bsp/build/tmp/sysroots/i686-linux/usr/bin/../../usr/lib/libospgrove.so.0: undefined symbol: _ZN14OpenJade_Grove8ClassDef12sgmlDocumentE

| make[2]: *** [docbook2texi.html] Error 127

| make[2]: *** Waiting for unfinished jobs....

| make[2]: *** [backend-spec.html] Error 127

| jade: symbol lookup error: /u01/project/imx6SoloLite/imx6QtBuild/fsl-release-bsp/build/tmp/sysroots/i686-linux/usr/bin/../../usr/lib/libospgrove.so.0: undefined symbol: _ZN14OpenJade_Grove8ClassDef12sgmlDocumentE

| make[2]: jade: symbol lookup error: /u01/project/imx6SoloLite/imx6QtBuild/fsl-release-bsp/build/tmp/sysroots/i686-linux/usr/bin/../../usr/lib/libospgrove.so.0: undefined symbol: _ZN14OpenJade_Grove8ClassDef12sgmlDocumentE

| *** [docbook2man.html] Error 127

| make[2]: *** [api.html] Error 127

| make[2]: Leaving directory `/u01/project/imx6SoloLite/imx6QtBuild/fsl-release-bsp/build/tmp/work/i686-linux/docbook-utils-native/0.6.14-r3/build/doc/HTML'

| make[1]: *** [all-recursive] Error 1

| make[1]: Leaving directory `/u01/project/imx6SoloLite/imx6QtBuild/fsl-release-bsp/build/tmp/work/i686-linux/docbook-utils-native/0.6.14-r3/build/doc'

| make: *** [all-recursive] Error 1

| ERROR: oe_runmake failed

| WARNING: exit code 1 from a shell command.

| ERROR: Function failed: do_compile (log file is located at /u01/project/imx6SoloLite/imx6QtBuild/fsl-release-bsp/build/tmp/work/i686-linux/docbook-utils-native/0.6.14-r3/temp/log.do_compile.30640)

ERROR: Task 5999 (/u01/project/imx6SoloLite/imx6QtBuild/fsl-release-bsp/sources/poky/meta/recipes-devtools/docbook-utils/docbook-utils-native_0.6.14.bb, do_compile) failed with exit code '1'

ERROR: Function failed: do_install (log file is located at /u01/project/imx6SoloLite/imx6QtBuild/fsl-release-bsp/build/tmp/work/cortexa9hf-vfp-neon-poky-linux-gnueabi/gtkperf/0.40-r0/temp/log.do_install.30672)

ERROR: Logfile of failure stored in: /u01/project/imx6SoloLite/imx6QtBuild/fsl-release-bsp/build/tmp/work/cortexa9hf-vfp-neon-poky-linux-gnueabi/gtkperf/0.40-r0/temp/log.do_install.30672

Log data follows:

| DEBUG: SITE files ['endian-little', 'bit-32', 'arm-common', 'common-linux', 'common-glibc', 'arm-linux', 'arm-linux-gnueabi', 'common']

| DEBUG: Executing shell function do_install

| NOTE: make -j 4 DESTDIR=/u01/project/imx6SoloLite/imx6QtBuild/fsl-release-bsp/build/tmp/work/cortexa9hf-vfp-neon-poky-linux-gnueabi/gtkperf/0.40-r0/image install

| make: *** No rule to make target `install'.  Stop.

| ERROR: oe_runmake failed

| WARNING: exit code 1 from a shell command.

| ERROR: Function failed: do_install (log file is located at /u01/project/imx6SoloLite/imx6QtBuild/fsl-release-bsp/build/tmp/work/cortexa9hf-vfp-neon-poky-linux-gnueabi/gtkperf/0.40-r0/temp/log.do_install.30672)

ERROR: Task 533 (/u01/project/imx6SoloLite/imx6QtBuild/fsl-release-bsp/sources/meta-fsl-bsp-release/imx/meta-fsl-demos/recipes-graphics/gtkperf/gtkperf_0.40.bb, do_install) failed with exit code '1'

NOTE: Tasks Summary: Attempted 6460 tasks of which 6364 didn't need to be rerun and 2 failed.

No currently running tasks (6460 of 6709)

 

Summary: 2 tasks failed:

  /u01/project/imx6SoloLite/imx6QtBuild/fsl-release-bsp/sources/poky/meta/recipes-devtools/docbook-utils/docbook-utils-native_0.6.14.bb, do_compile

  /u01/project/imx6SoloLite/imx6QtBuild/fsl-release-bsp/sources/meta-fsl-bsp-release/imx/meta-fsl-demos/recipes-graphics/gtkperf/gtkperf_0.40.bb, do_install

Summary: There were 2 ERROR messages shown, returning a non-zero exit code.

Outcomes