AnsweredAssumed Answered

Error compiling gst-plugins-good

Question asked by Javier Valcarce on Sep 3, 2013
Latest reply on Feb 25, 2014 by Yixing Kong

Hi all.

I'm trying to compile gst-plugins-good package but i get the following error.

cairo_overlay.c:27:19: fatal error: cairo.h: No such file or directory

 

Can anyone help me?

 

I have read gst-fsl-plugins build failed

I have tried to comment "export lines" at *.spec file but the result is the same.

 

 

...

...

make -C v4l2

make -C cairo

make[4]: Entering directory `/home/javier/ltib/rpm/BUILD/gst-plugins-good-0.10.30/tests/examples/rtp'

make[4]: Entering directory `/home/javier/ltib/rpm/BUILD/gst-plugins-good-0.10.30/tests/examples/cairo'

  CC     cairo_overlay-cairo_overlay.o

make[4]: Nothing to be done for `all'.

make[4]: Leaving directory `/home/javier/ltib/rpm/BUILD/gst-plugins-good-0.10.30/tests/examples/rtp'

make[4]: Entering directory `/home/javier/ltib/rpm/BUILD/gst-plugins-good-0.10.30/tests/examples/shapewipe'

make[4]: Nothing to be done for `all'.

make[4]: Leaving directory `/home/javier/ltib/rpm/BUILD/gst-plugins-good-0.10.30/tests/examples/shapewipe'

make[4]: Entering directory `/home/javier/ltib/rpm/BUILD/gst-plugins-good-0.10.30/tests/examples/equalizer'

make[4]: Nothing to be done for `all'.

make[4]: Leaving directory `/home/javier/ltib/rpm/BUILD/gst-plugins-good-0.10.30/tests/examples/equalizer'

make[4]: Entering directory `/home/javier/ltib/rpm/BUILD/gst-plugins-good-0.10.30/tests/examples/v4l2'

make[4]: Nothing to be done for `all'.

make[4]: Leaving directory `/home/javier/ltib/rpm/BUILD/gst-plugins-good-0.10.30/tests/examples/v4l2'

make[4]: Entering directory `/home/javier/ltib/rpm/BUILD/gst-plugins-good-0.10.30/tests/examples/spectrum'

make[4]: Nothing to be done for `all'.

make[4]: Leaving directory `/home/javier/ltib/rpm/BUILD/gst-plugins-good-0.10.30/tests/examples/spectrum'

cairo_overlay.c:27:19: fatal error: cairo.h: No such file or directory

compilation terminated.

make[4]: *** [cairo_overlay-cairo_overlay.o] Error 1

make[4]: Leaving directory `/home/javier/ltib/rpm/BUILD/gst-plugins-good-0.10.30/tests/examples/cairo'

make[3]: *** [cairo] Error 2

make[3]: Leaving directory `/home/javier/ltib/rpm/BUILD/gst-plugins-good-0.10.30/tests/examples'

make[2]: *** [all-recursive] Error 1

make[2]: Leaving directory `/home/javier/ltib/rpm/BUILD/gst-plugins-good-0.10.30/tests'

make[1]: *** [all-recursive] Error 1

make[1]: Leaving directory `/home/javier/ltib/rpm/BUILD/gst-plugins-good-0.10.30'

make: *** [all] Error 2

error: Bad exit status from /home/javier/ltib/tmp/rpm-tmp.47999 (%build)

 

 

 

 

RPM build errors:

    Bad exit status from /home/javier/ltib/tmp/rpm-tmp.47999 (%build)

Build time for gst-plugins-good: 19 seconds

 

 

Failed building gst-plugins-good

 

 

 

 

f_buildrpms() returned an error, exiting

traceback:

main:572

 

 

 

 

Started: Tue Sep  3 17:00:13 2013

Ended:   Tue Sep  3 17:00:35 2013

Elapsed: 22 seconds

 

 

These packages failed to build:

gst-plugins-good

 

 

Build Failed

 

 

Exiting on error or interrupt

Outcomes