Y B Varadharajan

ltib for imx51 board - ltib error

Discussion created by Y B Varadharajan on Nov 17, 2011
Latest reply on Nov 18, 2011 by KrishnaPavan

fsl_shw_rand.c:46:24: error: shw_driver.h: No such file or directory
fsl_shw_rand.c:49: error: expected '=', ',', ';', 'asm' or '__attribute__' before 'validate_uco'
fsl_shw_rand.c:56: error: expected '=', ',', ';', 'asm' or '__attribute__' before 'fsl_shw_get_random'
fsl_shw_rand.c:84: error: expected '=', ',', ';', 'asm' or '__attribute__' before 'fsl_shw_add_entropy'
make[1]: *** [fsl_shw_rand.o] Error 1
make[1]: Leaving directory `/home/auto/Varadharajan/YBV/L2.6.31_09.12.00_SDK_source/Nov16/ltib/rpm/BUILD/imx-lib-09.12.00/rng'
make: *** [rng] Error 2
error: Bad exit status from /home/auto/Varadharajan/YBV/L2.6.31_09.12.00_SDK_source/Nov16/ltib/tmp/rpm-tmp.84200 (%build)


RPM build errors:
    Bad exit status from /home/auto/Varadharajan/YBV/L2.6.31_09.12.00_SDK_source/Nov16/ltib/tmp/rpm-tmp.84200 (%build)
Build time for imx-lib: 0 seconds

Failed building imx-lib


f_buildrpms() returned an error, exiting
traceback:
 main:560


Started: Thu Nov 17 12:36:37 2011
Ended:   Thu Nov 17 12:37:28 2011
Elapsed: 51 seconds

These packages failed to build:
imx-lib

Build Failed

Outcomes