ltib 'FSL gnome release package' build fails at gtk2 phase

显示  仅  | 搜索替代 

ltib 'FSL gnome release package' build fails at gtk2 phase

960 次查看
Contributor I


I've been able to hack my way through this build so far with a little help from Google and this forum- but this one has me stumped...  somehow the Makefile is interpreting "no" as a command and there is no "no" that I've ever heard of.

I see that it is building "demos"- probably not needed- would anyone have a suggestion about possibly removing the demos section from the Makefile??

Output below:

Making all in demos
make[2]: Entering directory `/home/robb/ARM_board/L2.6.35_11.09.01_ER_source/ltib/rpm/BUILD/gtk+-2.14.3/demos'
no --raw --build-list        \
            apple_red  ./apple-red.png    \
                gnome_foot ./gnome-foot.png    \
        > test-inline-pixbufs.h                \
    || (rm -f test-inline-pixbufs.h && false)
/bin/bash: no: command not found
make[2]: *** [test-inline-pixbufs.h] Error 1
make[2]: Leaving directory `/home/robb/ARM_board/L2.6.35_11.09.01_ER_source/ltib/rpm/BUILD/gtk+-2.14.3/demos'
make[1]: *** [all-recursive] Error 1
make[1]: Leaving directory `/home/robb/ARM_board/L2.6.35_11.09.01_ER_source/ltib/rpm/BUILD/gtk+-2.14.3'
make: *** [all] Error 2
error: Bad exit status from /home/robb/ARM_board/L2.6.35_11.09.01_ER_source/ltib/tmp/rpm-tmp.26722 (%build)

RPM build errors:
    Bad exit status from /home/robb/ARM_board/L2.6.35_11.09.01_ER_source/ltib/tmp/rpm-tmp.26722 (%build)
Build time for gtk2: 78 seconds

Failed building gtk2

f_buildrpms() returned an error, exiting

Started: Thu May  3 14:22:40 2012
Ended:   Thu May  3 14:23:58 2012
Elapsed: 78 seconds

These packages failed to build:

标签 (1)
0 项奖励
2 回复数

528 次查看
Contributor I

Great- that worked!  Thanks for the tip and also pointing me to   Great site!

0 项奖励

528 次查看
NXP Employee
NXP Employee

Look here at the first entry:

0 项奖励