Duplicate error in dtb file imx8mm

cancel
Showing results for 
Search instead for 
Did you mean: 

Duplicate error in dtb file imx8mm

479 Views
Ruban1
Contributor II

DTC arch/arm64/boot/dts/freescale/imx8mm-evk-ak4497.dtb
DTC arch/arm64/boot/dts/freescale/imx8mm-evk-ak5558.dtb
/home/ruban/Desktop/add_GPIO/imx-android-10.0.0_2.3.0/android_build/vendor/nxp-opensource/kernel_imx/arch/arm64/boot/dts/freescale/imx8mm-evk-ak4497.dts:36.32-51.4: ERROR (duplicate_label): /soc@0/bus@30000000/pinctrl@30330000/sai1grp_dsd: Duplicate label 'pinctrl_sai1_dsd' on /soc@0/bus@30000000/pinctrl@30330000/sai1grp_dsd and /soc@0/bus@30000000/pinctrl@30330000/imx8mm-evk/sai1grp_dsd
ERROR: Input tree has errors, aborting (use -f to force output)
make[4]: *** [scripts/Makefile.lib:285: arch/arm64/boot/dts/freescale/imx8mm-evk-ak4497.dtb] Error 2
make[4]: *** Waiting for unfinished jobs....
make[3]: *** [/home/ruban/Desktop/add_GPIO/imx-android-10.0.0_2.3.0/android_build/vendor/nxp-opensource/kernel_imx/scripts/Makefile.build:556: arch/arm64/boot/dts/freescale] Error 2
make[2]: *** [/home/ruban/Desktop/add_GPIO/imx-android-10.0.0_2.3.0/android_build/vendor/nxp-opensource/kernel_imx/Makefile:1309: dtbs] Error 2
make[2]: Leaving directory '/home/ruban/Desktop/add_GPIO/imx-android-10.0.0_2.3.0/android_build/out/target/product/evk_8mm/obj/KERNEL_OBJ'
make[1]: *** [Makefile:179: sub-make] Error 2
make[1]: Leaving directory '/home/ruban/Desktop/add_GPIO/imx-android-10.0.0_2.3.0/android_build/vendor/nxp-opensource/kernel_imx'
make: *** [/home/ruban/Desktop/add_GPIO/imx-android-10.0.0_2.3.0/android_build/device/fsl/common/build/kernel.mk:164: /home/ruban/Desktop/add_GPIO/imx-android-10.0.0_2.3.0/android_build/out/target/product/evk_8mm/obj/KERNEL_OBJ/arch/arm64/boot/Image] Error 2
make: Leaving directory '/home/ruban/Desktop/add_GPIO/imx-android-10.0.0_2.3.0/android_build'

 

Getting breaked

0 Kudos
8 Replies

470 Views
Qmiller
NXP Employee
NXP Employee

Please attach your imx8mm-evk-ak4497.dts

0 Kudos

457 Views
Ruban1
Contributor II

i am not able to understand what duplicate error

i wil attach both .dts file

 If there is anything to edit or change kindly let me know

0 Kudos

449 Views
Qmiller
NXP Employee
NXP Employee

You can delete this codec dts to pass through this error if you don't use it.

0 Kudos

445 Views
Ruban1
Contributor II

which is codec file evk or evk-ak4497

 

0 Kudos

443 Views
Qmiller
NXP Employee
NXP Employee

evk-ak4497

0 Kudos

438 Views
Ruban1
Contributor II

i tried is continued but it stopped with different error. i have attached  below


63% 68949/108660] AAPT2 compile out/target/common/obj/APPS/CactusPlayer_intermediates/flat-res/vendor/nxp/imx_android_mm/CactusPlayer/res/drawable_readme.txt.flat <- vendor/nxp/imx_android_mm/CactusPlayer/res/drawable/readme.txt
[ 63% 68950/108660] AAPT2 compile out/target/common/obj/APPS/CactusPlayer_intermediates/flat-res/vendor/nxp/imx_android_mm/CactusPlayer/res/drawable_pause.png.flat <- vendor/nxp/imx_android_mm/CactusPlayer/res/drawable/pause.png
ninja: build stopped: subcommand failed.
15:07:15 ninja failed with: exit status 1

#### failed to build some targets (01:43:32 (hh:mm:ss)) ####

 

0 Kudos

467 Views
Ruban1
Contributor II

how to attach. its already there in that folder and i dint even edit that file

0 Kudos

463 Views
Ruban1
Contributor II

its coming out of the loop and not entering the loop back

0 Kudos