<?xml version="1.0" encoding="UTF-8"?>
<rss xmlns:content="http://purl.org/rss/1.0/modules/content/" xmlns:dc="http://purl.org/dc/elements/1.1/" xmlns:rdf="http://www.w3.org/1999/02/22-rdf-syntax-ns#" xmlns:taxo="http://purl.org/rss/1.0/modules/taxonomy/" version="2.0">
  <channel>
    <title>S32 Design Studio中的主题 Re: Build project get arm-none-eabi-gcc.exe: error: nano.specs: No such file or directory</title>
    <link>https://community.nxp.com/t5/S32-Design-Studio/Build-project-get-arm-none-eabi-gcc-exe-error-nano-specs-No-such/m-p/2130781#M13597</link>
    <description>&lt;BR /&gt;Changing your compiler version to 10.2 will resolve this issue.</description>
    <pubDate>Wed, 09 Jul 2025 09:05:27 GMT</pubDate>
    <dc:creator>molo</dc:creator>
    <dc:date>2025-07-09T09:05:27Z</dc:date>
    <item>
      <title>Build project get arm-none-eabi-gcc.exe: error: nano.specs: No such file or directory</title>
      <link>https://community.nxp.com/t5/S32-Design-Studio/Build-project-get-arm-none-eabi-gcc-exe-error-nano-specs-No-such/m-p/1772037#M11521</link>
      <description>&lt;P&gt;I try to build a project and get this failure:&lt;/P&gt;&lt;P&gt;/usr/bin/make --no-print-directory main-build&lt;BR /&gt;Building file: ../src/uds_stack/uds/src/dtc_cfg.c&lt;BR /&gt;Building file: ../src/uds_stack/uds/src/dtcmgr.c&lt;BR /&gt;Building file: ../src/uds_stack/uds/src/uds_app.c&lt;BR /&gt;Invoking: Standard S32DS C Compiler&lt;BR /&gt;arm-none-eabi-gcc "@src/uds_stack/uds/src/dtc_cfg.args" -MMD -MP -MF"src/uds_stack/uds/src/dtc_cfg.d" -MT"src/uds_stack/uds/src/dtc_cfg.o" -o "src/uds_stack/uds/src/dtc_cfg.o" "../src/uds_stack/uds/src/dtc_cfg.c"&lt;BR /&gt;Invoking: Standard S32DS C Compiler&lt;BR /&gt;arm-none-eabi-gcc "@src/uds_stack/uds/src/dtc_cfg.args" -MMD -MP -MF"src/uds_stack/uds/src/dtcmgr.d" -MT"src/uds_stack/uds/src/dtcmgr.o" -o "src/uds_stack/uds/src/dtcmgr.o" "../src/uds_stack/uds/src/dtcmgr.c"&lt;BR /&gt;Invoking: Standard S32DS C Compiler&lt;BR /&gt;arm-none-eabi-gcc "@src/uds_stack/uds/src/dtc_cfg.args" -MMD -MP -MF"src/uds_stack/uds/src/uds_app.d" -MT"src/uds_stack/uds/src/uds_app.o" -o "src/uds_stack/uds/src/uds_app.o" "../src/uds_stack/uds/src/uds_app.c"&lt;BR /&gt;&lt;FONT color="#FF0000"&gt;&lt;STRONG&gt;arm-none-eabi-gcc.exe: error: nano.specs: No such file or directory&lt;/STRONG&gt;&lt;/FONT&gt;&lt;BR /&gt;make[1]: *** [src/uds_stack/uds/src/subdir.mk:33: src/uds_stack/uds/src/dtc_cfg.o] Error 1&lt;BR /&gt;make[1]: *** Waiting for unfinished jobs....&lt;BR /&gt;&lt;BR /&gt;&lt;/P&gt;&lt;P&gt;I try to add the binary file in the environment path. But still get the same result. My S32 DS version is:&lt;/P&gt;&lt;P&gt;S32 Design Studio for S32 Platform&lt;/P&gt;&lt;P&gt;Version 3.5&lt;/P&gt;&lt;P&gt;Build id:220726&lt;/P&gt;&lt;P&gt;&lt;FONT color="#0000FF"&gt;&lt;STRONG&gt;nano.specs&lt;/STRONG&gt; &lt;/FONT&gt;is located in&amp;nbsp;C:\NXP\S32DS.3.5\S32DS\build_tools\gcc_b1620\gcc-6.3-arm32-eabi\arm-none-eabi\newlib&lt;/P&gt;&lt;P&gt;&lt;STRONG&gt;&lt;FONT color="#0000FF"&gt;arm-none-eabi-gcc.exe&lt;/FONT&gt;&lt;/STRONG&gt; is located in&amp;nbsp;C:\NXP\S32DS.3.5\S32DS\build_tools\gcc_b1620\gcc-6.3-arm32-eabi\bin&lt;/P&gt;&lt;P&gt;I add this in my environment path.&lt;/P&gt;&lt;P&gt;My environment path is:&lt;/P&gt;&lt;P&gt;C:\NXP\S32DS.3.5\eclipse;&lt;BR /&gt;C:\NXP\S32DS.3.5\S32DS\build_tools\msys32\usr\bin;&lt;BR /&gt;C:\NXP\S32DS.3.5\S32DS\build_tools\gcc_b1620\gcc-6.3-arm32-eabi\arm-none-eabi\newlib;&lt;BR /&gt;C:\NXP\S32DS.3.5\S32DS\build_tools\gcc_b1620\gcc-6.3-arm32-eabi\bin&lt;BR /&gt;C:/NXP/S32DS.3.5/eclipse/jre/bin/client;&lt;BR /&gt;C:/NXP/S32DS.3.5/eclipse/jre/bin;&lt;BR /&gt;C:\Program Files\Common Files\Oracle\Java\javapath;&lt;BR /&gt;C:\Program Files (x86)\Common Files\Oracle\Java\javapath;&lt;BR /&gt;C:\Windows\system32;&lt;BR /&gt;C:\Windows;&lt;BR /&gt;C:\Windows\System32\Wbem;&lt;BR /&gt;C:\Windows\System32\WindowsPowerShell\v1.0\;&lt;BR /&gt;C:\Windows\System32\OpenSSH\;&lt;BR /&gt;C:\Users\abc\AppData\Local\Programs\Python\Python38\Scripts;&lt;BR /&gt;C:\Users\abc\AppData\Local\Programs\Python;&lt;BR /&gt;C:\Program Files\Git\cmd;&lt;BR /&gt;C:\Program Files\Microsoft SQL Server\150\Tools\Binn\;&lt;BR /&gt;C:\Program Files\Microsoft SQL Server\Client SDK\ODBC\170\Tools\Binn\;&lt;BR /&gt;C:\Program Files\dotnet\;C:\Program Files (x86)\Windows Kits\10\Windows Performance Toolkit\;&lt;BR /&gt;C:\Users\abc\AppData\Local\Programs\Python\Python38\Scripts\;&lt;BR /&gt;C:\Users\abc\AppData\Local\Programs\Python\Python38\;&lt;BR /&gt;C:\Users\abc\AppData\Local\Microsoft\WindowsApps&lt;/P&gt;&lt;P&gt;&amp;nbsp;&lt;/P&gt;&lt;P&gt;&lt;SPAN&gt;can anyone help me. Thanks.&lt;/SPAN&gt;&lt;/P&gt;&lt;P&gt;&amp;nbsp;&lt;/P&gt;</description>
      <pubDate>Mon, 11 Dec 2023 07:31:50 GMT</pubDate>
      <guid>https://community.nxp.com/t5/S32-Design-Studio/Build-project-get-arm-none-eabi-gcc-exe-error-nano-specs-No-such/m-p/1772037#M11521</guid>
      <dc:creator>LitteFish</dc:creator>
      <dc:date>2023-12-11T07:31:50Z</dc:date>
    </item>
    <item>
      <title>Re: Build project get arm-none-eabi-gcc.exe: error: nano.specs: No such file or directory</title>
      <link>https://community.nxp.com/t5/S32-Design-Studio/Build-project-get-arm-none-eabi-gcc-exe-error-nano-specs-No-such/m-p/1776460#M11580</link>
      <description>&lt;P&gt;Hi,&amp;nbsp;&lt;/P&gt;
&lt;P&gt;is your project old one and you are trying to import it in S32DS v3.5?&amp;nbsp;&lt;/P&gt;
&lt;P&gt;It looks that the path for the .specs file is unknown for project.&amp;nbsp;&amp;nbsp;&lt;/P&gt;</description>
      <pubDate>Mon, 18 Dec 2023 15:18:58 GMT</pubDate>
      <guid>https://community.nxp.com/t5/S32-Design-Studio/Build-project-get-arm-none-eabi-gcc-exe-error-nano-specs-No-such/m-p/1776460#M11580</guid>
      <dc:creator>jiri_kral</dc:creator>
      <dc:date>2023-12-18T15:18:58Z</dc:date>
    </item>
    <item>
      <title>Re: Build project get arm-none-eabi-gcc.exe: error: nano.specs: No such file or directory</title>
      <link>https://community.nxp.com/t5/S32-Design-Studio/Build-project-get-arm-none-eabi-gcc-exe-error-nano-specs-No-such/m-p/1925177#M12583</link>
      <description>Hello,&lt;BR /&gt;&lt;BR /&gt;I have the same problem, as described above.&lt;BR /&gt;I try to compile this project :&lt;BR /&gt;&lt;A href="https://community.nxp.com/t5/S32K-Knowledge-Base/S32K358-Multicore-Start-CM7-2-from-CM7-0/ta-p/1923889" target="_blank"&gt;https://community.nxp.com/t5/S32K-Knowledge-Base/S32K358-Multicore-Start-CM7-2-from-CM7-0/ta-p/1923889&lt;/A&gt;&lt;BR /&gt;&lt;BR /&gt;first I have to update the path for gcc , I need to add C:\NXP\S32DS.3.5\S32DS\build_tools\gcc_b1620\gcc-6.3-arm32-eabi\bin to S32DS env variable.&lt;BR /&gt;&lt;BR /&gt;for the nano.specs , I try to add&lt;BR /&gt;C:\NXP\S32DS.3.5\S32DS\build_tools\gcc_b1620\gcc-6.3-arm32-eabi\arm-none-eabi\newlib\lib\v8-r\fpv5-sp\hard&lt;BR /&gt;or&lt;BR /&gt;C:\NXP\S32DS.3.5\S32DS\build_tools\gcc_b1620\gcc-6.3-arm32-eabi\arm-none-eabi\newlib\lib&lt;BR /&gt;to the env PATH but I have the same error:&lt;BR /&gt;&lt;BR /&gt;arm-none-eabi-gcc.exe: error: nano.specs: No such file or directory&lt;BR /&gt;&lt;BR /&gt;How can I update the PATH to find th nano.specs files ?&lt;BR /&gt;&lt;BR /&gt;&lt;BR /&gt;&lt;BR /&gt;</description>
      <pubDate>Mon, 05 Aug 2024 09:14:56 GMT</pubDate>
      <guid>https://community.nxp.com/t5/S32-Design-Studio/Build-project-get-arm-none-eabi-gcc-exe-error-nano-specs-No-such/m-p/1925177#M12583</guid>
      <dc:creator>sobo</dc:creator>
      <dc:date>2024-08-05T09:14:56Z</dc:date>
    </item>
    <item>
      <title>Re: Build project get arm-none-eabi-gcc.exe: error: nano.specs: No such file or directory</title>
      <link>https://community.nxp.com/t5/S32-Design-Studio/Build-project-get-arm-none-eabi-gcc-exe-error-nano-specs-No-such/m-p/1977847#M12730</link>
      <description>&lt;P&gt;I have the same problem.&amp;nbsp;&lt;/P&gt;&lt;P&gt;If I compiled with gcc-6.3, this SHxT happened.&lt;/P&gt;&lt;P&gt;After I insert the path of gcc-11 at the beginning of the "path" variable, it disappear!&amp;nbsp;&lt;/P&gt;&lt;LI-CODE lang="javascript"&gt;C:\NXP\S32DS.3.5\S32DS\build_tools\gcc_v11.4\gcc-11.4-arm32-eabi\bin; ...&lt;/LI-CODE&gt;&lt;P&gt;&amp;nbsp;&lt;/P&gt;&lt;P&gt;--&lt;/P&gt;&lt;P&gt;&lt;span class="lia-inline-image-display-wrapper lia-image-align-inline" image-alt="CY9_0-1729494830025.png" style="width: 400px;"&gt;&lt;img src="https://community.nxp.com/t5/image/serverpage/image-id/305753i04A0C288AFFCFE0E/image-size/medium?v=v2&amp;amp;px=400" role="button" title="CY9_0-1729494830025.png" alt="CY9_0-1729494830025.png" /&gt;&lt;/span&gt;&lt;/P&gt;&lt;P&gt;&amp;nbsp;&lt;/P&gt;</description>
      <pubDate>Mon, 21 Oct 2024 07:18:23 GMT</pubDate>
      <guid>https://community.nxp.com/t5/S32-Design-Studio/Build-project-get-arm-none-eabi-gcc-exe-error-nano-specs-No-such/m-p/1977847#M12730</guid>
      <dc:creator>CY9</dc:creator>
      <dc:date>2024-10-21T07:18:23Z</dc:date>
    </item>
    <item>
      <title>Re: Build project get arm-none-eabi-gcc.exe: error: nano.specs: No such file or directory</title>
      <link>https://community.nxp.com/t5/S32-Design-Studio/Build-project-get-arm-none-eabi-gcc-exe-error-nano-specs-No-such/m-p/2093584#M13395</link>
      <description>&lt;P&gt;i got same issue.&lt;/P&gt;&lt;P&gt;when i upgrade my compiler from 9.3 to 10.3, this error disappeared&lt;/P&gt;</description>
      <pubDate>Thu, 08 May 2025 10:18:31 GMT</pubDate>
      <guid>https://community.nxp.com/t5/S32-Design-Studio/Build-project-get-arm-none-eabi-gcc-exe-error-nano-specs-No-such/m-p/2093584#M13395</guid>
      <dc:creator>zongliang</dc:creator>
      <dc:date>2025-05-08T10:18:31Z</dc:date>
    </item>
    <item>
      <title>Re: Build project get arm-none-eabi-gcc.exe: error: nano.specs: No such file or directory</title>
      <link>https://community.nxp.com/t5/S32-Design-Studio/Build-project-get-arm-none-eabi-gcc-exe-error-nano-specs-No-such/m-p/2130781#M13597</link>
      <description>&lt;BR /&gt;Changing your compiler version to 10.2 will resolve this issue.</description>
      <pubDate>Wed, 09 Jul 2025 09:05:27 GMT</pubDate>
      <guid>https://community.nxp.com/t5/S32-Design-Studio/Build-project-get-arm-none-eabi-gcc-exe-error-nano-specs-No-such/m-p/2130781#M13597</guid>
      <dc:creator>molo</dc:creator>
      <dc:date>2025-07-09T09:05:27Z</dc:date>
    </item>
  </channel>
</rss>

