<?xml version="1.0" encoding="UTF-8"?>
<rss xmlns:content="http://purl.org/rss/1.0/modules/content/" xmlns:dc="http://purl.org/dc/elements/1.1/" xmlns:rdf="http://www.w3.org/1999/02/22-rdf-syntax-ns#" xmlns:taxo="http://purl.org/rss/1.0/modules/taxonomy/" version="2.0">
  <channel>
    <title>topic Re: error build hello_world first project in MCUXpresso IDE</title>
    <link>https://community.nxp.com/t5/MCUXpresso-IDE/error-build-hello-world-first-project/m-p/2304343#M10634</link>
    <description>&lt;P&gt;Hello&amp;nbsp;&lt;a href="https://community.nxp.com/t5/user/viewprofilepage/user-id/259414"&gt;@nik_45935&lt;/a&gt;&amp;nbsp;&lt;/P&gt;
&lt;DIV&gt;
&lt;P&gt;Please download the MCUXpresso IDE from:&amp;nbsp;&amp;nbsp;&lt;A href="https://www.nxp.com/design/design-center/software/development-software/mcuxpresso-software-and-tools-/mcuxpresso-integrated-development-environment-ide:MCUXpresso-IDE" target="_blank"&gt;https://www.nxp.com/design/design-center/software/development-software/mcuxpresso-software-and-tools-/mcuxpresso-integrated-development-environment-ide:MCUXpresso-IDE&lt;/A&gt;&amp;nbsp;&lt;/P&gt;
&lt;P&gt;&lt;BR /&gt;Then download the SDK for the FRDM-MCXN947 from:&amp;nbsp;&amp;nbsp;&lt;A href="https://mcuxpresso.nxp.com/" target="_blank"&gt;https://mcuxpresso.nxp.com/&lt;/A&gt;&amp;nbsp;&lt;/P&gt;
&lt;P&gt;&lt;BR /&gt;After that, refer to the &lt;EM&gt;MCUXpresso IDE User Guide&lt;/EM&gt; to import the SDK example and build it.&lt;/P&gt;
&lt;span class="lia-inline-image-display-wrapper lia-image-align-inline" image-alt="Alice_Yang_0-1769998987249.png" style="width: 400px;"&gt;&lt;img src="https://community.nxp.com/t5/image/serverpage/image-id/375085i868A0FE1559AAFDE/image-size/medium?v=v2&amp;amp;px=400" role="button" title="Alice_Yang_0-1769998987249.png" alt="Alice_Yang_0-1769998987249.png" /&gt;&lt;/span&gt;
&lt;P&gt;&amp;nbsp;&lt;/P&gt;
&lt;P&gt;Hope this helps. If you still have any issues, please feel free to contact me.&lt;BR /&gt;Thank you.&lt;/P&gt;
&lt;P&gt;&amp;nbsp;&lt;/P&gt;
&lt;P&gt;BR&lt;/P&gt;
&lt;P&gt;Alice&lt;/P&gt;
&lt;/DIV&gt;</description>
    <pubDate>Mon, 02 Feb 2026 02:23:30 GMT</pubDate>
    <dc:creator>Alice_Yang</dc:creator>
    <dc:date>2026-02-02T02:23:30Z</dc:date>
    <item>
      <title>error build hello_world first project</title>
      <link>https://community.nxp.com/t5/MCUXpresso-IDE/error-build-hello-world-first-project/m-p/2304248#M10633</link>
      <description>&lt;P&gt;I am new to NXP ide. I downloaded the IDE and installed the SDK for my board. While building the simplest sdk project "hello_world" the following errors occur:&lt;/P&gt;&lt;DIV&gt;&lt;DIV&gt;&lt;P&gt;&lt;SPAN&gt;make -r -j7 all &lt;/SPAN&gt;&lt;/P&gt;&lt;P&gt;&lt;SPAN&gt;Building file: ../utilities/str/fsl_str.c&lt;/SPAN&gt;&lt;/P&gt;&lt;P&gt;&lt;SPAN&gt;Building file: ../utilities/debug_console/fsl_debug_console.c&lt;/SPAN&gt;&lt;/P&gt;&lt;P&gt;&lt;SPAN&gt;Building file: ../utilities/fsl_assert.c&lt;/SPAN&gt;&lt;/P&gt;&lt;P&gt;&lt;SPAN&gt;Building file: ../startup/boot_multicore_slave.c&lt;/SPAN&gt;&lt;/P&gt;&lt;P&gt;&lt;SPAN&gt;Invoking: MCU C Compiler&lt;/SPAN&gt;&lt;/P&gt;&lt;P&gt;&lt;SPAN&gt;arm-none-eabi-gcc -D__REDLIB__ -DCPU_MCXN947VDF -DCPU_MCXN947VDF_cm33 -DCPU_MCXN947VDF_cm33_core0 -DSDK_OS_BAREMETAL -DSERIAL_PORT_TYPE_UART=1 -DSDK_DEBUGCONSOLE=0 -DCR_INTEGER_PRINTF -DPRINTF_FLOAT_ENABLE=0 -DSDK_DEBUGCONSOLE_UART -D__MCUXPRESSO -D__USE_CMSIS -DDEBUG -I"/Users/macbookpro13_nik/mcuxpresso/MCXN947_Project_2/board" -I"/Users/macbookpro13_nik/mcuxpresso/MCXN947_Project_2/source" -I"/Users/macbookpro13_nik/mcuxpresso/MCXN947_Project_2/drivers" -I"/Users/macbookpro13_nik/mcuxpresso/MCXN947_Project_2/device" -I"/Users/macbookpro13_nik/mcuxpresso/MCXN947_Project_2/utilities/debug_console" -I"/Users/macbookpro13_nik/mcuxpresso/MCXN947_Project_2/component/uart" -I"/Users/macbookpro13_nik/mcuxpresso/MCXN947_Project_2/utilities/debug_console/config" -I"/Users/macbookpro13_nik/mcuxpresso/MCXN947_Project_2/component/serial_manager" -I"/Users/macbookpro13_nik/mcuxpresso/MCXN947_Project_2/component/lists" -I"/Users/macbookpro13_nik/mcuxpresso/MCXN947_Project_2/device/periph" -I"/Users/macbookpro13_nik/mcuxpresso/MCXN947_Project_2/utilities" -I"/Users/macbookpro13_nik/mcuxpresso/MCXN947_Project_2/CMSIS" -I"/Users/macbookpro13_nik/mcuxpresso/MCXN947_Project_2/CMSIS/m-profile" -I"/Users/macbookpro13_nik/mcuxpresso/MCXN947_Project_2/utilities/str" -O0 -fno-common -g3 -gdwarf-4 -Wall -c -ffunction-sections -fdata-sections -fno-builtin -fmerge-constants -fmacro-prefix-map="../utilities/str/"= -mcpu=cortex-m33 -mfpu=fpv5-sp-d16 -mfloat-abi=hard -mthumb -D__REDLIB__ -fstack-usage -specs=redlib.specs -MMD -MP -MF"utilities/str/fsl_str.d" -MT"utilities/str/fsl_str.o" -MT"utilities/str/fsl_str.d" -o "utilities/str/fsl_str.o" "../utilities/str/fsl_str.c"&lt;/SPAN&gt;&lt;/P&gt;&lt;P&gt;&lt;SPAN&gt;Building file: ../startup/startup_mcxn947_cm33_core0.c&lt;/SPAN&gt;&lt;/P&gt;&lt;P&gt;&lt;SPAN&gt;Invoking: MCU C Compiler&lt;/SPAN&gt;&lt;/P&gt;&lt;P&gt;&lt;SPAN&gt;arm-none-eabi-gcc -D__REDLIB__ -DCPU_MCXN947VDF -DCPU_MCXN947VDF_cm33 -DCPU_MCXN947VDF_cm33_core0 -DSDK_OS_BAREMETAL -DSERIAL_PORT_TYPE_UART=1 -DSDK_DEBUGCONSOLE=0 -DCR_INTEGER_PRINTF -DPRINTF_FLOAT_ENABLE=0 -DSDK_DEBUGCONSOLE_UART -D__MCUXPRESSO -D__USE_CMSIS -DDEBUG -I"/Users/macbookpro13_nik/mcuxpresso/MCXN947_Project_2/board" -I"/Users/macbookpro13_nik/mcuxpresso/MCXN947_Project_2/source" -I"/Users/macbookpro13_nik/mcuxpresso/MCXN947_Project_2/drivers" -I"/Users/macbookpro13_nik/mcuxpresso/MCXN947_Project_2/device" -I"/Users/macbookpro13_nik/mcuxpresso/MCXN947_Project_2/utilities/debug_console" -I"/Users/macbookpro13_nik/mcuxpresso/MCXN947_Project_2/component/uart" -I"/Users/macbookpro13_nik/mcuxpresso/MCXN947_Project_2/utilities/debug_console/config" -I"/Users/macbookpro13_nik/mcuxpresso/MCXN947_Project_2/component/serial_manager" -I"/Users/macbookpro13_nik/mcuxpresso/MCXN947_Project_2/component/lists" -I"/Users/macbookpro13_nik/mcuxpresso/MCXN947_Project_2/device/periph" -I"/Users/macbookpro13_nik/mcuxpresso/MCXN947_Project_2/utilities" -I"/Users/macbookpro13_nik/mcuxpresso/MCXN947_Project_2/CMSIS" -I"/Users/macbookpro13_nik/mcuxpresso/MCXN947_Project_2/CMSIS/m-profile" -I"/Users/macbookpro13_nik/mcuxpresso/MCXN947_Project_2/utilities/str" -O0 -fno-common -g3 -gdwarf-4 -Wall -c -ffunction-sections -fdata-sections -fno-builtin -fmerge-constants -fmacro-prefix-map="../utilities/debug_console/"= -mcpu=cortex-m33 -mfpu=fpv5-sp-d16 -mfloat-abi=hard -mthumb -D__REDLIB__ -fstack-usage -specs=redlib.specs -MMD -MP -MF"utilities/debug_console/fsl_debug_console.d" -MT"utilities/debug_console/fsl_debug_console.o" -MT"utilities/debug_console/fsl_debug_console.d" -o "utilities/debug_console/fsl_debug_console.o" "../utilities/debug_console/fsl_debug_console.c"&lt;/SPAN&gt;&lt;/P&gt;&lt;P&gt;&lt;SPAN&gt;Invoking: MCU C Compiler&lt;/SPAN&gt;&lt;/P&gt;&lt;P&gt;&lt;SPAN&gt;arm-none-eabi-gcc -D__REDLIB__ -DCPU_MCXN947VDF -DCPU_MCXN947VDF_cm33 -DCPU_MCXN947VDF_cm33_core0 -DSDK_OS_BAREMETAL -DSERIAL_PORT_TYPE_UART=1 -DSDK_DEBUGCONSOLE=0 -DCR_INTEGER_PRINTF -DPRINTF_FLOAT_ENABLE=0 -DSDK_DEBUGCONSOLE_UART -D__MCUXPRESSO -D__USE_CMSIS -DDEBUG -I"/Users/macbookpro13_nik/mcuxpresso/MCXN947_Project_2/board" -I"/Users/macbookpro13_nik/mcuxpresso/MCXN947_Project_2/source" -I"/Users/macbookpro13_nik/mcuxpresso/MCXN947_Project_2/drivers" -I"/Users/macbookpro13_nik/mcuxpresso/MCXN947_Project_2/device" -I"/Users/macbookpro13_nik/mcuxpresso/MCXN947_Project_2/utilities/debug_console" -I"/Users/macbookpro13_nik/mcuxpresso/MCXN947_Project_2/component/uart" -I"/Users/macbookpro13_nik/mcuxpresso/MCXN947_Project_2/utilities/debug_console/config" -I"/Users/macbookpro13_nik/mcuxpresso/MCXN947_Project_2/component/serial_manager" -I"/Users/macbookpro13_nik/mcuxpresso/MCXN947_Project_2/component/lists" -I"/Users/macbookpro13_nik/mcuxpresso/MCXN947_Project_2/device/periph" -I"/Users/macbookpro13_nik/mcuxpresso/MCXN947_Project_2/utilities" -I"/Users/macbookpro13_nik/mcuxpresso/MCXN947_Project_2/CMSIS" -I"/Users/macbookpro13_nik/mcuxpresso/MCXN947_Project_2/CMSIS/m-profile" -I"/Users/macbookpro13_nik/mcuxpresso/MCXN947_Project_2/utilities/str" -O0 -fno-common -g3 -gdwarf-4 -Wall -c -ffunction-sections -fdata-sections -fno-builtin -fmerge-constants -fmacro-prefix-map="../startup/"= -mcpu=cortex-m33 -mfpu=fpv5-sp-d16 -mfloat-abi=hard -mthumb -D__REDLIB__ -fstack-usage -specs=redlib.specs -MMD -MP -MF"startup/boot_multicore_slave.d" -MT"startup/boot_multicore_slave.o" -MT"startup/boot_multicore_slave.d" -o "startup/boot_multicore_slave.o" "../startup/boot_multicore_slave.c"&lt;/SPAN&gt;&lt;/P&gt;&lt;P&gt;&lt;SPAN&gt;Invoking: MCU C Compiler&lt;/SPAN&gt;&lt;/P&gt;&lt;P&gt;&lt;SPAN&gt;arm-none-eabi-gcc -D__REDLIB__ -DCPU_MCXN947VDF -DCPU_MCXN947VDF_cm33 -DCPU_MCXN947VDF_cm33_core0 -DSDK_OS_BAREMETAL -DSERIAL_PORT_TYPE_UART=1 -DSDK_DEBUGCONSOLE=0 -DCR_INTEGER_PRINTF -DPRINTF_FLOAT_ENABLE=0 -DSDK_DEBUGCONSOLE_UART -D__MCUXPRESSO -D__USE_CMSIS -DDEBUG -I"/Users/macbookpro13_nik/mcuxpresso/MCXN947_Project_2/board" -I"/Users/macbookpro13_nik/mcuxpresso/MCXN947_Project_2/source" -I"/Users/macbookpro13_nik/mcuxpresso/MCXN947_Project_2/drivers" -I"/Users/macbookpro13_nik/mcuxpresso/MCXN947_Project_2/device" -I"/Users/macbookpro13_nik/mcuxpresso/MCXN947_Project_2/utilities/debug_console" -I"/Users/macbookpro13_nik/mcuxpresso/MCXN947_Project_2/component/uart" -I"/Users/macbookpro13_nik/mcuxpresso/MCXN947_Project_2/utilities/debug_console/config" -I"/Users/macbookpro13_nik/mcuxpresso/MCXN947_Project_2/component/serial_manager" -I"/Users/macbookpro13_nik/mcuxpresso/MCXN947_Project_2/component/lists" -I"/Users/macbookpro13_nik/mcuxpresso/MCXN947_Project_2/device/periph" -I"/Users/macbookpro13_nik/mcuxpresso/MCXN947_Project_2/utilities" -I"/Users/macbookpro13_nik/mcuxpresso/MCXN947_Project_2/CMSIS" -I"/Users/macbookpro13_nik/mcuxpresso/MCXN947_Project_2/CMSIS/m-profile" -I"/Users/macbookpro13_nik/mcuxpresso/MCXN947_Project_2/utilities/str" -O0 -fno-common -g3 -gdwarf-4 -Wall -c -ffunction-sections -fdata-sections -fno-builtin -fmerge-constants -fmacro-prefix-map="../startup/"= -mcpu=cortex-m33 -mfpu=fpv5-sp-d16 -mfloat-abi=hard -mthumb -D__REDLIB__ -fstack-usage -specs=redlib.specs -MMD -MP -MF"startup/startup_mcxn947_cm33_core0.d" -MT"startup/startup_mcxn947_cm33_core0.o" -MT"startup/startup_mcxn947_cm33_core0.d" -o "startup/startup_mcxn947_cm33_core0.o" "../startup/startup_mcxn947_cm33_core0.c"&lt;/SPAN&gt;&lt;/P&gt;&lt;P&gt;&lt;SPAN&gt;Invoking: MCU C Compiler&lt;/SPAN&gt;&lt;/P&gt;&lt;P&gt;&lt;SPAN&gt;Building file: ../source/MCXN947_Project_2.c&lt;/SPAN&gt;&lt;/P&gt;&lt;P&gt;&lt;SPAN&gt;arm-none-eabi-gcc -D__REDLIB__ -DCPU_MCXN947VDF -DCPU_MCXN947VDF_cm33 -DCPU_MCXN947VDF_cm33_core0 -DSDK_OS_BAREMETAL -DSERIAL_PORT_TYPE_UART=1 -DSDK_DEBUGCONSOLE=0 -DCR_INTEGER_PRINTF -DPRINTF_FLOAT_ENABLE=0 -DSDK_DEBUGCONSOLE_UART -D__MCUXPRESSO -D__USE_CMSIS -DDEBUG -I"/Users/macbookpro13_nik/mcuxpresso/MCXN947_Project_2/board" -I"/Users/macbookpro13_nik/mcuxpresso/MCXN947_Project_2/source" -I"/Users/macbookpro13_nik/mcuxpresso/MCXN947_Project_2/drivers" -I"/Users/macbookpro13_nik/mcuxpresso/MCXN947_Project_2/device" -I"/Users/macbookpro13_nik/mcuxpresso/MCXN947_Project_2/utilities/debug_console" -I"/Users/macbookpro13_nik/mcuxpresso/MCXN947_Project_2/component/uart" -I"/Users/macbookpro13_nik/mcuxpresso/MCXN947_Project_2/utilities/debug_console/config" -I"/Users/macbookpro13_nik/mcuxpresso/MCXN947_Project_2/component/serial_manager" -I"/Users/macbookpro13_nik/mcuxpresso/MCXN947_Project_2/component/lists" -I"/Users/macbookpro13_nik/mcuxpresso/MCXN947_Project_2/device/periph" -I"/Users/macbookpro13_nik/mcuxpresso/MCXN947_Project_2/utilities" -I"/Users/macbookpro13_nik/mcuxpresso/MCXN947_Project_2/CMSIS" -I"/Users/macbookpro13_nik/mcuxpresso/MCXN947_Project_2/CMSIS/m-profile" -I"/Users/macbookpro13_nik/mcuxpresso/MCXN947_Project_2/utilities/str" -O0 -fno-common -g3 -gdwarf-4 -Wall -c -ffunction-sections -fdata-sections -fno-builtin -fmerge-constants -fmacro-prefix-map="../utilities/"= -mcpu=cortex-m33 -mfpu=fpv5-sp-d16 -mfloat-abi=hard -mthumb -D__REDLIB__ -fstack-usage -specs=redlib.specs -MMD -MP -MF"utilities/fsl_assert.d" -MT"utilities/fsl_assert.o" -MT"utilities/fsl_assert.d" -o "utilities/fsl_assert.o" "../utilities/fsl_assert.c"&lt;/SPAN&gt;&lt;/P&gt;&lt;P&gt;&lt;SPAN&gt;Building file: ../source/semihost_hardfault.c&lt;/SPAN&gt;&lt;/P&gt;&lt;P&gt;&lt;SPAN&gt;Invoking: MCU C Compiler&lt;/SPAN&gt;&lt;/P&gt;&lt;P&gt;&lt;SPAN&gt;arm-none-eabi-gcc -D__REDLIB__ -DCPU_MCXN947VDF -DCPU_MCXN947VDF_cm33 -DCPU_MCXN947VDF_cm33_core0 -DSDK_OS_BAREMETAL -DSERIAL_PORT_TYPE_UART=1 -DSDK_DEBUGCONSOLE=0 -DCR_INTEGER_PRINTF -DPRINTF_FLOAT_ENABLE=0 -DSDK_DEBUGCONSOLE_UART -D__MCUXPRESSO -D__USE_CMSIS -DDEBUG -I"/Users/macbookpro13_nik/mcuxpresso/MCXN947_Project_2/board" -I"/Users/macbookpro13_nik/mcuxpresso/MCXN947_Project_2/source" -I"/Users/macbookpro13_nik/mcuxpresso/MCXN947_Project_2/drivers" -I"/Users/macbookpro13_nik/mcuxpresso/MCXN947_Project_2/device" -I"/Users/macbookpro13_nik/mcuxpresso/MCXN947_Project_2/utilities/debug_console" -I"/Users/macbookpro13_nik/mcuxpresso/MCXN947_Project_2/component/uart" -I"/Users/macbookpro13_nik/mcuxpresso/MCXN947_Project_2/utilities/debug_console/config" -I"/Users/macbookpro13_nik/mcuxpresso/MCXN947_Project_2/component/serial_manager" -I"/Users/macbookpro13_nik/mcuxpresso/MCXN947_Project_2/component/lists" -I"/Users/macbookpro13_nik/mcuxpresso/MCXN947_Project_2/device/periph" -I"/Users/macbookpro13_nik/mcuxpresso/MCXN947_Project_2/utilities" -I"/Users/macbookpro13_nik/mcuxpresso/MCXN947_Project_2/CMSIS" -I"/Users/macbookpro13_nik/mcuxpresso/MCXN947_Project_2/CMSIS/m-profile" -I"/Users/macbookpro13_nik/mcuxpresso/MCXN947_Project_2/utilities/str" -O0 -fno-common -g3 -gdwarf-4 -Wall -c -ffunction-sections -fdata-sections -fno-builtin -fmerge-constants -fmacro-prefix-map="../source/"= -mcpu=cortex-m33 -mfpu=fpv5-sp-d16 -mfloat-abi=hard -mthumb -D__REDLIB__ -fstack-usage -specs=redlib.specs -MMD -MP -MF"source/MCXN947_Project_2.d" -MT"source/MCXN947_Project_2.o" -MT"source/MCXN947_Project_2.d" -o "source/MCXN947_Project_2.o" "../source/MCXN947_Project_2.c"&lt;/SPAN&gt;&lt;/P&gt;&lt;P&gt;&lt;SPAN&gt;Invoking: MCU C Compiler&lt;/SPAN&gt;&lt;/P&gt;&lt;P&gt;&lt;SPAN&gt;arm-none-eabi-gcc -D__REDLIB__ -DCPU_MCXN947VDF -DCPU_MCXN947VDF_cm33 -DCPU_MCXN947VDF_cm33_core0 -DSDK_OS_BAREMETAL -DSERIAL_PORT_TYPE_UART=1 -DSDK_DEBUGCONSOLE=0 -DCR_INTEGER_PRINTF -DPRINTF_FLOAT_ENABLE=0 -DSDK_DEBUGCONSOLE_UART -D__MCUXPRESSO -D__USE_CMSIS -DDEBUG -I"/Users/macbookpro13_nik/mcuxpresso/MCXN947_Project_2/board" -I"/Users/macbookpro13_nik/mcuxpresso/MCXN947_Project_2/source" -I"/Users/macbookpro13_nik/mcuxpresso/MCXN947_Project_2/drivers" -I"/Users/macbookpro13_nik/mcuxpresso/MCXN947_Project_2/device" -I"/Users/macbookpro13_nik/mcuxpresso/MCXN947_Project_2/utilities/debug_console" -I"/Users/macbookpro13_nik/mcuxpresso/MCXN947_Project_2/component/uart" -I"/Users/macbookpro13_nik/mcuxpresso/MCXN947_Project_2/utilities/debug_console/config" -I"/Users/macbookpro13_nik/mcuxpresso/MCXN947_Project_2/component/serial_manager" -I"/Users/macbookpro13_nik/mcuxpresso/MCXN947_Project_2/component/lists" -I"/Users/macbookpro13_nik/mcuxpresso/MCXN947_Project_2/device/periph" -I"/Users/macbookpro13_nik/mcuxpresso/MCXN947_Project_2/utilities" -I"/Users/macbookpro13_nik/mcuxpresso/MCXN947_Project_2/CMSIS" -I"/Users/macbookpro13_nik/mcuxpresso/MCXN947_Project_2/CMSIS/m-profile" -I"/Users/macbookpro13_nik/mcuxpresso/MCXN947_Project_2/utilities/str" -O0 -fno-common -g3 -gdwarf-4 -Wall -c -ffunction-sections -fdata-sections -fno-builtin -fmerge-constants -fmacro-prefix-map="../source/"= -mcpu=cortex-m33 -mfpu=fpv5-sp-d16 -mfloat-abi=hard -mthumb -D__REDLIB__ -fstack-usage -specs=redlib.specs -MMD -MP -MF"source/semihost_hardfault.d" -MT"source/semihost_hardfault.o" -MT"source/semihost_hardfault.d" -o "source/semihost_hardfault.o" "../source/semihost_hardfault.c"&lt;/SPAN&gt;&lt;/P&gt;&lt;P&gt;&lt;SPAN&gt;dyld[31585]: Library not loaded: /usr/local/opt/zstd/lib/libzstd.1.dylib&lt;/SPAN&gt;&lt;/P&gt;&lt;P&gt;&lt;SPAN&gt;Referenced from: &amp;lt;66B02E5C-65B3-3C28-8492-4979A8E596B8&amp;gt; /Applications/MCUXpressoIDE_25.6.136/ide/plugins/com.nxp.mcuxpresso.tools.macosx_25.6.0.202501151204/tools/libexec/gcc/arm-none-eabi/14.2.1/cc1&lt;/SPAN&gt;&lt;/P&gt;&lt;P&gt;&lt;SPAN&gt;Reason: tried: '/usr/local/opt/zstd/lib/libzstd.1.dylib' (no such file), '/System/Volumes/Preboot/Cryptexes/OS/usr/local/opt/zstd/lib/libzstd.1.dylib' (no such file), '/usr/local/opt/zstd/lib/libzstd.1.dylib' (no such file), '/usr/lib/libzstd.1.dylib' (no such file, not in dyld cache)&lt;/SPAN&gt;&lt;/P&gt;&lt;P&gt;&lt;SPAN&gt;arm-none-eabi-gcc: internal compiler error: Abort trap: 6 signal terminated program cc1&lt;/SPAN&gt;&lt;/P&gt;&lt;P&gt;&lt;SPAN&gt;Please submit a full bug report, with preprocessed source (by using -freport-bug).&lt;/SPAN&gt;&lt;/P&gt;&lt;P&gt;&lt;SPAN&gt;See &amp;lt;&lt;A href="https://bugs.linaro.org/" target="_blank"&gt;https://bugs.linaro.org/&lt;/A&gt;&amp;gt; for instructions.&lt;/SPAN&gt;&lt;/P&gt;&lt;P&gt;&lt;SPAN&gt;make[1]: *** [utilities/str/subdir.mk:20: utilities/str/fsl_str.o] Error 4&lt;/SPAN&gt;&lt;/P&gt;&lt;P&gt;&lt;SPAN&gt;make[1]: *** Waiting for unfinished jobs....&lt;/SPAN&gt;&lt;/P&gt;&lt;P&gt;&lt;SPAN&gt;dyld[31587]: Library not loaded: /usr/local/opt/zstd/lib/libzstd.1.dylib&lt;/SPAN&gt;&lt;/P&gt;&lt;P&gt;&lt;SPAN&gt;Referenced from: &amp;lt;66B02E5C-65B3-3C28-8492-4979A8E596B8&amp;gt; /Applications/MCUXpressoIDE_25.6.136/ide/plugins/com.nxp.mcuxpresso.tools.macosx_25.6.0.202501151204/tools/libexec/gcc/arm-none-eabi/14.2.1/cc1&lt;/SPAN&gt;&lt;/P&gt;&lt;P&gt;&lt;SPAN&gt;Reason: tried: '/usr/local/opt/zstd/lib/libzstd.1.dylib' (no such file), '/System/Volumes/Preboot/Cryptexes/OS/usr/local/opt/zstd/lib/libzstd.1.dylib' (no such file), '/usr/local/opt/zstd/lib/libzstd.1.dylib' (no such file), '/usr/lib/libzstd.1.dylib' (no such file, not in dyld cache)&lt;/SPAN&gt;&lt;/P&gt;&lt;P&gt;&lt;SPAN&gt;arm-none-eabi-gcc: internal compiler error: Abort trap: 6 signal terminated program cc1&lt;/SPAN&gt;&lt;/P&gt;&lt;P&gt;&lt;SPAN&gt;Please submit a full bug report, with preprocessed source (by using -freport-bug).&lt;/SPAN&gt;&lt;/P&gt;&lt;P&gt;&lt;SPAN&gt;See &amp;lt;&lt;A href="https://bugs.linaro.org/" target="_blank"&gt;https://bugs.linaro.org/&lt;/A&gt;&amp;gt; for instructions.&lt;/SPAN&gt;&lt;/P&gt;&lt;P&gt;&lt;SPAN&gt;make[1]: *** [startup/subdir.mk:23: startup/boot_multicore_slave.o] Error 4&lt;/SPAN&gt;&lt;/P&gt;&lt;P&gt;&lt;SPAN&gt;dyld[31588]: Library not loaded: /usr/local/opt/zstd/lib/libzstd.1.dylib&lt;/SPAN&gt;&lt;/P&gt;&lt;P&gt;&lt;SPAN&gt;Referenced from: &amp;lt;66B02E5C-65B3-3C28-8492-4979A8E596B8&amp;gt; /Applications/MCUXpressoIDE_25.6.136/ide/plugins/com.nxp.mcuxpresso.tools.macosx_25.6.0.202501151204/tools/libexec/gcc/arm-none-eabi/14.2.1/cc1&lt;/SPAN&gt;&lt;/P&gt;&lt;P&gt;&lt;SPAN&gt;Reason: tried: '/usr/local/opt/zstd/lib/libzstd.1.dylib' (no such file), '/System/Volumes/Preboot/Cryptexes/OS/usr/local/opt/zstd/lib/libzstd.1.dylib' (no such file), '/usr/local/opt/zstd/lib/libzstd.1.dylib' (no such file), '/usr/lib/libzstd.1.dylib' (no such file, not in dyld cache)&lt;/SPAN&gt;&lt;/P&gt;&lt;P&gt;&lt;SPAN&gt;arm-none-eabi-gcc: internal compiler error: Abort trap: 6 signal terminated program cc1&lt;/SPAN&gt;&lt;/P&gt;&lt;P&gt;&lt;SPAN&gt;Please submit a full bug report, with preprocessed source (by using -freport-bug).&lt;/SPAN&gt;&lt;/P&gt;&lt;P&gt;&lt;SPAN&gt;See &amp;lt;&lt;A href="https://bugs.linaro.org/" target="_blank"&gt;https://bugs.linaro.org/&lt;/A&gt;&amp;gt; for instructions.&lt;/SPAN&gt;&lt;/P&gt;&lt;P&gt;&lt;SPAN&gt;make[1]: *** [utilities/debug_console/subdir.mk:20: utilities/debug_console/fsl_debug_console.o] Error 4&lt;/SPAN&gt;&lt;/P&gt;&lt;P&gt;&lt;SPAN&gt;dyld[31589]: Library not loaded: /usr/local/opt/zstd/lib/libzstd.1.dylib&lt;/SPAN&gt;&lt;/P&gt;&lt;P&gt;&lt;SPAN&gt;Referenced from: &amp;lt;66B02E5C-65B3-3C28-8492-4979A8E596B8&amp;gt; /Applications/MCUXpressoIDE_25.6.136/ide/plugins/com.nxp.mcuxpresso.tools.macosx_25.6.0.202501151204/tools/libexec/gcc/arm-none-eabi/14.2.1/cc1&lt;/SPAN&gt;&lt;/P&gt;&lt;P&gt;&lt;SPAN&gt;Reason: tried: '/usr/local/opt/zstd/lib/libzstd.1.dylib' (no such file), '/System/Volumes/Preboot/Cryptexes/OS/usr/local/opt/zstd/lib/libzstd.1.dylib' (no such file), '/usr/local/opt/zstd/lib/libzstd.1.dylib' (no such file), '/usr/lib/libzstd.1.dylib' (no such file, not in dyld cache)&lt;/SPAN&gt;&lt;/P&gt;&lt;P&gt;&lt;SPAN&gt;arm-none-eabi-gcc: internal compiler error: Abort trap: 6 signal terminated program cc1&lt;/SPAN&gt;&lt;/P&gt;&lt;P&gt;&lt;SPAN&gt;Please submit a full bug report, with preprocessed source (by using -freport-bug).&lt;/SPAN&gt;&lt;/P&gt;&lt;P&gt;&lt;SPAN&gt;See &amp;lt;&lt;A href="https://bugs.linaro.org/" target="_blank"&gt;https://bugs.linaro.org/&lt;/A&gt;&amp;gt; for instructions.&lt;/SPAN&gt;&lt;/P&gt;&lt;P&gt;&lt;SPAN&gt;make[1]: *** [startup/subdir.mk:23: startup/startup_mcxn947_cm33_core0.o] Error 4&lt;/SPAN&gt;&lt;/P&gt;&lt;P&gt;&lt;SPAN&gt;dyld[31590]: Library not loaded: /usr/local/opt/zstd/lib/libzstd.1.dylib&lt;/SPAN&gt;&lt;/P&gt;&lt;P&gt;&lt;SPAN&gt;Referenced from: &amp;lt;66B02E5C-65B3-3C28-8492-4979A8E596B8&amp;gt; /Applications/MCUXpressoIDE_25.6.136/ide/plugins/com.nxp.mcuxpresso.tools.macosx_25.6.0.202501151204/tools/libexec/gcc/arm-none-eabi/14.2.1/cc1&lt;/SPAN&gt;&lt;/P&gt;&lt;P&gt;&lt;SPAN&gt;Reason: tried: '/usr/local/opt/zstd/lib/libzstd.1.dylib' (no such file), '/System/Volumes/Preboot/Cryptexes/OS/usr/local/opt/zstd/lib/libzstd.1.dylib' (no such file), '/usr/local/opt/zstd/lib/libzstd.1.dylib' (no such file), '/usr/lib/libzstd.1.dylib' (no such file, not in dyld cache)&lt;/SPAN&gt;&lt;/P&gt;&lt;P&gt;&lt;SPAN&gt;arm-none-eabi-gcc: internal compiler error: Abort trap: 6 signal terminated program cc1&lt;/SPAN&gt;&lt;/P&gt;&lt;P&gt;&lt;SPAN&gt;Please submit a full bug report, with preprocessed source (by using -freport-bug).&lt;/SPAN&gt;&lt;/P&gt;&lt;P&gt;&lt;SPAN&gt;See &amp;lt;&lt;A href="https://bugs.linaro.org/" target="_blank"&gt;https://bugs.linaro.org/&lt;/A&gt;&amp;gt; for instructions.&lt;/SPAN&gt;&lt;/P&gt;&lt;P&gt;&lt;SPAN&gt;make[1]: *** [utilities/subdir.mk:20: utilities/fsl_assert.o] Error 4&lt;/SPAN&gt;&lt;/P&gt;&lt;P&gt;&lt;SPAN&gt;dyld[31591]: Library not loaded: /usr/local/opt/zstd/lib/libzstd.1.dylib&lt;/SPAN&gt;&lt;/P&gt;&lt;P&gt;&lt;SPAN&gt;Referenced from: &amp;lt;66B02E5C-65B3-3C28-8492-4979A8E596B8&amp;gt; /Applications/MCUXpressoIDE_25.6.136/ide/plugins/com.nxp.mcuxpresso.tools.macosx_25.6.0.202501151204/tools/libexec/gcc/arm-none-eabi/14.2.1/cc1&lt;/SPAN&gt;&lt;/P&gt;&lt;P&gt;&lt;SPAN&gt;Reason: tried: '/usr/local/opt/zstd/lib/libzstd.1.dylib' (no such file), '/System/Volumes/Preboot/Cryptexes/OS/usr/local/opt/zstd/lib/libzstd.1.dylib' (no such file), '/usr/local/opt/zstd/lib/libzstd.1.dylib' (no such file), '/usr/lib/libzstd.1.dylib' (no such file, not in dyld cache)&lt;/SPAN&gt;&lt;/P&gt;&lt;P&gt;&lt;SPAN&gt;arm-none-eabi-gcc: internal compiler error: Abort trap: 6 signal terminated program cc1&lt;/SPAN&gt;&lt;/P&gt;&lt;P&gt;&lt;SPAN&gt;Please submit a full bug report, with preprocessed source (by using -freport-bug).&lt;/SPAN&gt;&lt;/P&gt;&lt;P&gt;&lt;SPAN&gt;See &amp;lt;&lt;A href="https://bugs.linaro.org/" target="_blank"&gt;https://bugs.linaro.org/&lt;/A&gt;&amp;gt; for instructions.&lt;/SPAN&gt;&lt;/P&gt;&lt;P&gt;&lt;SPAN&gt;make[1]: *** [source/subdir.mk:23: source/MCXN947_Project_2.o] Error 4&lt;/SPAN&gt;&lt;/P&gt;&lt;P&gt;&lt;SPAN&gt;dyld[31592]: Library not loaded: /usr/local/opt/zstd/lib/libzstd.1.dylib&lt;/SPAN&gt;&lt;/P&gt;&lt;P&gt;&lt;SPAN&gt;Referenced from: &amp;lt;66B02E5C-65B3-3C28-8492-4979A8E596B8&amp;gt; /Applications/MCUXpressoIDE_25.6.136/ide/plugins/com.nxp.mcuxpresso.tools.macosx_25.6.0.202501151204/tools/libexec/gcc/arm-none-eabi/14.2.1/cc1&lt;/SPAN&gt;&lt;/P&gt;&lt;P&gt;&lt;SPAN&gt;Reason: tried: '/usr/local/opt/zstd/lib/libzstd.1.dylib' (no such file), '/System/Volumes/Preboot/Cryptexes/OS/usr/local/opt/zstd/lib/libzstd.1.dylib' (no such file), '/usr/local/opt/zstd/lib/libzstd.1.dylib' (no such file), '/usr/lib/libzstd.1.dylib' (no such file, not in dyld cache)&lt;/SPAN&gt;&lt;/P&gt;&lt;P&gt;&lt;SPAN&gt;arm-none-eabi-gcc: internal compiler error: Abort trap: 6 signal terminated program cc1&lt;/SPAN&gt;&lt;/P&gt;&lt;P&gt;&lt;SPAN&gt;Please submit a full bug report, with preprocessed source (by using -freport-bug).&lt;/SPAN&gt;&lt;/P&gt;&lt;P&gt;&lt;SPAN&gt;See &amp;lt;&lt;A href="https://bugs.linaro.org/" target="_blank"&gt;https://bugs.linaro.org/&lt;/A&gt;&amp;gt; for instructions.&lt;/SPAN&gt;&lt;/P&gt;&lt;P&gt;&lt;SPAN&gt;make[1]: *** [source/subdir.mk:23: source/semihost_hardfault.o] Error 4&lt;/SPAN&gt;&lt;/P&gt;&lt;P&gt;&lt;SPAN&gt;make: *** [makefile:45: all] Error 2&lt;/SPAN&gt;&lt;/P&gt;&lt;P&gt;&lt;SPAN&gt;"make -r -j7 all" terminated with exit code 2. Build might be incomplete.&lt;/SPAN&gt;&lt;/P&gt;&lt;P&gt;&amp;nbsp;&lt;/P&gt;&lt;P&gt;&lt;SPAN&gt;12:21:43 Build Failed. 9 errors, 0 warnings. (took 386ms)&lt;/SPAN&gt;&lt;/P&gt;&lt;P&gt;&amp;nbsp;&lt;/P&gt;&lt;P&gt;&lt;SPAN&gt;How can I fix them ? I am using MacOS&lt;/SPAN&gt;&lt;/P&gt;&lt;/DIV&gt;&lt;/DIV&gt;</description>
      <pubDate>Sat, 31 Jan 2026 11:30:01 GMT</pubDate>
      <guid>https://community.nxp.com/t5/MCUXpresso-IDE/error-build-hello-world-first-project/m-p/2304248#M10633</guid>
      <dc:creator>nik_45935</dc:creator>
      <dc:date>2026-01-31T11:30:01Z</dc:date>
    </item>
    <item>
      <title>Re: error build hello_world first project</title>
      <link>https://community.nxp.com/t5/MCUXpresso-IDE/error-build-hello-world-first-project/m-p/2304343#M10634</link>
      <description>&lt;P&gt;Hello&amp;nbsp;&lt;a href="https://community.nxp.com/t5/user/viewprofilepage/user-id/259414"&gt;@nik_45935&lt;/a&gt;&amp;nbsp;&lt;/P&gt;
&lt;DIV&gt;
&lt;P&gt;Please download the MCUXpresso IDE from:&amp;nbsp;&amp;nbsp;&lt;A href="https://www.nxp.com/design/design-center/software/development-software/mcuxpresso-software-and-tools-/mcuxpresso-integrated-development-environment-ide:MCUXpresso-IDE" target="_blank"&gt;https://www.nxp.com/design/design-center/software/development-software/mcuxpresso-software-and-tools-/mcuxpresso-integrated-development-environment-ide:MCUXpresso-IDE&lt;/A&gt;&amp;nbsp;&lt;/P&gt;
&lt;P&gt;&lt;BR /&gt;Then download the SDK for the FRDM-MCXN947 from:&amp;nbsp;&amp;nbsp;&lt;A href="https://mcuxpresso.nxp.com/" target="_blank"&gt;https://mcuxpresso.nxp.com/&lt;/A&gt;&amp;nbsp;&lt;/P&gt;
&lt;P&gt;&lt;BR /&gt;After that, refer to the &lt;EM&gt;MCUXpresso IDE User Guide&lt;/EM&gt; to import the SDK example and build it.&lt;/P&gt;
&lt;span class="lia-inline-image-display-wrapper lia-image-align-inline" image-alt="Alice_Yang_0-1769998987249.png" style="width: 400px;"&gt;&lt;img src="https://community.nxp.com/t5/image/serverpage/image-id/375085i868A0FE1559AAFDE/image-size/medium?v=v2&amp;amp;px=400" role="button" title="Alice_Yang_0-1769998987249.png" alt="Alice_Yang_0-1769998987249.png" /&gt;&lt;/span&gt;
&lt;P&gt;&amp;nbsp;&lt;/P&gt;
&lt;P&gt;Hope this helps. If you still have any issues, please feel free to contact me.&lt;BR /&gt;Thank you.&lt;/P&gt;
&lt;P&gt;&amp;nbsp;&lt;/P&gt;
&lt;P&gt;BR&lt;/P&gt;
&lt;P&gt;Alice&lt;/P&gt;
&lt;/DIV&gt;</description>
      <pubDate>Mon, 02 Feb 2026 02:23:30 GMT</pubDate>
      <guid>https://community.nxp.com/t5/MCUXpresso-IDE/error-build-hello-world-first-project/m-p/2304343#M10634</guid>
      <dc:creator>Alice_Yang</dc:creator>
      <dc:date>2026-02-02T02:23:30Z</dc:date>
    </item>
  </channel>
</rss>

