<?xml version="1.0" encoding="UTF-8"?>
<rss xmlns:content="http://purl.org/rss/1.0/modules/content/" xmlns:dc="http://purl.org/dc/elements/1.1/" xmlns:rdf="http://www.w3.org/1999/02/22-rdf-syntax-ns#" xmlns:taxo="http://purl.org/rss/1.0/modules/taxonomy/" version="2.0">
  <channel>
    <title>i.MX Processors中的主题 Re: Cross Compilation of opencv</title>
    <link>https://community.nxp.com/t5/i-MX-Processors/Cross-Compilation-of-opencv/m-p/644586#M98361</link>
    <description>&lt;HTML&gt;&lt;HEAD&gt;&lt;/HEAD&gt;&lt;BODY&gt;&lt;P&gt;Hi Bandaru,&lt;/P&gt;&lt;P&gt;&lt;/P&gt;&lt;P&gt;In my case, it is compiling properly with "arm-poky-linux-gnueabi", but it gives same error with "arm-fsl-linux-gnueabi".&lt;/P&gt;&lt;P&gt;&lt;/P&gt;&lt;P&gt;&lt;STRONG&gt;Error&lt;/STRONG&gt;:&lt;/P&gt;&lt;P&gt;cmake: /usr/local/lib/libcurl.so.4: no version information available (required by cmake)&lt;BR /&gt;-- The CXX compiler identification is unknown&lt;BR /&gt;-- The C compiler identification is unknown&lt;BR /&gt;-- Check for working CXX compiler: /opt/freescale/usr/local/gcc-4.6.2-glibc-2.13-linaro-multilib-2011.12/fsl-linaro-toolchain/bin/arm-fsl-linux-gnueabi-g++&lt;BR /&gt;-- Check for working CXX compiler: /opt/freescale/usr/local/gcc-4.6.2-glibc-2.13-linaro-multilib-2011.12/fsl-linaro-toolchain/bin/arm-fsl-linux-gnueabi-g++ -- broken&lt;BR /&gt;CMake Error at /usr/share/cmake-2.8/Modules/CMakeTestCXXCompiler.cmake:54 (message):&lt;BR /&gt;&amp;nbsp; The C++ compiler&lt;BR /&gt;&amp;nbsp; "/opt/freescale/usr/local/gcc-4.6.2-glibc-2.13-linaro-multilib-2011.12/fsl-linaro-toolchain/bin/arm-fsl-linux-gnueabi-g++"&lt;BR /&gt;&amp;nbsp; is not able to compile a simple test program.&lt;/P&gt;&lt;P&gt;&lt;/P&gt;&lt;P&gt;&amp;nbsp; It fails with the following output:&lt;/P&gt;&lt;P&gt;&lt;/P&gt;&lt;P&gt;&amp;nbsp;&amp;nbsp; Change Dir: /home/sandip/HirenSir_Opencv/opencv_different_toolchain/opencv-2.4.9/build/CMakeFiles/CMakeTmp&lt;/P&gt;&lt;P&gt;&lt;/P&gt;&lt;P&gt;&amp;nbsp;&lt;/P&gt;&lt;P&gt;&lt;/P&gt;&lt;P&gt;&amp;nbsp; Run Build Command:/usr/bin/make "cmTryCompileExec3834116465/fast"&lt;/P&gt;&lt;P&gt;&lt;/P&gt;&lt;P&gt;&amp;nbsp; /usr/bin/make -f CMakeFiles/cmTryCompileExec3834116465.dir/build.make&lt;BR /&gt;&amp;nbsp; CMakeFiles/cmTryCompileExec3834116465.dir/build&lt;/P&gt;&lt;P&gt;&lt;/P&gt;&lt;P&gt;&amp;nbsp; make[1]: Entering directory&lt;BR /&gt;&amp;nbsp; `/home/sandip/HirenSir_Opencv/opencv_different_toolchain/opencv-2.4.9/build/CMakeFiles/CMakeTmp'&lt;/P&gt;&lt;P&gt;&lt;/P&gt;&lt;P&gt;&lt;BR /&gt;&amp;nbsp; /usr/bin/cmake -E cmake_progress_report&lt;BR /&gt;&amp;nbsp; /home/sandip/HirenSir_Opencv/opencv_different_toolchain/opencv-2.4.9/build/CMakeFiles/CMakeTmp/CMakeFiles&lt;BR /&gt;&amp;nbsp; 1&lt;/P&gt;&lt;P&gt;&lt;/P&gt;&lt;P&gt;&amp;nbsp; /usr/bin/cmake: /usr/local/lib/libcurl.so.4: no version information&lt;BR /&gt;&amp;nbsp; available (required by /usr/bin/cmake)&lt;/P&gt;&lt;P&gt;&lt;/P&gt;&lt;P&gt;&amp;nbsp; Building CXX object&lt;BR /&gt;&amp;nbsp; CMakeFiles/cmTryCompileExec3834116465.dir/testCXXCompiler.cxx.o&lt;/P&gt;&lt;P&gt;&lt;/P&gt;&lt;P&gt;&amp;nbsp; &lt;BR /&gt;&amp;nbsp; /opt/freescale/usr/local/gcc-4.6.2-glibc-2.13-linaro-multilib-2011.12/fsl-linaro-toolchain/bin/arm-fsl-linux-gnueabi-g++&lt;BR /&gt;&amp;nbsp; -march=armv7-a -mfloat-abi=hard -mfpu=neon -mtune=cortex-a7&lt;BR /&gt;&amp;nbsp; --sysroot=/opt/freescale/ltib -fpermissive -o&lt;BR /&gt;&amp;nbsp; CMakeFiles/cmTryCompileExec3834116465.dir/testCXXCompiler.cxx.o -c&lt;BR /&gt;&amp;nbsp; /home/sandip/HirenSir_Opencv/opencv_different_toolchain/opencv-2.4.9/build/CMakeFiles/CMakeTmp/testCXXCompiler.cxx&lt;/P&gt;&lt;P&gt;&lt;/P&gt;&lt;P&gt;&lt;BR /&gt;&amp;nbsp; cc1plus: error: bad value (cortex-a7) for -mtune switch&lt;/P&gt;&lt;P&gt;&lt;/P&gt;&lt;P&gt;&amp;nbsp; make[1]: ***&lt;BR /&gt;&amp;nbsp; [CMakeFiles/cmTryCompileExec3834116465.dir/testCXXCompiler.cxx.o] Error 1&lt;/P&gt;&lt;P&gt;&lt;/P&gt;&lt;P&gt;&amp;nbsp; make[1]: Leaving directory&lt;BR /&gt;&amp;nbsp; `/home/sandip/HirenSir_Opencv/opencv_different_toolchain/opencv-2.4.9/build/CMakeFiles/CMakeTmp'&lt;/P&gt;&lt;P&gt;&lt;/P&gt;&lt;P&gt;&lt;BR /&gt;&amp;nbsp; make: *** [cmTryCompileExec3834116465/fast] Error 2&lt;/P&gt;&lt;P&gt;&lt;/P&gt;&lt;P&gt;&amp;nbsp;&lt;/P&gt;&lt;P&gt;&lt;/P&gt;&lt;P&gt;&amp;nbsp;&lt;/P&gt;&lt;P&gt;&lt;/P&gt;&lt;P&gt;&amp;nbsp; CMake will not be able to correctly generate this project.&lt;BR /&gt;Call Stack (most recent call first):&lt;BR /&gt;&amp;nbsp; CMakeLists.txt:56 (project)&lt;/P&gt;&lt;P&gt;&lt;/P&gt;&lt;P&gt;&lt;BR /&gt;-- Configuring incomplete, errors occurred!&lt;/P&gt;&lt;P&gt;&lt;/P&gt;&lt;P&gt;Can you help me on this? Can you send me / attavched here,&amp;nbsp; a Cmake file?&lt;/P&gt;&lt;/BODY&gt;&lt;/HTML&gt;</description>
    <pubDate>Fri, 22 Nov 2019 11:06:31 GMT</pubDate>
    <dc:creator>sandip_gokani</dc:creator>
    <dc:date>2019-11-22T11:06:31Z</dc:date>
    <item>
      <title>Cross Compilation of opencv</title>
      <link>https://community.nxp.com/t5/i-MX-Processors/Cross-Compilation-of-opencv/m-p/644584#M98359</link>
      <description>&lt;HTML&gt;&lt;HEAD&gt;&lt;/HEAD&gt;&lt;BODY&gt;&lt;P&gt;Hi All,&lt;/P&gt;&lt;P&gt;&lt;/P&gt;&lt;P&gt;I need to cross compile opencv for my application. It's compiling properly with arm-fsl-linux-gnueabi, arm-linux but i need for "arm-poky-linux-gnueabi" need to use with yocto setup.&lt;/P&gt;&lt;P&gt;But i am getting following errors even with yocto setup or individual if i am using arm-poky-linux-gnueabi , If any one knows please help me to sort it out.&lt;/P&gt;&lt;P&gt;&lt;/P&gt;&lt;P&gt;Log attached below:&lt;/P&gt;&lt;P&gt;divya@FSETBLR1LX038:~/opencv/OPENCV/new/bui_lav$ cmake -DCMAKE_TOOLCHAIN_FILE=toolchain.cmake ../opencv-2.4.9&lt;BR /&gt;-- The CXX compiler identification is GNU 4.9.1&lt;BR /&gt;-- The C compiler identification is GNU 4.9.1&lt;BR /&gt;-- Check for working CXX compiler: /opt/poky/1.7/sysroots/x86_64-pokysdk-linux/usr/bin/arm-poky-linux-gnueabi/arm-poky-linux-gnueabi-g++&lt;BR /&gt;-- Check for working CXX compiler: /opt/poky/1.7/sysroots/x86_64-pokysdk-linux/usr/bin/arm-poky-linux-gnueabi/arm-poky-linux-gnueabi-g++ -- broken&lt;BR /&gt;CMake Error at /usr/share/cmake-2.8/Modules/CMakeTestCXXCompiler.cmake:54 (message):&lt;BR /&gt;&amp;nbsp; The C++ compiler&lt;BR /&gt;&amp;nbsp; "/opt/poky/1.7/sysroots/x86_64-pokysdk-linux/usr/bin/arm-poky-linux-gnueabi/arm-poky-linux-gnueabi-g++"&lt;BR /&gt;&amp;nbsp; is not able to compile a simple test program.&lt;/P&gt;&lt;P&gt;&lt;/P&gt;&lt;P&gt;&amp;nbsp; It fails with the following output:&lt;/P&gt;&lt;P&gt;&lt;/P&gt;&lt;P&gt;&amp;nbsp;&amp;nbsp; Change Dir: /home/divya/opencv/OPENCV/new/bui_lav/CMakeFiles/CMakeTmp&lt;/P&gt;&lt;P&gt;&lt;/P&gt;&lt;P&gt;&amp;nbsp;&lt;/P&gt;&lt;P&gt;&lt;/P&gt;&lt;P&gt;&amp;nbsp; Run Build Command:/usr/bin/make "cmTryCompileExec192489027/fast"&lt;/P&gt;&lt;P&gt;&lt;/P&gt;&lt;P&gt;&amp;nbsp; /usr/bin/make -f CMakeFiles/cmTryCompileExec192489027.dir/build.make&lt;BR /&gt;&amp;nbsp; CMakeFiles/cmTryCompileExec192489027.dir/build&lt;/P&gt;&lt;P&gt;&lt;/P&gt;&lt;P&gt;&amp;nbsp; make[1]: Entering directory&lt;BR /&gt;&amp;nbsp; `/home/divya/opencv/OPENCV/new/bui_lav/CMakeFiles/CMakeTmp'&lt;/P&gt;&lt;P&gt;&lt;/P&gt;&lt;P&gt;&amp;nbsp; /usr/bin/cmake -E cmake_progress_report&lt;BR /&gt;&amp;nbsp; /home/divya/opencv/OPENCV/new/bui_lav/CMakeFiles/CMakeTmp/CMakeFiles 1&lt;/P&gt;&lt;P&gt;&lt;/P&gt;&lt;P&gt;&amp;nbsp; Building CXX object&lt;BR /&gt;&amp;nbsp; CMakeFiles/cmTryCompileExec192489027.dir/testCXXCompiler.cxx.o&lt;/P&gt;&lt;P&gt;&lt;/P&gt;&lt;P&gt;&amp;nbsp; &lt;BR /&gt;&amp;nbsp; /opt/poky/1.7/sysroots/x86_64-pokysdk-linux/usr/bin/arm-poky-linux-gnueabi/arm-poky-linux-gnueabi-g++&lt;BR /&gt;&amp;nbsp; -o CMakeFiles/cmTryCompileExec192489027.dir/testCXXCompiler.cxx.o -c&lt;BR /&gt;&amp;nbsp; /home/divya/opencv/OPENCV/new/bui_lav/CMakeFiles/CMakeTmp/testCXXCompiler.cxx&lt;/P&gt;&lt;P&gt;&lt;/P&gt;&lt;P&gt;&lt;BR /&gt;&amp;nbsp; Linking CXX executable cmTryCompileExec192489027&lt;/P&gt;&lt;P&gt;&lt;/P&gt;&lt;P&gt;&amp;nbsp; /usr/bin/cmake -E cmake_link_script&lt;BR /&gt;&amp;nbsp; CMakeFiles/cmTryCompileExec192489027.dir/link.txt --verbose=1&lt;/P&gt;&lt;P&gt;&lt;/P&gt;&lt;P&gt;&amp;nbsp; &lt;BR /&gt;&amp;nbsp; /opt/poky/1.7/sysroots/x86_64-pokysdk-linux/usr/bin/arm-poky-linux-gnueabi/arm-poky-linux-gnueabi-g++&lt;BR /&gt;&amp;nbsp; CMakeFiles/cmTryCompileExec192489027.dir/testCXXCompiler.cxx.o -o&lt;BR /&gt;&amp;nbsp; cmTryCompileExec192489027 -rdynamic&lt;/P&gt;&lt;P&gt;&lt;/P&gt;&lt;P&gt;&amp;nbsp; &lt;BR /&gt;&amp;nbsp; /opt/poky/1.7/sysroots/x86_64-pokysdk-linux/usr/libexec/arm-poky-linux-gnueabi/gcc/arm-poky-linux-gnueabi/4.9.1/ld:&lt;BR /&gt;&amp;nbsp; error: cmTryCompileExec192489027 uses VFP register arguments,&lt;BR /&gt;&amp;nbsp; CMakeFiles/cmTryCompileExec192489027.dir/testCXXCompiler.cxx.o does not&lt;/P&gt;&lt;P&gt;&lt;/P&gt;&lt;P&gt;&amp;nbsp; &lt;BR /&gt;&amp;nbsp; /opt/poky/1.7/sysroots/x86_64-pokysdk-linux/usr/libexec/arm-poky-linux-gnueabi/gcc/arm-poky-linux-gnueabi/4.9.1/ld:&lt;BR /&gt;&amp;nbsp; failed to merge target specific data of file&lt;BR /&gt;&amp;nbsp; CMakeFiles/cmTryCompileExec192489027.dir/testCXXCompiler.cxx.o&lt;/P&gt;&lt;P&gt;&lt;/P&gt;&lt;P&gt;&amp;nbsp; collect2: error: ld returned 1 exit status&lt;/P&gt;&lt;P&gt;&lt;/P&gt;&lt;P&gt;&amp;nbsp; make[1]: *** [cmTryCompileExec192489027] Error 1&lt;/P&gt;&lt;P&gt;&lt;/P&gt;&lt;P&gt;&amp;nbsp; make[1]: Leaving directory&lt;BR /&gt;&amp;nbsp; `/home/divya/opencv/OPENCV/new/bui_lav/CMakeFiles/CMakeTmp'&lt;/P&gt;&lt;P&gt;&lt;/P&gt;&lt;P&gt;&amp;nbsp; make: *** [cmTryCompileExec192489027/fast] Error 2&lt;/P&gt;&lt;P&gt;&lt;/P&gt;&lt;P&gt;&amp;nbsp;&lt;/P&gt;&lt;P&gt;&lt;/P&gt;&lt;P&gt;&amp;nbsp;&lt;/P&gt;&lt;P&gt;&lt;/P&gt;&lt;P&gt;&amp;nbsp; CMake will not be able to correctly generate this project.&lt;BR /&gt;Call Stack (most recent call first):&lt;BR /&gt;&amp;nbsp; CMakeLists.txt:56 (project)&lt;/P&gt;&lt;P&gt;&lt;/P&gt;&lt;P&gt;&lt;BR /&gt;-- Configuring incomplete, errors occurred!&lt;BR /&gt;See also "/home/divya/opencv/OPENCV/new/bui_lav/CMakeFiles/CMakeOutput.log".&lt;BR /&gt;See also "/home/divya/opencv/OPENCV/new/bui_lav/CMakeFiles/CMakeError.log".&lt;BR /&gt;divya@FSETBLR1LX038:~/opencv/OPENCV/new/bui_lav$ &lt;/P&gt;&lt;P&gt;&lt;/P&gt;&lt;P&gt;NOTE:&lt;/P&gt;&lt;P&gt;the command&amp;nbsp; for configure:&lt;/P&gt;&lt;P&gt;cmake -DCMAKE_TOOLCHAIN_FILE=toolchain.cmake ../opencv-2.4.9&lt;/P&gt;&lt;P&gt;&lt;/P&gt;&lt;P&gt;toochain.cmake&amp;nbsp; contains:&lt;/P&gt;&lt;P&gt;----------------------------------------------------&lt;/P&gt;&lt;P&gt;set( CMAKE_SYSTEM_NAME Linux )&lt;BR /&gt; set( CMAKE_SYSTEM_PROCESSOR arm )&lt;BR /&gt; set( CMAKE_C_COMPILER arm-poky-linux-gnueabi-gcc )&lt;BR /&gt; set( CMAKE_CXX_COMPILER arm-poky-linux-gnueabi-g++ )&lt;/P&gt;&lt;P&gt;&lt;/P&gt;&lt;P&gt;Thanks &amp;amp; Regards,&lt;/P&gt;&lt;P&gt;Lavanya&lt;/P&gt;&lt;/BODY&gt;&lt;/HTML&gt;</description>
      <pubDate>Mon, 03 Apr 2017 11:07:24 GMT</pubDate>
      <guid>https://community.nxp.com/t5/i-MX-Processors/Cross-Compilation-of-opencv/m-p/644584#M98359</guid>
      <dc:creator>bandarulavanya</dc:creator>
      <dc:date>2017-04-03T11:07:24Z</dc:date>
    </item>
    <item>
      <title>Re: Cross Compilation of opencv</title>
      <link>https://community.nxp.com/t5/i-MX-Processors/Cross-Compilation-of-opencv/m-p/644585#M98360</link>
      <description>&lt;HTML&gt;&lt;HEAD&gt;&lt;/HEAD&gt;&lt;BODY&gt;&lt;P&gt;Hi Bandaru&lt;/P&gt;&lt;P&gt;&lt;/P&gt;&lt;P&gt;It looks like the issue is on Cmake,&amp;nbsp;&lt;SPAN style="color: #242729; background-color: #ffffff;"&gt;, however apparently there was a change related to C++11 standard and you need to manually edit CMakeLists.txt to change some flag as&lt;/SPAN&gt;&lt;CODE style="color: #242729; border: 0px; font-size: 13px; padding: 1px 5px;"&gt;-std=c++*&lt;/CODE&gt;&lt;SPAN style="color: #242729; background-color: #ffffff;"&gt;&amp;nbsp;to &lt;/SPAN&gt;&lt;CODE style="color: #242729; border: 0px; font-size: 13px; padding: 1px 5px;"&gt;-std=gnu++*&lt;/CODE&gt;&lt;SPAN style="color: #242729; background-color: #ffffff;"&gt;&amp;nbsp;or &lt;SPAN style="color: #24292e;"&gt;CMAKE_C_FLAGS "-mfloat-abi=hard" &amp;nbsp;&lt;/SPAN&gt;when compiling any library. I suggested to try latest 4.1.15_2.0.0 BSP that support Gcc 5.3.0 toolchain.&lt;/SPAN&gt;&lt;/P&gt;&lt;P&gt;&lt;/P&gt;&lt;P&gt;&lt;SPAN style="color: #242729; background-color: #ffffff;"&gt;Hope this helps&lt;/SPAN&gt;&lt;/P&gt;&lt;/BODY&gt;&lt;/HTML&gt;</description>
      <pubDate>Wed, 05 Apr 2017 15:15:54 GMT</pubDate>
      <guid>https://community.nxp.com/t5/i-MX-Processors/Cross-Compilation-of-opencv/m-p/644585#M98360</guid>
      <dc:creator>Bio_TICFSL</dc:creator>
      <dc:date>2017-04-05T15:15:54Z</dc:date>
    </item>
    <item>
      <title>Re: Cross Compilation of opencv</title>
      <link>https://community.nxp.com/t5/i-MX-Processors/Cross-Compilation-of-opencv/m-p/644586#M98361</link>
      <description>&lt;HTML&gt;&lt;HEAD&gt;&lt;/HEAD&gt;&lt;BODY&gt;&lt;P&gt;Hi Bandaru,&lt;/P&gt;&lt;P&gt;&lt;/P&gt;&lt;P&gt;In my case, it is compiling properly with "arm-poky-linux-gnueabi", but it gives same error with "arm-fsl-linux-gnueabi".&lt;/P&gt;&lt;P&gt;&lt;/P&gt;&lt;P&gt;&lt;STRONG&gt;Error&lt;/STRONG&gt;:&lt;/P&gt;&lt;P&gt;cmake: /usr/local/lib/libcurl.so.4: no version information available (required by cmake)&lt;BR /&gt;-- The CXX compiler identification is unknown&lt;BR /&gt;-- The C compiler identification is unknown&lt;BR /&gt;-- Check for working CXX compiler: /opt/freescale/usr/local/gcc-4.6.2-glibc-2.13-linaro-multilib-2011.12/fsl-linaro-toolchain/bin/arm-fsl-linux-gnueabi-g++&lt;BR /&gt;-- Check for working CXX compiler: /opt/freescale/usr/local/gcc-4.6.2-glibc-2.13-linaro-multilib-2011.12/fsl-linaro-toolchain/bin/arm-fsl-linux-gnueabi-g++ -- broken&lt;BR /&gt;CMake Error at /usr/share/cmake-2.8/Modules/CMakeTestCXXCompiler.cmake:54 (message):&lt;BR /&gt;&amp;nbsp; The C++ compiler&lt;BR /&gt;&amp;nbsp; "/opt/freescale/usr/local/gcc-4.6.2-glibc-2.13-linaro-multilib-2011.12/fsl-linaro-toolchain/bin/arm-fsl-linux-gnueabi-g++"&lt;BR /&gt;&amp;nbsp; is not able to compile a simple test program.&lt;/P&gt;&lt;P&gt;&lt;/P&gt;&lt;P&gt;&amp;nbsp; It fails with the following output:&lt;/P&gt;&lt;P&gt;&lt;/P&gt;&lt;P&gt;&amp;nbsp;&amp;nbsp; Change Dir: /home/sandip/HirenSir_Opencv/opencv_different_toolchain/opencv-2.4.9/build/CMakeFiles/CMakeTmp&lt;/P&gt;&lt;P&gt;&lt;/P&gt;&lt;P&gt;&amp;nbsp;&lt;/P&gt;&lt;P&gt;&lt;/P&gt;&lt;P&gt;&amp;nbsp; Run Build Command:/usr/bin/make "cmTryCompileExec3834116465/fast"&lt;/P&gt;&lt;P&gt;&lt;/P&gt;&lt;P&gt;&amp;nbsp; /usr/bin/make -f CMakeFiles/cmTryCompileExec3834116465.dir/build.make&lt;BR /&gt;&amp;nbsp; CMakeFiles/cmTryCompileExec3834116465.dir/build&lt;/P&gt;&lt;P&gt;&lt;/P&gt;&lt;P&gt;&amp;nbsp; make[1]: Entering directory&lt;BR /&gt;&amp;nbsp; `/home/sandip/HirenSir_Opencv/opencv_different_toolchain/opencv-2.4.9/build/CMakeFiles/CMakeTmp'&lt;/P&gt;&lt;P&gt;&lt;/P&gt;&lt;P&gt;&lt;BR /&gt;&amp;nbsp; /usr/bin/cmake -E cmake_progress_report&lt;BR /&gt;&amp;nbsp; /home/sandip/HirenSir_Opencv/opencv_different_toolchain/opencv-2.4.9/build/CMakeFiles/CMakeTmp/CMakeFiles&lt;BR /&gt;&amp;nbsp; 1&lt;/P&gt;&lt;P&gt;&lt;/P&gt;&lt;P&gt;&amp;nbsp; /usr/bin/cmake: /usr/local/lib/libcurl.so.4: no version information&lt;BR /&gt;&amp;nbsp; available (required by /usr/bin/cmake)&lt;/P&gt;&lt;P&gt;&lt;/P&gt;&lt;P&gt;&amp;nbsp; Building CXX object&lt;BR /&gt;&amp;nbsp; CMakeFiles/cmTryCompileExec3834116465.dir/testCXXCompiler.cxx.o&lt;/P&gt;&lt;P&gt;&lt;/P&gt;&lt;P&gt;&amp;nbsp; &lt;BR /&gt;&amp;nbsp; /opt/freescale/usr/local/gcc-4.6.2-glibc-2.13-linaro-multilib-2011.12/fsl-linaro-toolchain/bin/arm-fsl-linux-gnueabi-g++&lt;BR /&gt;&amp;nbsp; -march=armv7-a -mfloat-abi=hard -mfpu=neon -mtune=cortex-a7&lt;BR /&gt;&amp;nbsp; --sysroot=/opt/freescale/ltib -fpermissive -o&lt;BR /&gt;&amp;nbsp; CMakeFiles/cmTryCompileExec3834116465.dir/testCXXCompiler.cxx.o -c&lt;BR /&gt;&amp;nbsp; /home/sandip/HirenSir_Opencv/opencv_different_toolchain/opencv-2.4.9/build/CMakeFiles/CMakeTmp/testCXXCompiler.cxx&lt;/P&gt;&lt;P&gt;&lt;/P&gt;&lt;P&gt;&lt;BR /&gt;&amp;nbsp; cc1plus: error: bad value (cortex-a7) for -mtune switch&lt;/P&gt;&lt;P&gt;&lt;/P&gt;&lt;P&gt;&amp;nbsp; make[1]: ***&lt;BR /&gt;&amp;nbsp; [CMakeFiles/cmTryCompileExec3834116465.dir/testCXXCompiler.cxx.o] Error 1&lt;/P&gt;&lt;P&gt;&lt;/P&gt;&lt;P&gt;&amp;nbsp; make[1]: Leaving directory&lt;BR /&gt;&amp;nbsp; `/home/sandip/HirenSir_Opencv/opencv_different_toolchain/opencv-2.4.9/build/CMakeFiles/CMakeTmp'&lt;/P&gt;&lt;P&gt;&lt;/P&gt;&lt;P&gt;&lt;BR /&gt;&amp;nbsp; make: *** [cmTryCompileExec3834116465/fast] Error 2&lt;/P&gt;&lt;P&gt;&lt;/P&gt;&lt;P&gt;&amp;nbsp;&lt;/P&gt;&lt;P&gt;&lt;/P&gt;&lt;P&gt;&amp;nbsp;&lt;/P&gt;&lt;P&gt;&lt;/P&gt;&lt;P&gt;&amp;nbsp; CMake will not be able to correctly generate this project.&lt;BR /&gt;Call Stack (most recent call first):&lt;BR /&gt;&amp;nbsp; CMakeLists.txt:56 (project)&lt;/P&gt;&lt;P&gt;&lt;/P&gt;&lt;P&gt;&lt;BR /&gt;-- Configuring incomplete, errors occurred!&lt;/P&gt;&lt;P&gt;&lt;/P&gt;&lt;P&gt;Can you help me on this? Can you send me / attavched here,&amp;nbsp; a Cmake file?&lt;/P&gt;&lt;/BODY&gt;&lt;/HTML&gt;</description>
      <pubDate>Fri, 22 Nov 2019 11:06:31 GMT</pubDate>
      <guid>https://community.nxp.com/t5/i-MX-Processors/Cross-Compilation-of-opencv/m-p/644586#M98361</guid>
      <dc:creator>sandip_gokani</dc:creator>
      <dc:date>2019-11-22T11:06:31Z</dc:date>
    </item>
  </channel>
</rss>

