<?xml version="1.0" encoding="UTF-8"?>
<rss xmlns:content="http://purl.org/rss/1.0/modules/content/" xmlns:dc="http://purl.org/dc/elements/1.1/" xmlns:rdf="http://www.w3.org/1999/02/22-rdf-syntax-ns#" xmlns:taxo="http://purl.org/rss/1.0/modules/taxonomy/" version="2.0">
  <channel>
    <title>topic IMX8QMMEK  YOCTO-bitbake in i.MX Processors</title>
    <link>https://community.nxp.com/t5/i-MX-Processors/IMX8QMMEK-YOCTO-bitbake/m-p/1191362#M214315</link>
    <description>&lt;P&gt;As the yocto guide , i have rebuilt the image with&amp;nbsp; bitbake imx-image-multimedia.Now I have met some problems.About my environments ,the virtual unbuntu system is 16.04.The error message is as follows:&lt;/P&gt;
&lt;P&gt;Build Configuration:&lt;BR /&gt;BB_VERSION = "1.42.0"&lt;BR /&gt;BUILD_SYS = "x86_64-linux"&lt;BR /&gt;NATIVELSBSTRING = "ubuntu-16.04"&lt;BR /&gt;TARGET_SYS = "aarch64-poky-linux"&lt;BR /&gt;MACHINE = "imx8qmmek"&lt;BR /&gt;DISTRO = "fsl-imx-xwayland"&lt;BR /&gt;DISTRO_VERSION = "4.19-warrior"&lt;BR /&gt;TUNE_FEATURES = "aarch64"&lt;BR /&gt;TARGET_FPU = ""&lt;BR /&gt;meta&lt;BR /&gt;meta-poky = "HEAD:6d2e12e79211b31cdf5ea824fb9a8be54ba9a9eb"&lt;BR /&gt;meta-oe&lt;BR /&gt;meta-multimedia = "HEAD:3bdbf72e3a4bf18a4a2c7afbde4f7ab773aeded9"&lt;BR /&gt;meta-freescale = "HEAD:2142f7ded1b3115ccc21f7575fd83e2376247193"&lt;BR /&gt;meta-freescale-3rdparty = "HEAD:da422478d38e744283bcf61123c4a526396c7030"&lt;BR /&gt;meta-freescale-distro = "HEAD:d4e77ea682fa10d0d54a723b3d3099c44fc5e95c"&lt;BR /&gt;meta-bsp&lt;BR /&gt;meta-sdk&lt;BR /&gt;meta-ml = "HEAD:bb05c60e6398b374ac49554c642a3bef36452f73"&lt;BR /&gt;meta-browser = "HEAD:5f365ef0f842ba4651efe88787cf9c63bc8b6cb3"&lt;BR /&gt;meta-rust = "HEAD:11aed43748d7dd194dc6c06a35a16104400d1090"&lt;BR /&gt;meta-gnome&lt;BR /&gt;meta-networking&lt;BR /&gt;meta-python&lt;BR /&gt;meta-filesystems = "HEAD:3bdbf72e3a4bf18a4a2c7afbde4f7ab773aeded9"&lt;BR /&gt;meta-qt5 = "HEAD:dc2dedef9961950b88f4245ba7499538ec4244ab"&lt;/P&gt;
&lt;P&gt;Initialising tasks: 100% |####################################################################################################| Time: 0:00:08&lt;BR /&gt;Sstate summary: Wanted 1855 Found 0 Missed 1855 Current 1129 (0% match, 37% complete)&lt;BR /&gt;NOTE: Executing SetScene Tasks&lt;BR /&gt;NOTE: Executing RunQueue Tasks&lt;BR /&gt;ERROR: systemtap-4.0-r0 do_compile: oe_runmake failed&lt;BR /&gt;ERROR: systemtap-4.0-r0 do_compile: Function failed: do_compile (log file is located at /home/quaijing/imx-yocto-bsp/build-imx8qm/tmp/work/aarch64-poky-linux/systemtap/4.0-r0/temp/log.do_compile.38750)&lt;BR /&gt;ERROR: Logfile of failure stored in: /home/quaijing/imx-yocto-bsp/build-imx8qm/tmp/work/aarch64-poky-linux/systemtap/4.0-r0/temp/log.do_compile.38750&lt;BR /&gt;Log data follows:&lt;BR /&gt;| DEBUG: SITE files ['endian-little', 'bit-64', 'arm-common', 'arm-64', 'common-linux', 'common-glibc', 'aarch64-linux', 'common']&lt;BR /&gt;| DEBUG: Executing shell function do_compile&lt;BR /&gt;| NOTE: make -j 8&lt;BR /&gt;| /bin/bash ../git/git_version.sh -k -s ../git -o git_version.h&lt;BR /&gt;| git_version.sh: Output is unchanged, keeping git_version.h&lt;BR /&gt;| make all-recursive&lt;BR /&gt;| make[1]: Entering directory '/home/quaijing/imx-yocto-bsp/build-imx8qm/tmp/work/aarch64-poky-linux/systemtap/4.0-r0/build'&lt;BR /&gt;| Making all in .&lt;BR /&gt;| make[2]: Entering directory '/home/quaijing/imx-yocto-bsp/build-imx8qm/tmp/work/aarch64-poky-linux/systemtap/4.0-r0/build'&lt;BR /&gt;| aarch64-poky-linux-g++ --sysroot=/home/quaijing/imx-yocto-bsp/build-imx8qm/tmp/work/aarch64-poky-linux/systemtap/4.0-r0/recipe-sysroot -Wall -Wextra -Werror -fstack-protector-all -D_FORTIFY_SOURCE=2 -O2 -pipe -g -feliminate-unused-debug-types -fmacro-prefix-map=/home/quaijing/imx-yocto-bsp/build-imx8qm/tmp/work/aarch64-poky-linux/systemtap/4.0-r0=/usr/src/debug/systemtap/4.0-r0 -fdebug-prefix-map=/home/quaijing/imx-yocto-bsp/build-imx8qm/tmp/work/aarch64-poky-linux/systemtap/4.0-r0=/usr/src/debug/systemtap/4.0-r0 -fdebug-prefix-map=/home/quaijing/imx-yocto-bsp/build-imx8qm/tmp/work/aarch64-poky-linux/systemtap/4.0-r0/recipe-sysroot= -fdebug-prefix-map=/home/quaijing/imx-yocto-bsp/build-imx8qm/tmp/work/aarch64-poky-linux/systemtap/4.0-r0/recipe-sysroot-native= -fvisibility-inlines-hidden -Wl,-O1 -Wl,--hash-style=gnu -Wl,--as-needed -o stap stap-main.o stap-session.o stap-parse.o stap-staptree.o stap-elaborate.o stap-translate.o stap-tapsets.o stap-buildrun.o stap-loc2stap.o stap-hash.o stap-mdfour.o stap-cache.o stap-util.o stap-coveragedb.o stap-dwarf_wrappers.o stap-tapset-been.o stap-tapset-procfs.o stap-tapset-timers.o stap-tapset-netfilter.o stap-tapset-perfmon.o stap-tapset-mark.o stap-tapset-itrace.o stap-tapset-utrace.o stap-task_finder.o stap-dwflpp.o stap-rpm_finder.o stap-setupdwfl.o stap-remote.o stap-privilege.o stap-cmdline.o stap-tapset-dynprobe.o stap-tapset-method.o stap-translator-output.o stap-stapregex.o stap-stapregex-tree.o stap-stapregex-parse.o stap-stapregex-dfa.o stap-stringtable.o stap-tapset-python.o stap-interactive.o stap-bpf-base.o stap-bpf-bitset.o stap-bpf-translate.o stap-bpf-opt.o -Wl,--start-group -ldw -lebl -Wl,--end-group -lelf -lsqlite3 -lpthread -lreadline&lt;BR /&gt;| The script example index is outdated, run&lt;BR /&gt;| cd ../git/testsuite/systemtap.examples &amp;amp;&amp;amp; \&lt;BR /&gt;| perl examples-index-gen.pl&lt;BR /&gt;| to regenerate it.&lt;BR /&gt;| /home/quaijing/imx-yocto-bsp/build-imx8qm/tmp/work/aarch64-poky-linux/systemtap/4.0-r0/recipe-sysroot-native/usr/bin/aarch64-poky-linux/../../libexec/aarch64-poky-linux/gcc/aarch64-poky-linux/8.3.0/ld: stap-tapsets.o: file not recognized: file truncated&lt;BR /&gt;| collect2: error: ld returned 1 exit status&lt;BR /&gt;| Makefile:945: recipe for target 'stap' failed&lt;BR /&gt;| make[2]: *** [stap] Error 1&lt;BR /&gt;| make[2]: Leaving directory '/home/quaijing/imx-yocto-bsp/build-imx8qm/tmp/work/aarch64-poky-linux/systemtap/4.0-r0/build'&lt;BR /&gt;| Makefile:2097: recipe for target 'all-recursive' failed&lt;BR /&gt;| make[1]: *** [all-recursive] Error 1&lt;BR /&gt;| make[1]: Leaving directory '/home/quaijing/imx-yocto-bsp/build-imx8qm/tmp/work/aarch64-poky-linux/systemtap/4.0-r0/build'&lt;BR /&gt;| Makefile:781: recipe for target 'all' failed&lt;BR /&gt;| make: *** [all] Error 2&lt;BR /&gt;| ERROR: oe_runmake failed&lt;BR /&gt;| WARNING: exit code 1 from a shell command.&lt;BR /&gt;| ERROR: Function failed: do_compile (log file is located at /home/quaijing/imx-yocto-bsp/build-imx8qm/tmp/work/aarch64-poky-linux/systemtap/4.0-r0/temp/log.do_compile.38750)&lt;BR /&gt;ERROR: Task (/home/quaijing/imx-yocto-bsp/sources/poky/meta/recipes-kernel/systemtap/systemtap_git.bb:do_compile) failed with exit code '1'&lt;BR /&gt;NOTE: Tasks Summary: Attempted 5188 tasks of which 5185 didn't need to be rerun and 1 failed.&lt;/P&gt;
&lt;P&gt;Summary: 1 task failed:&lt;BR /&gt;/home/quaijing/imx-yocto-bsp/sources/poky/meta/recipes-kernel/systemtap/systemtap_git.bb:do_compile&lt;BR /&gt;Summary: There were 2 ERROR messages shown, returning a non-zero exit code.&lt;/P&gt;
&lt;P&gt;&amp;nbsp;&lt;/P&gt;
&lt;P&gt;&amp;nbsp;&lt;/P&gt;
&lt;P&gt;what should I do to fix the problem?Thanks&lt;/P&gt;</description>
    <pubDate>Tue, 17 Oct 2023 23:05:59 GMT</pubDate>
    <dc:creator>quaijing</dc:creator>
    <dc:date>2023-10-17T23:05:59Z</dc:date>
    <item>
      <title>IMX8QMMEK  YOCTO-bitbake</title>
      <link>https://community.nxp.com/t5/i-MX-Processors/IMX8QMMEK-YOCTO-bitbake/m-p/1191362#M214315</link>
      <description>&lt;P&gt;As the yocto guide , i have rebuilt the image with&amp;nbsp; bitbake imx-image-multimedia.Now I have met some problems.About my environments ,the virtual unbuntu system is 16.04.The error message is as follows:&lt;/P&gt;
&lt;P&gt;Build Configuration:&lt;BR /&gt;BB_VERSION = "1.42.0"&lt;BR /&gt;BUILD_SYS = "x86_64-linux"&lt;BR /&gt;NATIVELSBSTRING = "ubuntu-16.04"&lt;BR /&gt;TARGET_SYS = "aarch64-poky-linux"&lt;BR /&gt;MACHINE = "imx8qmmek"&lt;BR /&gt;DISTRO = "fsl-imx-xwayland"&lt;BR /&gt;DISTRO_VERSION = "4.19-warrior"&lt;BR /&gt;TUNE_FEATURES = "aarch64"&lt;BR /&gt;TARGET_FPU = ""&lt;BR /&gt;meta&lt;BR /&gt;meta-poky = "HEAD:6d2e12e79211b31cdf5ea824fb9a8be54ba9a9eb"&lt;BR /&gt;meta-oe&lt;BR /&gt;meta-multimedia = "HEAD:3bdbf72e3a4bf18a4a2c7afbde4f7ab773aeded9"&lt;BR /&gt;meta-freescale = "HEAD:2142f7ded1b3115ccc21f7575fd83e2376247193"&lt;BR /&gt;meta-freescale-3rdparty = "HEAD:da422478d38e744283bcf61123c4a526396c7030"&lt;BR /&gt;meta-freescale-distro = "HEAD:d4e77ea682fa10d0d54a723b3d3099c44fc5e95c"&lt;BR /&gt;meta-bsp&lt;BR /&gt;meta-sdk&lt;BR /&gt;meta-ml = "HEAD:bb05c60e6398b374ac49554c642a3bef36452f73"&lt;BR /&gt;meta-browser = "HEAD:5f365ef0f842ba4651efe88787cf9c63bc8b6cb3"&lt;BR /&gt;meta-rust = "HEAD:11aed43748d7dd194dc6c06a35a16104400d1090"&lt;BR /&gt;meta-gnome&lt;BR /&gt;meta-networking&lt;BR /&gt;meta-python&lt;BR /&gt;meta-filesystems = "HEAD:3bdbf72e3a4bf18a4a2c7afbde4f7ab773aeded9"&lt;BR /&gt;meta-qt5 = "HEAD:dc2dedef9961950b88f4245ba7499538ec4244ab"&lt;/P&gt;
&lt;P&gt;Initialising tasks: 100% |####################################################################################################| Time: 0:00:08&lt;BR /&gt;Sstate summary: Wanted 1855 Found 0 Missed 1855 Current 1129 (0% match, 37% complete)&lt;BR /&gt;NOTE: Executing SetScene Tasks&lt;BR /&gt;NOTE: Executing RunQueue Tasks&lt;BR /&gt;ERROR: systemtap-4.0-r0 do_compile: oe_runmake failed&lt;BR /&gt;ERROR: systemtap-4.0-r0 do_compile: Function failed: do_compile (log file is located at /home/quaijing/imx-yocto-bsp/build-imx8qm/tmp/work/aarch64-poky-linux/systemtap/4.0-r0/temp/log.do_compile.38750)&lt;BR /&gt;ERROR: Logfile of failure stored in: /home/quaijing/imx-yocto-bsp/build-imx8qm/tmp/work/aarch64-poky-linux/systemtap/4.0-r0/temp/log.do_compile.38750&lt;BR /&gt;Log data follows:&lt;BR /&gt;| DEBUG: SITE files ['endian-little', 'bit-64', 'arm-common', 'arm-64', 'common-linux', 'common-glibc', 'aarch64-linux', 'common']&lt;BR /&gt;| DEBUG: Executing shell function do_compile&lt;BR /&gt;| NOTE: make -j 8&lt;BR /&gt;| /bin/bash ../git/git_version.sh -k -s ../git -o git_version.h&lt;BR /&gt;| git_version.sh: Output is unchanged, keeping git_version.h&lt;BR /&gt;| make all-recursive&lt;BR /&gt;| make[1]: Entering directory '/home/quaijing/imx-yocto-bsp/build-imx8qm/tmp/work/aarch64-poky-linux/systemtap/4.0-r0/build'&lt;BR /&gt;| Making all in .&lt;BR /&gt;| make[2]: Entering directory '/home/quaijing/imx-yocto-bsp/build-imx8qm/tmp/work/aarch64-poky-linux/systemtap/4.0-r0/build'&lt;BR /&gt;| aarch64-poky-linux-g++ --sysroot=/home/quaijing/imx-yocto-bsp/build-imx8qm/tmp/work/aarch64-poky-linux/systemtap/4.0-r0/recipe-sysroot -Wall -Wextra -Werror -fstack-protector-all -D_FORTIFY_SOURCE=2 -O2 -pipe -g -feliminate-unused-debug-types -fmacro-prefix-map=/home/quaijing/imx-yocto-bsp/build-imx8qm/tmp/work/aarch64-poky-linux/systemtap/4.0-r0=/usr/src/debug/systemtap/4.0-r0 -fdebug-prefix-map=/home/quaijing/imx-yocto-bsp/build-imx8qm/tmp/work/aarch64-poky-linux/systemtap/4.0-r0=/usr/src/debug/systemtap/4.0-r0 -fdebug-prefix-map=/home/quaijing/imx-yocto-bsp/build-imx8qm/tmp/work/aarch64-poky-linux/systemtap/4.0-r0/recipe-sysroot= -fdebug-prefix-map=/home/quaijing/imx-yocto-bsp/build-imx8qm/tmp/work/aarch64-poky-linux/systemtap/4.0-r0/recipe-sysroot-native= -fvisibility-inlines-hidden -Wl,-O1 -Wl,--hash-style=gnu -Wl,--as-needed -o stap stap-main.o stap-session.o stap-parse.o stap-staptree.o stap-elaborate.o stap-translate.o stap-tapsets.o stap-buildrun.o stap-loc2stap.o stap-hash.o stap-mdfour.o stap-cache.o stap-util.o stap-coveragedb.o stap-dwarf_wrappers.o stap-tapset-been.o stap-tapset-procfs.o stap-tapset-timers.o stap-tapset-netfilter.o stap-tapset-perfmon.o stap-tapset-mark.o stap-tapset-itrace.o stap-tapset-utrace.o stap-task_finder.o stap-dwflpp.o stap-rpm_finder.o stap-setupdwfl.o stap-remote.o stap-privilege.o stap-cmdline.o stap-tapset-dynprobe.o stap-tapset-method.o stap-translator-output.o stap-stapregex.o stap-stapregex-tree.o stap-stapregex-parse.o stap-stapregex-dfa.o stap-stringtable.o stap-tapset-python.o stap-interactive.o stap-bpf-base.o stap-bpf-bitset.o stap-bpf-translate.o stap-bpf-opt.o -Wl,--start-group -ldw -lebl -Wl,--end-group -lelf -lsqlite3 -lpthread -lreadline&lt;BR /&gt;| The script example index is outdated, run&lt;BR /&gt;| cd ../git/testsuite/systemtap.examples &amp;amp;&amp;amp; \&lt;BR /&gt;| perl examples-index-gen.pl&lt;BR /&gt;| to regenerate it.&lt;BR /&gt;| /home/quaijing/imx-yocto-bsp/build-imx8qm/tmp/work/aarch64-poky-linux/systemtap/4.0-r0/recipe-sysroot-native/usr/bin/aarch64-poky-linux/../../libexec/aarch64-poky-linux/gcc/aarch64-poky-linux/8.3.0/ld: stap-tapsets.o: file not recognized: file truncated&lt;BR /&gt;| collect2: error: ld returned 1 exit status&lt;BR /&gt;| Makefile:945: recipe for target 'stap' failed&lt;BR /&gt;| make[2]: *** [stap] Error 1&lt;BR /&gt;| make[2]: Leaving directory '/home/quaijing/imx-yocto-bsp/build-imx8qm/tmp/work/aarch64-poky-linux/systemtap/4.0-r0/build'&lt;BR /&gt;| Makefile:2097: recipe for target 'all-recursive' failed&lt;BR /&gt;| make[1]: *** [all-recursive] Error 1&lt;BR /&gt;| make[1]: Leaving directory '/home/quaijing/imx-yocto-bsp/build-imx8qm/tmp/work/aarch64-poky-linux/systemtap/4.0-r0/build'&lt;BR /&gt;| Makefile:781: recipe for target 'all' failed&lt;BR /&gt;| make: *** [all] Error 2&lt;BR /&gt;| ERROR: oe_runmake failed&lt;BR /&gt;| WARNING: exit code 1 from a shell command.&lt;BR /&gt;| ERROR: Function failed: do_compile (log file is located at /home/quaijing/imx-yocto-bsp/build-imx8qm/tmp/work/aarch64-poky-linux/systemtap/4.0-r0/temp/log.do_compile.38750)&lt;BR /&gt;ERROR: Task (/home/quaijing/imx-yocto-bsp/sources/poky/meta/recipes-kernel/systemtap/systemtap_git.bb:do_compile) failed with exit code '1'&lt;BR /&gt;NOTE: Tasks Summary: Attempted 5188 tasks of which 5185 didn't need to be rerun and 1 failed.&lt;/P&gt;
&lt;P&gt;Summary: 1 task failed:&lt;BR /&gt;/home/quaijing/imx-yocto-bsp/sources/poky/meta/recipes-kernel/systemtap/systemtap_git.bb:do_compile&lt;BR /&gt;Summary: There were 2 ERROR messages shown, returning a non-zero exit code.&lt;/P&gt;
&lt;P&gt;&amp;nbsp;&lt;/P&gt;
&lt;P&gt;&amp;nbsp;&lt;/P&gt;
&lt;P&gt;what should I do to fix the problem?Thanks&lt;/P&gt;</description>
      <pubDate>Tue, 17 Oct 2023 23:05:59 GMT</pubDate>
      <guid>https://community.nxp.com/t5/i-MX-Processors/IMX8QMMEK-YOCTO-bitbake/m-p/1191362#M214315</guid>
      <dc:creator>quaijing</dc:creator>
      <dc:date>2023-10-17T23:05:59Z</dc:date>
    </item>
    <item>
      <title>Re: IMX8QMMEK  YOCTO-bitbake</title>
      <link>https://community.nxp.com/t5/i-MX-Processors/IMX8QMMEK-YOCTO-bitbake/m-p/1227504#M214316</link>
      <description>&lt;P&gt;Hi ,&lt;/P&gt;
&lt;P&gt;&amp;nbsp;&amp;nbsp; I tested it on ubunt 18.04/20.04 , you can used one of them and install packages below:&lt;/P&gt;
&lt;P&gt;&amp;nbsp; if you are in China, you can change ubuntu 18.04/20.04 source to &lt;SPAN class="VIiyi"&gt;&lt;SPAN class="JLqJ4b ChMk0b" data-language-for-alternatives="en" data-language-to-translate-into="zh-CN" data-phrase-index="0"&gt;&lt;SPAN&gt;Tsinghua University's.&lt;/SPAN&gt;&lt;/SPAN&gt;&lt;/SPAN&gt;&lt;/P&gt;
&lt;P&gt;(1) After changing ubuntu source ,run these 2 commands&lt;/P&gt;
&lt;P&gt;# sudo apt-get update&lt;BR /&gt;# sudo apt-get upgrade&lt;BR /&gt;(2)Installing software packages for cross-compile linux BSP&lt;BR /&gt;# sudo apt-get install flex bison gperf build-essential zlib1g-dev&lt;BR /&gt;# sudo apt-get install lib32ncurses5-dev x11proto-core-dev&lt;BR /&gt;# sudo apt-get install libx11-dev lib32z1-dev libgl1-mesa-dev&lt;BR /&gt;# sudo apt-get install tofrodos python-markdown libxml2-utils xsltproc&lt;BR /&gt;# sudo apt-get install uuid-dev:i386 liblzo2-dev:i386 gcc-multilib g++-multilib&lt;BR /&gt;[commnent]&lt;BR /&gt;For Debian-10 uuid-dev:i386 liblzo2-dev:i386---&amp;gt; uuid-dev liblzo2-dev&lt;BR /&gt;# sudo apt-get install subversion openssh-server openssh-client uuid uuid-dev zlib1g-dev&lt;BR /&gt;# sudo apt-get install liblz-dev lzop liblzo2-2 liblzo2-dev git-core curl&lt;BR /&gt;# sudo apt-get install python3 python3-pip python3-pexpect python3-git python3-jinja2 pylint3&lt;BR /&gt;# sudo apt-get install u-boot-tools mtd-utils android-tools-fsutils&lt;BR /&gt;[commnent]&lt;BR /&gt;For ubuntu 20.04 LTS, don’t need android-tools-fsutils. So remove it, please!&lt;BR /&gt;# sudo apt-get install openjdk-8-jdk device-tree-compiler aptitude&lt;BR /&gt;[commnent]&lt;BR /&gt;For Debian-10 openjdk-8-jdk --- &amp;gt; default-jdk&lt;BR /&gt;# sudo apt-get install libcurl4-openssl-dev nss-updatedb&lt;BR /&gt;# sudo apt-get install chrpath texinfo gawk cpio diffstat&lt;BR /&gt;# sudo apt-get install libncursesw5-dev libssl-dev libegl1-mesa libncurses5&lt;BR /&gt;# sudo apt-get install net-tools python libsdl1.2-dev xterm socat&lt;BR /&gt;# sudo apt-get install icedtea-netx-common icedtea-netx&lt;/P&gt;
&lt;P&gt;&amp;nbsp;&lt;/P&gt;
&lt;P&gt;Then follow steps described in i.MX_Yocto_Project_User's_Guide.pdf to compile linux bsp.&lt;/P&gt;
&lt;P&gt;&amp;nbsp;&lt;/P&gt;
&lt;P&gt;Hope above items are helpful to you.&lt;/P&gt;
&lt;P&gt;Have a nice day!&lt;/P&gt;
&lt;P&gt;B.R,&lt;/P&gt;
&lt;P&gt;weidong&lt;/P&gt;</description>
      <pubDate>Sun, 07 Feb 2021 05:45:10 GMT</pubDate>
      <guid>https://community.nxp.com/t5/i-MX-Processors/IMX8QMMEK-YOCTO-bitbake/m-p/1227504#M214316</guid>
      <dc:creator>weidong_sun</dc:creator>
      <dc:date>2021-02-07T05:45:10Z</dc:date>
    </item>
  </channel>
</rss>

