{"text_format":"1","workbook":"xlsx","n_sheets":7,"sheets":["ReleaseNotes","PLL","Devices","PLL_1","PLL_2","PLL_3","PLL_4"],"not_rendered":{"charts":0,"images":0,"macros":1,"external_links":0,"defined_names":14,"comments":0,"pivot_tables":0},"unopened":[],"bounds":{"document_bytes":16777216,"sheet_cells":100000,"rows_first":2000,"rows_last":500,"rows_between":2000,"halvings":0,"cell_chars":16384,"cell_head_chars":4096},"cells_cut":0,"cells_raw":0,"read":"whole","date_system":"1900"}

{"sheet":"ReleaseNotes","index":0,"n_rows":59,"n_cols":1,"rows_kept":59,"cut":false,"hidden":false,"merged":[]}
["*******************************************************************************"]
["Freescale Semiconductor Inc."]
["(c) Copyright 2012 Freescale Semiconductor, Inc."]
["ALL RIGHTS RESERVED."]
["********************************************************************************"]
["Services performed by FREESCALE in this matter are performed AS IS and without"]
["any warranty. CUSTOMER retains the final decision relative to the total design"]
["and functionality of the end product. FREESCALE neither guarantees nor will be"]
["held liable by CUSTOMER for the success of this project."]
["FREESCALE DISCLAIMS ALL WARRANTIES, EXPRESSED, IMPLIED OR STATUTORY INCLUDING,"]
["BUT NOT LIMITED TO, IMPLIED WARRANTY OF MERCHANTABILITY OR FITNESS FOR"]
["A PARTICULAR PURPOSE ON ANY HARDWARE, SOFTWARE ORE ADVISE SUPPLIED "]
["TO THE PROJECT BY FREESCALE, AND OR NAY PRODUCT RESULTING FROM FREESCALE "]
["SERVICES. IN NO EVENT SHALL FREESCALE BE LIABLE FOR INCIDENTAL OR CONSEQUENTIAL "]
["DAMAGES ARISING OUT OF THIS AGREEMENT."]
["CUSTOMER agrees to hold FREESCALE harmless against any and all claims demands "]
["or actions by anyone on account of any damage, or injury, whether commercial,"]
["contractual, or tortuous, rising directly or indirectly as a result "]
["of the advise or assistance supplied CUSTOMER in connection with product, "]
["services or goods supplied under this Agreement."]
{"$rows_left_out":40}
{"sheet":"PLL","index":1,"n_rows":33,"n_cols":22,"rows_kept":33,"cut":false,"hidden":false,"merged":[[12,1,12,9],[3,20,4,20],[3,21,4,21],[3,13,4,13],[3,14,3,17],[4,14,4,17],[23,1,23,9],[22,1,22,9],[29,1,29,9],[30,1,30,9],[31,1,31,9],[32,1,32,9],[24,1,24,9],[25,1,25,9],[26,1,26,9],[27,1,27,9],[28,1,28,9],[16,1,16,9],[15,1,15,9],[14,1,14,9],[13,1,13,9],[21,1,21,9],[20,1,20,9],[19,1,19,9],[18,1,18,9],[17,1,17,9]]}
[]
[]
[null,"Device","MPC5634M",null,{"$f":"IF(ISNA(device_index),\"Not supported. Select supported MCU from the list!\",\"- Select device\")","v":"- Select device"}]
[null,null,null,null,null,null,null,null,null,null,null,null,null,{"$f":"INDIRECT(\"PLL_\"&Devices!$C$4&\"!o3\")","v":"fsys = fin *"},{"$f":"INDIRECT(\"PLL_\"&Devices!$C$4&\"!q3\")","v":"MFD + 4"},null,null,null,null,null,{"$f":"INDIRECT(\"PLL_\"&Devices!$C$4&\"!t3\")","v":"fvco = fsys *"},{"$f":"INDIRECT(\"PLL_\"&Devices!$C$4&\"!v3\")","v":"4 * 2^RFD"}]
[null,"fin [Mhz]",16,null,{"$f":"IF(ISNUMBER($C$5),\"- Select crystal/input frequency or enter new one\",\"- Enter numbers only!\")","v":"- Select crystal/input frequency or enter new one"},null,null,null,null,null,null,null,null,null,{"$f":"INDIRECT(\"PLL_\"&Devices!$C$4&\"!q4\")","v":"(PREDIV + 1) * 2^RFD"}]
[null,"fsys [Mhz]",60,null,{"$f":"IF(ISNUMBER($C$6),IF($C$6>fsys_max,\" ! Maximum system clock is \"&Devices!$C$7&\"Mhz !\",\"- Select fsys or enter new one\"),\"- Enter numbers only!\")","v":"- Select fsys or enter new one"}]
[]
[null,"Enhance","No",null,{"$f":"\"- Select between Enhance/Legacy mode\"","v":"- Select between Enhance/Legacy mode"}]
[]
[null,"Setting",1,null,{"$f":"IF(ISNUMBER($C$10),IF($C$10=0,\"- No possible configuration\",\"- Select possible configuration\"),\"- Enter numbers only!\")","v":"- Select possible configuration"},null,null,null,null,null,null,{"$f":"INDIRECT(CONCATENATE(\"PLL\",Devices!$C$4,\"_result\"))","v":" "},"MFD","PREDIF","RFD"," ","fPLLin","fVCO","fsys"," ","SYNCR",""]
[null,null,null,null,null,null,null,null,null,null,null,1,11,1,1," ",8,480,60," ","0x15880000",""]
[null,null,null,null,null,null,null,null,null,null,null,"","","",""," ","","",""," ","",""]
[null,{"$f":"INDIRECT(CONCATENATE(\"PLL_\",Devices!$C$4,\"!\",Devices!$C$10,Devices!$D$10))","v":"/* Set sysclk = 60MHz running from PLL with 16 MHz crystal reference. */"},null,null,null,null,null,null,null,null,null,"","","",""," ","","",""," ","",""]
[null,{"$f":"INDIRECT(CONCATENATE(\"PLL_\",Devices!$C$4,\"!\",Devices!$C$10,Devices!$D$10+1))","v":"void initSysclk (void) {"},null,null,null,null,null,null,null,null,null,"","","",""," ","","",""," ","",""]
[null,{"$f":"INDIRECT(CONCATENATE(\"PLL_\",Devices!$C$4,\"!\",Devices!$C$10,Devices!$D$10+2))","v":"FMPLL.ESYNCR1.B.CLKCFG = 0X7;\t/* Change clk to PLL normal mode from crystal */"},null,null,null,null,null,null,null,null,null,"","","",""," ","","",""," ","",""]
[null,{"$f":"INDIRECT(CONCATENATE(\"PLL_\",Devices!$C$4,\"!\",Devices!$C$10,Devices!$D$10+3))","v":"FMPLL.SYNCR.R = 0x15900000;\t\t/* Fsys =30Mhz */"},null,null,null,null,null,null,null,null,null,"","","",""," ","","",""," ","",""]
[null,{"$f":"INDIRECT(CONCATENATE(\"PLL_\",Devices!$C$4,\"!\",Devices!$C$10,Devices!$D$10+4))","v":"while (FMPLL.SYNSR.B.LOCK != 1) {};\t\t/* Wait for FMPLL to LOCK  */"},null,null,null,null,null,null,null,null,null,"","","",""," ","","",""," ","",""]
[null,{"$f":"INDIRECT(CONCATENATE(\"PLL_\",Devices!$C$4,\"!\",Devices!$C$10,Devices!$D$10+5))","v":"FMPLL.SYNCR.R = 0x15880000;\t\t/* Fsys =60Mhz */"},null,null,null,null,null,null,null,null,null,"","","",""," ","","",""," ","",""]
[null,{"$f":"INDIRECT(CONCATENATE(\"PLL_\",Devices!$C$4,\"!\",Devices!$C$10,Devices!$D$10+6))","v":"}"},null,null,null,null,null,null,null,null,null,"","","",""," ","","",""," ","",""]
[null,{"$f":"INDIRECT(CONCATENATE(\"PLL_\",Devices!$C$4,\"!\",Devices!$C$10,Devices!$D$10+7))","v":""},null,null,null,null,null,null,null,null,null,"","","",""," ","","",""," ","",""]
{"$rows_left_out":14}
{"sheet":"Devices","index":2,"n_rows":44,"n_cols":18,"rows_kept":44,"cut":false,"hidden":false,"merged":[[8,1,9,1]]}
[null,"Device index",{"$f":"MATCH(C2,Device_list,0)","v":9}]
[null,"selected MCU",{"$f":"PLL!C3","v":"MPC5634M"},null,null,null,"f_osc/xtal",null,"f_pll_in",null,"f_VCO/ICO"]
[null,"syst_freq",{"$f":"INDEX($E$14:$H$63,$C$1,1)","v":80},{"$f":"INDEX($E$14:$H$44,$C$1,2)","v":60},{"$f":"INDEX($E$14:$H$44,$C$1,3)","v":40},{"$f":"INDEX($E$14:$H$44,$C$1,4)","v":" "},"min",null,"min","max","min","max",null,"Mode: 1=Legacy 2=Enhanced/Legacy 3=JDP 4=Enhance"]
[null,"PLL type",{"$f":"INDEX(I14:I63,C1,1)","v":2},null,null,null,{"$f":"INDEX(L14:L63,$C$1,1)","v":4},20,4,16,256,512]
[null,"Legacy/enhance PLL",{"$f":"IF(C4=2,1,0)","v":1}]
[]
[null,"fsyst_max",{"$f":"INDEX($J$14:$J$63,$C$1,1)","v":80}]
[]
[null,"code variant","col","row"]
[null,null,{"$f":"INDIRECT(\"PLL_\"&C4&\"!L4\")","v":"B"},{"$f":"INDIRECT(\"PLL_\"&C4&\"!m4\")","v":202}]
[]
[null,null,null,null,null,null,null,null,null,null,null,"f_osc/xtal",null,"f_pll_in",null,"f_VCO/ICO",null,"code variant"]
[null,"index","Device list:",null,"freq #1","freq #2","freq #3","freq #4","Mode","fsys_max","fsys_min","min","max","min","max","min","max"]
[null,1,"MPC551x",null,80,66," "," ",4,80,null,4,40,4,10,192,500,"r"]
[null,2,"MPC553x",null,80,66,40," ",1,80,null,8,20,4,20,48,80]
[null,3,"MPC5553",null,132,112,80," ",1,132,null,8,20,4,20,48,132]
[null,4,"MPC5554",null,132,112,80," ",1,132,null,8,20,4,20,48,132]
[null,5,"MPC5561",null,132,112,80," ",1,132,null,8,40,4,20,48,132]
[null,6,"MPC5565",null,132,112,80," ",1,132,null,8,20,4,20,48,132]
[null,7,"MPC5566",null,144,132,112,80,1,144,null,8,20,4,20,48,144]
{"$rows_left_out":25}
{"sheet":"PLL_1","index":3,"n_rows":120,"n_cols":43,"rows_kept":120,"cut":false,"hidden":true,"merged":[[121,1,121,8],[1,11,1,12],[2,21,3,21],[3,16,3,17],[1,4,1,5],[1,6,1,7],[1,8,1,9],[2,14,3,15],[2,16,2,17],[2,19,3,20]]}
[]
[null,"Fin",{"$f":"PLL!C5","v":16},null,"f_osc/xtal",null,"f_pll_in",null,"f_VCO/ICO",null,null,"code variant"]
[null,"Fsys",{"$f":"PLL!C6","v":60},null,"min","max","min","max","min","max",null,"col","row",null,"fsys = fin *",null,"MFD + 4",null,null,"fico = fsys *",null,"2^RFD"]
[null,"Fmax",{"$f":"Devices!C7","v":80},null,{"$f":"Devices!G4","v":4},{"$f":"Devices!H4","v":20},{"$f":"Devices!I4","v":4},{"$f":"Devices!J4","v":16},{"$f":"Devices!K4","v":256},{"$f":"Devices!L4","v":512},null,{"$f":"IF(C91=0,\"B\",\"J\")","v":"B"},100,null,null,null,"(PREDIV+1) * 2^RFD"]
[]
[" ","MFD","PREDIV","RFD"," ","fPLLin","fICO","fsys"," ","SYNCR",{"$f":"\"\"","v":""}]
[{"$f":"IF(ISNUMBER(B7),1,\"\")","v":1},{"$f":"IF(ISNUMBER(C72),C72,\"\")","v":26},{"$f":"IF(ISNUMBER(C72),D72,\"\")","v":0},{"$f":"IF(ISNUMBER(C72),E72,\"\")","v":3}," ",{"$f":"IF(ISNUMBER(B7),$C$2/(C7+1),\"\")","v":16},{"$f":"IF(ISNUMBER(B7),$C$2/(C7+1)*(B7+4),\"\")","v":480},{"$f":"IF(ISNUMBER(B7),$C$2/(C7+1)*(B7+4)/2^(D7),\"\")","v":60}," ",{"$f":"IF(ISNUMBER(B7),\"0x\"&DEC2HEX(C7*2^28+D7*2^19+B7*2^23,8),\"\")","v":"0x0D180000"},{"$f":"\"\"","v":""}]
[{"$f":"IF(ISNUMBER(B8),A7+1,\"\")","v":""},{"$f":"IF(ISNUMBER(C73),C73,\"\")","v":""},{"$f":"IF(ISNUMBER(C73),D73,\"\")","v":""},{"$f":"IF(ISNUMBER(C73),E73,\"\")","v":""}," ",{"$f":"IF(ISNUMBER(B8),$C$2/(C8+1),\"\")","v":""},{"$f":"IF(ISNUMBER(B8),$C$2/(C8+1)*(B8+4),\"\")","v":""},{"$f":"IF(ISNUMBER(B8),$C$2/(C8+1)*(B8+4)/2^(D8),\"\")","v":""}," ",{"$f":"IF(ISNUMBER(B8),\"0x\"&DEC2HEX(C8*2^28+D8*2^19+B8*2^23,8),\"\")","v":""},{"$f":"\"\"","v":""}]
[{"$f":"IF(ISNUMBER(B9),A8+1,\"\")","v":""},{"$f":"IF(ISNUMBER(C74),C74,\"\")","v":""},{"$f":"IF(ISNUMBER(C74),D74,\"\")","v":""},{"$f":"IF(ISNUMBER(C74),E74,\"\")","v":""}," ",{"$f":"IF(ISNUMBER(B9),$C$2/(C9+1),\"\")","v":""},{"$f":"IF(ISNUMBER(B9),$C$2/(C9+1)*(B9+4),\"\")","v":""},{"$f":"IF(ISNUMBER(B9),$C$2/(C9+1)*(B9+4)/2^(D9),\"\")","v":""}," ",{"$f":"IF(ISNUMBER(B9),\"0x\"&DEC2HEX(C9*2^28+D9*2^19+B9*2^23,8),\"\")","v":""},{"$f":"\"\"","v":""}]
["","","",""," ","","",""," ","",{"$f":"\"\"","v":""}]
["","","",""," ","","",""," ","",{"$f":"\"\"","v":""}]
["","","",""," ","","",""," ","",{"$f":"\"\"","v":""}]
["","","",""," ","","",""," ","",{"$f":"\"\"","v":""}]
["","","",""," ","","",""," ","",{"$f":"\"\"","v":""}]
["","","",""," ","","",""," ","",{"$f":"\"\"","v":""}]
["","","",""," ","","",""," ","",{"$f":"\"\"","v":""}]
["","","",""," ","","",""," ","",{"$f":"\"\"","v":""}]
["","","",""," ","","",""," ","",{"$f":"\"\"","v":""}]
["","","",""," ","","",""," ","",{"$f":"\"\"","v":""}]
["","","",""," ","","",""," ","",{"$f":"\"\"","v":""}]
{"$rows_left_out":101}
{"sheet":"PLL_2","index":4,"n_rows":222,"n_cols":67,"rows_kept":222,"cut":false,"hidden":true,"merged":[[1,11,1,12],[2,21,3,21],[3,16,3,17],[1,8,1,9],[1,4,1,5],[1,6,1,7],[2,14,3,15],[2,16,2,17],[2,19,3,20]]}
[]
[null,"Fin",{"$f":"PLL!C5","v":16},null,"f_osc/xtal",null,"f_pll_in",null,"f_VCO/ICO",null,null,"code variant"]
[null,"Fsys",{"$f":"PLL!C6","v":60},null,"min","max","min","max","min","max",null,"col","row",null,"fsys = fin *",null,{"$f":"IF(C5=1,\"MFD + 4\",\"EMFD\")","v":"MFD + 4"},null,null,"fvco = fsys *",null,{"$f":"IF(C5=1,\"4 * 2^RFD\",\"2^(ERFD+1)\")","v":"4 * 2^RFD"}]
[null,"Fmax",{"$f":"Devices!C7","v":80},null,{"$f":"Devices!G4","v":4},{"$f":"Devices!H4","v":20},{"$f":"Devices!I4","v":4},{"$f":"Devices!J4","v":16},{"$f":"Devices!K4","v":256},{"$f":"Devices!L4","v":512},null,{"$f":"IF(C5=1,\"B\",\"J\")","v":"B"},202,null,null,null,{"$f":"IF(C5=1,Q8,Q9)","v":"(PREDIV + 1) * 2^RFD"}]
[null,"Legacy ",{"$f":"IF(PLL!C8=\"Yes\",0,1)","v":1}]
[" ",{"$f":"IF($C$5=1,H56,H174)","v":"MFD"},{"$f":"IF($C$5=1,I56,I174)","v":"PREDIF"},{"$f":"IF($C$5=1,J56,J174)","v":"RFD"},{"$f":"IF($C$5=1,K56,K174)","v":" "},{"$f":"IF($C$5=1,L56,L174)","v":"fPLLin"},{"$f":"IF($C$5=1,M56,M174)","v":"fVCO"},{"$f":"IF($C$5=1,N56,N174)","v":"fsys"}," ",{"$f":"IF($C$5=1,P56,P174)","v":"SYNCR"},{"$f":"IF($C$5=1,Q56,Q174)","v":""}]
[{"$f":"IF(ISNUMBER(B7),1,\"\")","v":1},11,1,1," ",8,480,60," ","0x15880000",""]
[{"$f":"IF(ISNUMBER(B8),A7+1,\"\")","v":""},"","",""," ","","",""," ","","",null,null,null,null,null,{"$f":"\"(PREDIV + 1) * 2^RFD\"","v":"(PREDIV + 1) * 2^RFD"}]
[{"$f":"IF(ISNUMBER(B9),A8+1,\"\")","v":""},{"$f":"IF($C$5=1,H59,H177)","v":""},{"$f":"IF($C$5=1,I59,I177)","v":""},{"$f":"IF($C$5=1,J59,J177)","v":""},{"$f":"IF($C$5=1,K59,K177)","v":" "},{"$f":"IF($C$5=1,L59,L177)","v":""},{"$f":"IF($C$5=1,M59,M177)","v":""},{"$f":"IF($C$5=1,N59,N177)","v":""}," ",{"$f":"IF($C$5=1,P59,P177)","v":""},"",null,null,null,null,null,{"$f":"\"(EPREDIV+1) * 2^(ERFD+1)\"","v":"(EPREDIV+1) * 2^(ERFD+1)"}]
["","","",""," ","","",""," ","",""]
["","","",""," ","","",""," ","",""]
["","","",""," ","","",""," ","",""]
["","","",""," ","","",""," ","",""]
["","","",""," ","","",""," ","",""]
["","","",""," ","","",""," ","",""]
["","","",""," ","","",""," ","",""]
["","","",""," ","","",""," ","",""]
["","","",""," ","","",""," ","",""]
["","","",""," ","","",""," ","",""]
["","","",""," ","","",""," ","",""]
{"$rows_left_out":203}
{"sheet":"PLL_3","index":5,"n_rows":146,"n_cols":78,"rows_kept":146,"cut":false,"hidden":true,"merged":[[1,11,1,12],[1,4,1,5],[1,6,1,7],[1,8,1,9],[2,21,3,21],[2,16,2,17],[3,16,3,17],[2,14,3,15],[2,19,3,20]]}
[]
[null,"Fin",{"$f":"PLL!C5","v":16},null,"f_osc/xtal",null,"f_pll_in",null,"f_VCO/ICO",null,null,"code variant"]
[null,"Fsys",{"$f":"IF(OR(Devices!C2=\"MPC5645S\",Devices!C2=\"PXD20\"),PLL!C6*2,PLL!C6)","v":60},null,"min","max","min","max","min","max",null,"col","row",null,"fsys = fin *",null,"NDIV",null,null,"fvco = fsys *",null,"2^(ODF+1)"]
[null,"Fmax",{"$f":"IF(OR(Devices!C2=\"MPC5645S\",Devices!C2=\"PXD20\"),Devices!C7*2,Devices!C7)","v":80},null,{"$f":"Devices!G4","v":4},{"$f":"Devices!H4","v":20},{"$f":"Devices!I4","v":4},{"$f":"Devices!J4","v":16},{"$f":"Devices!K4","v":256},{"$f":"Devices!L4","v":512},null,{"$f":"INDEX(Devices!$R$14:$R$44,Devices!$C$1,1)","v":0},126,null,null,null,"(IDF+1) * 2^(ODF+1)"]
[]
[" ","NDIV","IDF","ODF"," ","fPLLin","fVCO","fsys"," ","FMPLL_CR",{"$f":"\"\"","v":""}]
[{"$f":"IF(ISNUMBER(B7),1,\"\")","v":1},{"$f":"IF(ISNUMBER(C105),C105,\"\")","v":60},{"$f":"IF(ISNUMBER(C105),D105,\"\")","v":1},{"$f":"IF(ISNUMBER(C105),E105,\"\")","v":2}," ",{"$f":"IF(ISNUMBER(B7),$C$2/(C7+1),\"\")","v":8},{"$f":"IF(ISNUMBER(B7),$C$2/(C7+1)*B7,\"\")","v":480},{"$f":"IF(ISNUMBER(B7),IF(OR(Devices!$C$2=\"MPC5645S\",Devices!$C$2=\"PXD20\"),$C$2/(C7+1)*B7/2^(D7+1)/2,$C$2/(C7+1)*B7/2^(D7+1)),\"\")","v":60}," ",{"$f":"IF(ISNUMBER(B7),\"0x\"&DEC2HEX(C7*2^26+D7*2^24+B7*2^16+2^8,8),\"\")","v":"0x063C0100"},{"$f":"\"\"","v":""}]
[{"$f":"IF(ISNUMBER(B8),A7+1,\"\")","v":2},{"$f":"IF(ISNUMBER(C106),C106,\"\")","v":90},{"$f":"IF(ISNUMBER(C106),D106,\"\")","v":2},{"$f":"IF(ISNUMBER(C106),E106,\"\")","v":2}," ",{"$f":"IF(ISNUMBER(B8),$C$2/(C8+1),\"\")","v":5.333333333333333},{"$f":"IF(ISNUMBER(B8),$C$2/(C8+1)*B8,\"\")","v":480},{"$f":"IF(ISNUMBER(B8),IF(OR(Devices!$C$2=\"MPC5645S\",Devices!$C$2=\"PXD20\"),$C$2/(C8+1)*B8/2^(D8+1)/2,$C$2/(C8+1)*B8/2^(D8+1)),\"\")","v":60}," ",{"$f":"IF(ISNUMBER(B8),\"0x\"&DEC2HEX(C8*2^26+D8*2^24+B8*2^16+2^8,8),\"\")","v":"0x0A5A0100"},{"$f":"\"\"","v":""}]
[{"$f":"IF(ISNUMBER(B9),A8+1,\"\")","v":""},{"$f":"IF(ISNUMBER(C107),C107,\"\")","v":""},{"$f":"IF(ISNUMBER(C107),D107,\"\")","v":""},{"$f":"IF(ISNUMBER(C107),E107,\"\")","v":""}," ",{"$f":"IF(ISNUMBER(B9),$C$2/(C9+1),\"\")","v":""},{"$f":"IF(ISNUMBER(B9),$C$2/(C9+1)*B9,\"\")","v":""},{"$f":"IF(ISNUMBER(B9),IF(OR(Devices!$C$2=\"MPC5645S\",Devices!$C$2=\"PXD20\"),$C$2/(C9+1)*B9/2^(D9+1)/2,$C$2/(C9+1)*B9/2^(D9+1)),\"\")","v":""}," ",{"$f":"IF(ISNUMBER(B9),\"0x\"&DEC2HEX(C9*2^26+D9*2^24+B9*2^16+2^8,8),\"\")","v":""},{"$f":"\"\"","v":""}]
["","","",""," ","","",{"$f":"IF(ISNUMBER(B10),IF(OR(Devices!$C$2=\"MPC5645S\",Devices!$C$2=\"PXD20\"),$C$2/(C10+1)*B10/2^(D10+1)/2,$C$2/(C10+1)*B10/2^(D10+1)),\"\")","v":""}," ","",{"$f":"\"\"","v":""}]
["","","",""," ","","",{"$f":"IF(ISNUMBER(B11),IF(OR(Devices!$C$2=\"MPC5645S\",Devices!$C$2=\"PXD20\"),$C$2/(C11+1)*B11/2^(D11+1)/2,$C$2/(C11+1)*B11/2^(D11+1)),\"\")","v":""}," ","",{"$f":"\"\"","v":""}]
["","","",""," ","","",{"$f":"IF(ISNUMBER(B12),IF(OR(Devices!$C$2=\"MPC5645S\",Devices!$C$2=\"PXD20\"),$C$2/(C12+1)*B12/2^(D12+1)/2,$C$2/(C12+1)*B12/2^(D12+1)),\"\")","v":""}," ","",{"$f":"\"\"","v":""}]
["","","",""," ","","",{"$f":"IF(ISNUMBER(B13),IF(OR(Devices!$C$2=\"MPC5645S\",Devices!$C$2=\"PXD20\"),$C$2/(C13+1)*B13/2^(D13+1)/2,$C$2/(C13+1)*B13/2^(D13+1)),\"\")","v":""}," ","",{"$f":"\"\"","v":""}]
["","","",""," ","","",{"$f":"IF(ISNUMBER(B14),IF(OR(Devices!$C$2=\"MPC5645S\",Devices!$C$2=\"PXD20\"),$C$2/(C14+1)*B14/2^(D14+1)/2,$C$2/(C14+1)*B14/2^(D14+1)),\"\")","v":""}," ","",{"$f":"\"\"","v":""}]
["","","",""," ","","",{"$f":"IF(ISNUMBER(B15),IF(OR(Devices!$C$2=\"MPC5645S\",Devices!$C$2=\"PXD20\"),$C$2/(C15+1)*B15/2^(D15+1)/2,$C$2/(C15+1)*B15/2^(D15+1)),\"\")","v":""}," ","",{"$f":"\"\"","v":""}]
["","","",""," ","","",{"$f":"IF(ISNUMBER(B16),IF(OR(Devices!$C$2=\"MPC5645S\",Devices!$C$2=\"PXD20\"),$C$2/(C16+1)*B16/2^(D16+1)/2,$C$2/(C16+1)*B16/2^(D16+1)),\"\")","v":""}," ","",{"$f":"\"\"","v":""}]
["","","",""," ","","",{"$f":"IF(ISNUMBER(B17),IF(OR(Devices!$C$2=\"MPC5645S\",Devices!$C$2=\"PXD20\"),$C$2/(C17+1)*B17/2^(D17+1)/2,$C$2/(C17+1)*B17/2^(D17+1)),\"\")","v":""}," ","",{"$f":"\"\"","v":""}]
["","","",""," ","","",{"$f":"IF(ISNUMBER(B18),IF(OR(Devices!$C$2=\"MPC5645S\",Devices!$C$2=\"PXD20\"),$C$2/(C18+1)*B18/2^(D18+1)/2,$C$2/(C18+1)*B18/2^(D18+1)),\"\")","v":""}," ","",{"$f":"\"\"","v":""}]
["","","",""," ","","",{"$f":"IF(ISNUMBER(B19),IF(OR(Devices!$C$2=\"MPC5645S\",Devices!$C$2=\"PXD20\"),$C$2/(C19+1)*B19/2^(D19+1)/2,$C$2/(C19+1)*B19/2^(D19+1)),\"\")","v":""}," ","",{"$f":"\"\"","v":""}]
["","","",""," ","","",{"$f":"IF(ISNUMBER(B20),IF(OR(Devices!$C$2=\"MPC5645S\",Devices!$C$2=\"PXD20\"),$C$2/(C20+1)*B20/2^(D20+1)/2,$C$2/(C20+1)*B20/2^(D20+1)),\"\")","v":""}," ","",{"$f":"\"\"","v":""}]
{"$rows_left_out":127}
{"sheet":"PLL_4","index":6,"n_rows":188,"n_cols":267,"rows_kept":188,"cut":false,"hidden":true,"merged":[[1,11,1,12],[2,21,3,21],[3,16,3,17],[1,4,1,5],[1,6,1,7],[1,8,1,9],[2,14,3,15],[2,16,2,17],[2,19,3,20]]}
[]
[null,"Fin",{"$f":"PLL!C5","v":16},null,"f_osc/xtal",null,"f_pll_in",null,"f_VCO/ICO",null,null,"code variant"]
[null,"Fsys",{"$f":"PLL!C6","v":60},null,"min","max","min","max","min","max",null,"col","row",null,"fsys = fin *",null,"EMFD + 16",null,null,"fvco = fsys *",null,"(ERFD+1)"]
[null,"Fmax",{"$f":"Devices!C7","v":80},null,{"$f":"Devices!G4","v":4},{"$f":"Devices!H4","v":20},{"$f":"Devices!I4","v":4},{"$f":"Devices!J4","v":16},{"$f":"Devices!K4","v":256},{"$f":"Devices!L4","v":512},null,{"$f":"INDEX(Devices!$R$14:$R$44,Devices!$C$1,1)","v":0},168,null,null,null,"(EPREDIV+1) * (ERFD+1)"]
[]
[" ","EMFD","EPREDIV","ERFD"," ","fPLLin","fVCO","fsys"," ","ESYNCR1","ESYNCR2"]
[{"$f":"IF(ISNUMBER(B7),1,\"\")","v":1},{"$f":"IF(ISNUMBER(C141),C141,\"\")","v":44},{"$f":"IF(ISNUMBER(C141),D141,\"\")","v":1},{"$f":"IF(ISNUMBER(C141),E141,\"\")","v":7}," ",{"$f":"IF(ISNUMBER(B7),$C$2/(C7+1),\"\")","v":8},{"$f":"IF(ISNUMBER(B7),$C$2/(C7+1)*(B7+16),\"\")","v":480},{"$f":"IF(ISNUMBER(B7),$C$2/(C7+1)*(B7+16)/(D7+1),\"\")","v":60}," ",{"$f":"IF(ISNUMBER(B7),\"0x\"&DEC2HEX(7*2^28+C7*2^16+B7,8),\"\")","v":"0x7001002C"},{"$f":"IF(ISNUMBER(B7),\"0x\"&DEC2HEX(D7,8),\"\")","v":"0x00000007"}]
[{"$f":"IF(ISNUMBER(B8),A7+1,\"\")","v":2},{"$f":"IF(ISNUMBER(C142),C142,\"\")","v":74},{"$f":"IF(ISNUMBER(C142),D142,\"\")","v":2},{"$f":"IF(ISNUMBER(C142),E142,\"\")","v":7}," ",{"$f":"IF(ISNUMBER(B8),$C$2/(C8+1),\"\")","v":5.333333333333333},{"$f":"IF(ISNUMBER(B8),$C$2/(C8+1)*(B8+16),\"\")","v":480},{"$f":"IF(ISNUMBER(B8),$C$2/(C8+1)*(B8+16)/(D8+1),\"\")","v":60}," ",{"$f":"IF(ISNUMBER(B8),\"0x\"&DEC2HEX(7*2^28+C8*2^16+B8,8),\"\")","v":"0x7002004A"},{"$f":"IF(ISNUMBER(B8),\"0x\"&DEC2HEX(D8,8),\"\")","v":"0x00000007"}]
[{"$f":"IF(ISNUMBER(B9),A8+1,\"\")","v":3},{"$f":"IF(ISNUMBER(C143),C143,\"\")","v":74},{"$f":"IF(ISNUMBER(C143),D143,\"\")","v":3},{"$f":"IF(ISNUMBER(C143),E143,\"\")","v":5}," ",{"$f":"IF(ISNUMBER(B9),$C$2/(C9+1),\"\")","v":4},{"$f":"IF(ISNUMBER(B9),$C$2/(C9+1)*(B9+16),\"\")","v":360},{"$f":"IF(ISNUMBER(B9),$C$2/(C9+1)*(B9+16)/(D9+1),\"\")","v":60}," ",{"$f":"IF(ISNUMBER(B9),\"0x\"&DEC2HEX(7*2^28+C9*2^16+B9,8),\"\")","v":"0x7003004A"},{"$f":"IF(ISNUMBER(B9),\"0x\"&DEC2HEX(D9,8),\"\")","v":"0x00000005"}]
[4,104,3,7," ",4,480,60," ","0x70030068","0x00000007"]
["","","",""," ","","",""," ","",""]
["","","",""," ","","",""," ","",""]
["","","",""," ","","",""," ","",""]
["","","",""," ","","",""," ","",""]
["","","",""," ","","",""," ","",""]
["","","",""," ","","",""," ","",""]
["","","",""," ","","",""," ","",""]
["","","",""," ","","",""," ","",""]
["","","",""," ","","",""," ","",""]
["","","",""," ","","",""," ","",""]
{"$rows_left_out":168}