{"text_format":"1","workbook":"xlsx","n_sheets":7,"sheets":["ReleaseNotes","PLL","Devices","PLL_1","PLL_2","PLL_3","PLL_4"],"not_rendered":{"charts":0,"images":0,"macros":1,"external_links":0,"defined_names":14,"comments":0,"pivot_tables":0},"unopened":[],"bounds":{"document_bytes":16777216,"sheet_cells":100000,"rows_first":2000,"rows_last":500,"rows_between":2000,"halvings":0,"cell_chars":16384,"cell_head_chars":4096},"cells_cut":0,"cells_raw":0,"read":"whole","date_system":"1900"}

{"sheet":"ReleaseNotes","index":0,"n_rows":59,"n_cols":1,"rows_kept":59,"cut":false,"hidden":false,"merged":[]}
["*******************************************************************************"]
["Freescale Semiconductor Inc."]
["(c) Copyright 2012 Freescale Semiconductor, Inc."]
["ALL RIGHTS RESERVED."]
["********************************************************************************"]
["Services performed by FREESCALE in this matter are performed AS IS and without"]
["any warranty. CUSTOMER retains the final decision relative to the total design"]
["and functionality of the end product. FREESCALE neither guarantees nor will be"]
["held liable by CUSTOMER for the success of this project."]
["FREESCALE DISCLAIMS ALL WARRANTIES, EXPRESSED, IMPLIED OR STATUTORY INCLUDING,"]
["BUT NOT LIMITED TO, IMPLIED WARRANTY OF MERCHANTABILITY OR FITNESS FOR"]
["A PARTICULAR PURPOSE ON ANY HARDWARE, SOFTWARE ORE ADVISE SUPPLIED "]
["TO THE PROJECT BY FREESCALE, AND OR NAY PRODUCT RESULTING FROM FREESCALE "]
["SERVICES. IN NO EVENT SHALL FREESCALE BE LIABLE FOR INCIDENTAL OR CONSEQUENTIAL "]
["DAMAGES ARISING OUT OF THIS AGREEMENT."]
["CUSTOMER agrees to hold FREESCALE harmless against any and all claims demands "]
["or actions by anyone on account of any damage, or injury, whether commercial,"]
["contractual, or tortuous, rising directly or indirectly as a result "]
["of the advise or assistance supplied CUSTOMER in connection with product, "]
["services or goods supplied under this Agreement."]
["********************************************************************************"]
["File:                  PLL_calculator.xls"]
["Owner:            stnp002"]
["Classification:   General Business Information"]
["********************************************************************************"]
["Detailed Description: "]
[]
["This calculator simplifies PLL setting calculation for Qorivva and PX Series MCUs."]
["Use just a PLL tab and follow these steps:"]
["1. Select the device from the list"]
["2. Select input clock frequency from a list or enter new value"]
["3. Select desired system clock frequency  or enter new value"]
["4. If MPC5634M or MPC5644A is selected, chose between \"legacy\" and \"enhance\" PLL mode"]
["5. Select one of the calculated configuration and copy generated code if needed"]
[]
["********************************************************************************"]
[]
["Revision History:"]
[]
["Version 1.0     Feb-21-2012     stnp002"]
[]
["- this is first release version of PLL calculator"]
["- supported devices: MPC551x, MPC553x, MPC5553, MPC5554, MPC5561, MPC5565, MPC5566, MPC5567"]
["                                           MPC5634M, MPC5644A"]
["                                           MPC5604B/C, MPC5607B, MPC5602D, MPC6746BC, MPC5604P, MPC5606P/T, MPC5602P"]
["                                           MPC5604E, MPC5643L, MPC5675K, MPC5606S, MPC5645S"]
["                                           MPC5674F, MPC5676R, MPC5668G/E"]
["                                           PXR40, PXS30, PXS20, PXN20, PXD20, PXD10"]
[]
["Version 1.1     Jun-13-2012     stnp002"]
[]
[{"$f":"\"- added VBA code, so if macro is enabled:\"","v":"- added VBA code, so if macro is enabled:"}]
[{"$f":"\"      - it simplifies the selection of calculated configuration; just click on the line within a generated table\"","v":"      - it simplifies the selection of calculated configuration; just click on the line within a generated table"}]
[{"$f":"\"      - Fsys value is also changed to the predefined value when new device is selected\"","v":"      - Fsys value is also changed to the predefined value when new device is selected"}]
[]
["Version 1.2     Feb-11-2012     stnp002"]
[]
[{"$f":"\"- added 'Copy Code' button to ease code copying\"","v":"- added 'Copy Code' button to ease code copying"}]
[{"$f":"\"    - copied code can be pasted into desired application without additional TABs and new lines\"","v":"    - copied code can be pasted into desired application without additional TABs and new lines"}]

{"sheet":"PLL","index":1,"n_rows":33,"n_cols":22,"rows_kept":33,"cut":false,"hidden":false,"merged":[[12,1,12,9],[3,20,4,20],[3,21,4,21],[3,13,4,13],[3,14,3,17],[4,14,4,17],[23,1,23,9],[22,1,22,9],[29,1,29,9],[30,1,30,9],[31,1,31,9],[32,1,32,9],[24,1,24,9],[25,1,25,9],[26,1,26,9],[27,1,27,9],[28,1,28,9],[16,1,16,9],[15,1,15,9],[14,1,14,9],[13,1,13,9],[21,1,21,9],[20,1,20,9],[19,1,19,9],[18,1,18,9],[17,1,17,9]]}
[]
[]
[null,"Device","MPC5634M",null,{"$f":"IF(ISNA(device_index),\"Not supported. Select supported MCU from the list!\",\"- Select device\")","v":"- Select device"}]
[null,null,null,null,null,null,null,null,null,null,null,null,null,{"$f":"INDIRECT(\"PLL_\"&Devices!$C$4&\"!o3\")","v":"fsys = fin *"},{"$f":"INDIRECT(\"PLL_\"&Devices!$C$4&\"!q3\")","v":"MFD + 4"},null,null,null,null,null,{"$f":"INDIRECT(\"PLL_\"&Devices!$C$4&\"!t3\")","v":"fvco = fsys *"},{"$f":"INDIRECT(\"PLL_\"&Devices!$C$4&\"!v3\")","v":"4 * 2^RFD"}]
[null,"fin [Mhz]",16,null,{"$f":"IF(ISNUMBER($C$5),\"- Select crystal/input frequency or enter new one\",\"- Enter numbers only!\")","v":"- Select crystal/input frequency or enter new one"},null,null,null,null,null,null,null,null,null,{"$f":"INDIRECT(\"PLL_\"&Devices!$C$4&\"!q4\")","v":"(PREDIV + 1) * 2^RFD"}]
[null,"fsys [Mhz]",60,null,{"$f":"IF(ISNUMBER($C$6),IF($C$6>fsys_max,\" ! Maximum system clock is \"&Devices!$C$7&\"Mhz !\",\"- Select fsys or enter new one\"),\"- Enter numbers only!\")","v":"- Select fsys or enter new one"}]
[]
[null,"Enhance","No",null,{"$f":"\"- Select between Enhance/Legacy mode\"","v":"- Select between Enhance/Legacy mode"}]
[]
[null,"Setting",1,null,{"$f":"IF(ISNUMBER($C$10),IF($C$10=0,\"- No possible configuration\",\"- Select possible configuration\"),\"- Enter numbers only!\")","v":"- Select possible configuration"},null,null,null,null,null,null,{"$f":"INDIRECT(CONCATENATE(\"PLL\",Devices!$C$4,\"_result\"))","v":" "},"MFD","PREDIF","RFD"," ","fPLLin","fVCO","fsys"," ","SYNCR",""]
[null,null,null,null,null,null,null,null,null,null,null,1,11,1,1," ",8,480,60," ","0x15880000",""]
[null,null,null,null,null,null,null,null,null,null,null,"","","",""," ","","",""," ","",""]
[null,{"$f":"INDIRECT(CONCATENATE(\"PLL_\",Devices!$C$4,\"!\",Devices!$C$10,Devices!$D$10))","v":"/* Set sysclk = 60MHz running from PLL with 16 MHz crystal reference. */"},null,null,null,null,null,null,null,null,null,"","","",""," ","","",""," ","",""]
[null,{"$f":"INDIRECT(CONCATENATE(\"PLL_\",Devices!$C$4,\"!\",Devices!$C$10,Devices!$D$10+1))","v":"void initSysclk (void) {"},null,null,null,null,null,null,null,null,null,"","","",""," ","","",""," ","",""]
[null,{"$f":"INDIRECT(CONCATENATE(\"PLL_\",Devices!$C$4,\"!\",Devices!$C$10,Devices!$D$10+2))","v":"FMPLL.ESYNCR1.B.CLKCFG = 0X7;\t/* Change clk to PLL normal mode from crystal */"},null,null,null,null,null,null,null,null,null,"","","",""," ","","",""," ","",""]
[null,{"$f":"INDIRECT(CONCATENATE(\"PLL_\",Devices!$C$4,\"!\",Devices!$C$10,Devices!$D$10+3))","v":"FMPLL.SYNCR.R = 0x15900000;\t\t/* Fsys =30Mhz */"},null,null,null,null,null,null,null,null,null,"","","",""," ","","",""," ","",""]
[null,{"$f":"INDIRECT(CONCATENATE(\"PLL_\",Devices!$C$4,\"!\",Devices!$C$10,Devices!$D$10+4))","v":"while (FMPLL.SYNSR.B.LOCK != 1) {};\t\t/* Wait for FMPLL to LOCK  */"},null,null,null,null,null,null,null,null,null,"","","",""," ","","",""," ","",""]
[null,{"$f":"INDIRECT(CONCATENATE(\"PLL_\",Devices!$C$4,\"!\",Devices!$C$10,Devices!$D$10+5))","v":"FMPLL.SYNCR.R = 0x15880000;\t\t/* Fsys =60Mhz */"},null,null,null,null,null,null,null,null,null,"","","",""," ","","",""," ","",""]
[null,{"$f":"INDIRECT(CONCATENATE(\"PLL_\",Devices!$C$4,\"!\",Devices!$C$10,Devices!$D$10+6))","v":"}"},null,null,null,null,null,null,null,null,null,"","","",""," ","","",""," ","",""]
[null,{"$f":"INDIRECT(CONCATENATE(\"PLL_\",Devices!$C$4,\"!\",Devices!$C$10,Devices!$D$10+7))","v":""},null,null,null,null,null,null,null,null,null,"","","",""," ","","",""," ","",""]
[null,{"$f":"INDIRECT(CONCATENATE(\"PLL_\",Devices!$C$4,\"!\",Devices!$C$10,Devices!$D$10+8))","v":""},null,null,null,null,null,null,null,null,null,"","","",""," ","","",""," ","",""]
[null,{"$f":"INDIRECT(CONCATENATE(\"PLL_\",Devices!$C$4,\"!\",Devices!$C$10,Devices!$D$10+9))","v":""},null,null,null,null,null,null,null,null,null,"","","",""," ","","",""," ","",""]
[null,{"$f":"INDIRECT(CONCATENATE(\"PLL_\",Devices!$C$4,\"!\",Devices!$C$10,Devices!$D$10+10))","v":""},null,null,null,null,null,null,null,null,null,"","","",""," ","","",""," ","",""]
[null,{"$f":"INDIRECT(CONCATENATE(\"PLL_\",Devices!$C$4,\"!\",Devices!$C$10,Devices!$D$10+11))","v":""},null,null,null,null,null,null,null,null,null,"","","",""," ","","",""," ","",""]
[null,{"$f":"INDIRECT(CONCATENATE(\"PLL_\",Devices!$C$4,\"!\",Devices!$C$10,Devices!$D$10+12))","v":""},null,null,null,null,null,null,null,null,null,"","","",""," ","","",""," ","",""]
[null,{"$f":"INDIRECT(CONCATENATE(\"PLL_\",Devices!$C$4,\"!\",Devices!$C$10,Devices!$D$10+13))","v":""},null,null,null,null,null,null,null,null,null,"","","",""," ","","",""," ","",""]
[null,{"$f":"INDIRECT(CONCATENATE(\"PLL_\",Devices!$C$4,\"!\",Devices!$C$10,Devices!$D$10+14))","v":""},null,null,null,null,null,null,null,null,null,"","","",""," ","","",""," ","",""]
[null,{"$f":"INDIRECT(CONCATENATE(\"PLL_\",Devices!$C$4,\"!\",Devices!$C$10,Devices!$D$10+15))","v":""},null,null,null,null,null,null,null,null,null,"","","",""," ","","",""," ","",""]
[null,{"$f":"INDIRECT(CONCATENATE(\"PLL_\",Devices!$C$4,\"!\",Devices!$C$10,Devices!$D$10+16))","v":""},null,null,null,null,null,null,null,null,null,"","","",""," ","","",""," ","",""]
[null,{"$f":"INDIRECT(CONCATENATE(\"PLL_\",Devices!$C$4,\"!\",Devices!$C$10,Devices!$D$10+17))","v":""}]
[null,{"$f":"INDIRECT(CONCATENATE(\"PLL_\",Devices!$C$4,\"!\",Devices!$C$10,Devices!$D$10+18))","v":""}]
[null,{"$f":"INDIRECT(CONCATENATE(\"PLL_\",Devices!$C$4,\"!\",Devices!$C$10,Devices!$D$10+19))","v":""}]
[null,{"$f":"INDIRECT(CONCATENATE(\"PLL_\",Devices!$C$4,\"!\",Devices!$C$10,Devices!$D$10+20))","v":""}]

{"sheet":"Devices","index":2,"n_rows":44,"n_cols":18,"rows_kept":44,"cut":false,"hidden":false,"merged":[[8,1,9,1]]}
[null,"Device index",{"$f":"MATCH(C2,Device_list,0)","v":9}]
[null,"selected MCU",{"$f":"PLL!C3","v":"MPC5634M"},null,null,null,"f_osc/xtal",null,"f_pll_in",null,"f_VCO/ICO"]
[null,"syst_freq",{"$f":"INDEX($E$14:$H$63,$C$1,1)","v":80},{"$f":"INDEX($E$14:$H$44,$C$1,2)","v":60},{"$f":"INDEX($E$14:$H$44,$C$1,3)","v":40},{"$f":"INDEX($E$14:$H$44,$C$1,4)","v":" "},"min",null,"min","max","min","max",null,"Mode: 1=Legacy 2=Enhanced/Legacy 3=JDP 4=Enhance"]
[null,"PLL type",{"$f":"INDEX(I14:I63,C1,1)","v":2},null,null,null,{"$f":"INDEX(L14:L63,$C$1,1)","v":4},20,4,16,256,512]
[null,"Legacy/enhance PLL",{"$f":"IF(C4=2,1,0)","v":1}]
[]
[null,"fsyst_max",{"$f":"INDEX($J$14:$J$63,$C$1,1)","v":80}]
[]
[null,"code variant","col","row"]
[null,null,{"$f":"INDIRECT(\"PLL_\"&C4&\"!L4\")","v":"B"},{"$f":"INDIRECT(\"PLL_\"&C4&\"!m4\")","v":202}]
[]
[null,null,null,null,null,null,null,null,null,null,null,"f_osc/xtal",null,"f_pll_in",null,"f_VCO/ICO",null,"code variant"]
[null,"index","Device list:",null,"freq #1","freq #2","freq #3","freq #4","Mode","fsys_max","fsys_min","min","max","min","max","min","max"]
[null,1,"MPC551x",null,80,66," "," ",4,80,null,4,40,4,10,192,500,"r"]
[null,2,"MPC553x",null,80,66,40," ",1,80,null,8,20,4,20,48,80]
[null,3,"MPC5553",null,132,112,80," ",1,132,null,8,20,4,20,48,132]
[null,4,"MPC5554",null,132,112,80," ",1,132,null,8,20,4,20,48,132]
[null,5,"MPC5561",null,132,112,80," ",1,132,null,8,40,4,20,48,132]
[null,6,"MPC5565",null,132,112,80," ",1,132,null,8,20,4,20,48,132]
[null,7,"MPC5566",null,144,132,112,80,1,144,null,8,20,4,20,48,144]
[null,8,"MPC5567",null,132,112,80," ",1,132,null,8,40,4,20,48,132]
[null,9,"MPC5634M",null,80,60,40," ",2,80,16,4,20,4,16,256,512]
[null,10,"MPC5644A",null,150,132,120," ",2,150,16,4,40,4,16,256,512]
[null,11,"MPC5674F",null,264,200,150," ",4,264,null,8,40,4,10,192,600,"b"]
[null,12,"MPC5676R",null,180," "," "," ",4,180,3,8,40,4,10,192,600,"j"]
[null,13,"MPC5604B/C",null,64," "," "," ",3,64,null,4,16,4,16,256,512,"b"]
[null,14,"MPC5607B",null,64," "," "," ",3,64,null,4,16,4,16,256,512,"b"]
[null,15,"MPC5602D",null,48," "," "," ",3,48,null,4,16,4,16,256,512,"b"]
[null,16,"MPC5646BC",null,120,60," "," ",3,120,null,4,40,4,16,256,512,"b"]
[null,17,"MPC5604P",null,64,40," "," ",3,64,null,4,40,4,16,256,512,"b"]
[null,18,"MPC5606P/T",null,120,60," "," ",3,120,null,4,40,4,16,256,512,"b"]
[null,19,"MPC5602P",null,64,40," "," ",3,64,null,4,40,4,16,256,512,"b"]
[null,20,"MPC5604E",null,64," "," "," ",3,64,null,4,40,4,16,256,512,"b"]
[null,21,"MPC5643L",null,120,80," "," ",3,120,null,4,40,4,16,256,512,"j"]
[null,22,"MPC5675K",null,180,150," "," ",3,180,null,4,40,4,16,256,512,"y"]
[null,23,"MPC5606S",null,64," "," "," ",3,64,null,4,16,4,16,256,512,"b"]
[null,24,"MPC5645S",null,125,64," "," ",3,125,null,4,16,4,16,256,512,"r"]
[null,25,"MPC5668G/E",null,116," "," "," ",4,116,null,4,40,4,10,192,600,"r"]
[null,26,"PXR40",null,264,200,150," ",4,264,null,8,40,4,10,192,600,"b"]
[null,27,"PXS30",null,180,150," "," ",3,180,null,4,40,4,16,256,512,"y"]
[null,28,"PXS20",null,120,80," "," ",3,120,null,4,40,4,16,256,512,"j"]
[null,29,"PXN20",null,116," "," "," ",4,116,null,4,40,4,10,192,600,"r"]
[null,30,"PXD20",null,125,64," "," ",3,125,null,4,16,4,16,256,512,"r"]
[null,31,"PXD10",null,64," "," "," ",3,64,null,4,16,4,16,256,512,"b"]

{"sheet":"PLL_1","index":3,"n_rows":120,"n_cols":43,"rows_kept":120,"cut":false,"hidden":true,"merged":[[121,1,121,8],[1,11,1,12],[2,21,3,21],[3,16,3,17],[1,4,1,5],[1,6,1,7],[1,8,1,9],[2,14,3,15],[2,16,2,17],[2,19,3,20]]}
[]
[null,"Fin",{"$f":"PLL!C5","v":16},null,"f_osc/xtal",null,"f_pll_in",null,"f_VCO/ICO",null,null,"code variant"]
[null,"Fsys",{"$f":"PLL!C6","v":60},null,"min","max","min","max","min","max",null,"col","row",null,"fsys = fin *",null,"MFD + 4",null,null,"fico = fsys *",null,"2^RFD"]
[null,"Fmax",{"$f":"Devices!C7","v":80},null,{"$f":"Devices!G4","v":4},{"$f":"Devices!H4","v":20},{"$f":"Devices!I4","v":4},{"$f":"Devices!J4","v":16},{"$f":"Devices!K4","v":256},{"$f":"Devices!L4","v":512},null,{"$f":"IF(C91=0,\"B\",\"J\")","v":"B"},100,null,null,null,"(PREDIV+1) * 2^RFD"]
[]
[" ","MFD","PREDIV","RFD"," ","fPLLin","fICO","fsys"," ","SYNCR",{"$f":"\"\"","v":""}]
[{"$f":"IF(ISNUMBER(B7),1,\"\")","v":1},{"$f":"IF(ISNUMBER(C72),C72,\"\")","v":26},{"$f":"IF(ISNUMBER(C72),D72,\"\")","v":0},{"$f":"IF(ISNUMBER(C72),E72,\"\")","v":3}," ",{"$f":"IF(ISNUMBER(B7),$C$2/(C7+1),\"\")","v":16},{"$f":"IF(ISNUMBER(B7),$C$2/(C7+1)*(B7+4),\"\")","v":480},{"$f":"IF(ISNUMBER(B7),$C$2/(C7+1)*(B7+4)/2^(D7),\"\")","v":60}," ",{"$f":"IF(ISNUMBER(B7),\"0x\"&DEC2HEX(C7*2^28+D7*2^19+B7*2^23,8),\"\")","v":"0x0D180000"},{"$f":"\"\"","v":""}]
[{"$f":"IF(ISNUMBER(B8),A7+1,\"\")","v":""},{"$f":"IF(ISNUMBER(C73),C73,\"\")","v":""},{"$f":"IF(ISNUMBER(C73),D73,\"\")","v":""},{"$f":"IF(ISNUMBER(C73),E73,\"\")","v":""}," ",{"$f":"IF(ISNUMBER(B8),$C$2/(C8+1),\"\")","v":""},{"$f":"IF(ISNUMBER(B8),$C$2/(C8+1)*(B8+4),\"\")","v":""},{"$f":"IF(ISNUMBER(B8),$C$2/(C8+1)*(B8+4)/2^(D8),\"\")","v":""}," ",{"$f":"IF(ISNUMBER(B8),\"0x\"&DEC2HEX(C8*2^28+D8*2^19+B8*2^23,8),\"\")","v":""},{"$f":"\"\"","v":""}]
[{"$f":"IF(ISNUMBER(B9),A8+1,\"\")","v":""},{"$f":"IF(ISNUMBER(C74),C74,\"\")","v":""},{"$f":"IF(ISNUMBER(C74),D74,\"\")","v":""},{"$f":"IF(ISNUMBER(C74),E74,\"\")","v":""}," ",{"$f":"IF(ISNUMBER(B9),$C$2/(C9+1),\"\")","v":""},{"$f":"IF(ISNUMBER(B9),$C$2/(C9+1)*(B9+4),\"\")","v":""},{"$f":"IF(ISNUMBER(B9),$C$2/(C9+1)*(B9+4)/2^(D9),\"\")","v":""}," ",{"$f":"IF(ISNUMBER(B9),\"0x\"&DEC2HEX(C9*2^28+D9*2^19+B9*2^23,8),\"\")","v":""},{"$f":"\"\"","v":""}]
["","","",""," ","","",""," ","",{"$f":"\"\"","v":""}]
["","","",""," ","","",""," ","",{"$f":"\"\"","v":""}]
["","","",""," ","","",""," ","",{"$f":"\"\"","v":""}]
["","","",""," ","","",""," ","",{"$f":"\"\"","v":""}]
["","","",""," ","","",""," ","",{"$f":"\"\"","v":""}]
["","","",""," ","","",""," ","",{"$f":"\"\"","v":""}]
["","","",""," ","","",""," ","",{"$f":"\"\"","v":""}]
["","","",""," ","","",""," ","",{"$f":"\"\"","v":""}]
["","","",""," ","","",""," ","",{"$f":"\"\"","v":""}]
["","","",""," ","","",""," ","",{"$f":"\"\"","v":""}]
["","","",""," ","","",""," ","",{"$f":"\"\"","v":""}]
["","","",""," ","","",""," ","",{"$f":"\"\"","v":""}]
["","","",""," ","","",""," ","",{"$f":"\"\"","v":""}]
["","","",""," ","","",""," ","",{"$f":"\"\"","v":""}]
["","","",""," ","","",""," ","",{"$f":"\"\"","v":""}]
["","","",""," ","","",""," ","",{"$f":"\"\"","v":""}]
[]
[]
[]
[]
[null,"PREDIF",0,0,0,0,0,0,0,0,1,1,1,1,1,1,1,1,2,2,2,2,2,2,2,2,3,3,3,3,3,3,3,3,4,4,4,4,4,4,4,4]
[null,"RFD",0,1,2,3,4,5,6,7,0,1,2,3,4,5,6,7,0,1,2,3,4,5,6,7,0,1,2,3,4,5,6,7,0,1,2,3,4,5,6,7]
["MFD",0,{"$f":"IF(AND(($C$2/(C$30+1))>=$G$4,($C$2/(C$30+1))<=$H$4,($C$2/(C$30+1)*($B32+4))>=$I$4,($C$2/(C$30+1)*($B32+4))<=$J$4,($C$2/(C$30+1)*($B32+4)/2^(C$31))=$C$3),-1,0)","v":0},{"$f":"IF(AND(($C$2/(D$30+1))>=$G$4,($C$2/(D$30+1))<=$H$4,($C$2/(D$30+1)*($B32+4))>=$I$4,($C$2/(D$30+1)*($B32+4))<=$J$4,($C$2/(D$30+1)*($B32+4)/2^(D$31))=$C$3),-1,0)","v":0},0,0,0,0,0,0,0,0,0,0,0,0,0,0,0,0,0,0,0,0,0,0,0,0,0,0,0,0,0,0,0,0,0,0,0,0,0,0,0]
[null,1,{"$f":"IF(AND(($C$2/(C$30+1))>=$G$4,($C$2/(C$30+1))<=$H$4,($C$2/(C$30+1)*($B33+4))>=$I$4,($C$2/(C$30+1)*($B33+4))<=$J$4,($C$2/(C$30+1)*($B33+4)/2^(C$31))=$C$3),-1,0)","v":0},0,0,0,0,0,0,0,0,0,0,0,0,0,0,0,0,0,0,0,0,0,0,0,0,0,0,0,0,0,0,0,0,0,0,0,0,0,0,0,1]
[null,2,0,0,0,0,0,0,0,0,0,0,0,0,0,0,0,0,0,0,0,0,0,0,0,0,0,0,0,0,0,0,0,0,0,0,0,0,0,0,0,0,2]
[null,3,0,0,0,0,0,0,0,0,0,0,0,0,0,0,0,0,0,0,0,0,0,0,0,0,0,0,0,0,0,0,0,0,0,0,0,0,0,0,0,0,3]
[null,4,0,0,0,0,0,0,0,0,0,0,0,0,0,0,0,0,0,0,0,0,0,0,0,0,0,0,0,0,0,0,0,0,0,0,0,0,0,0,0,0,4]
[null,5,0,0,0,0,0,0,0,0,0,0,0,0,0,0,0,0,0,0,0,0,0,0,0,0,0,0,0,0,0,0,0,0,0,0,0,0,0,0,0,0,5]
[null,6,0,0,0,0,0,0,0,0,0,0,0,0,0,0,0,0,0,0,0,0,0,0,{"$f":"IF(AND(($C$2/(Y$30+1))>=$G$4,($C$2/(Y$30+1))<=$H$4,($C$2/(Y$30+1)*($B38+4))>=$I$4,($C$2/(Y$30+1)*($B38+4))<=$J$4,($C$2/(Y$30+1)*($B38+4)/2^(Y$31))=$C$3),-1,0)","v":0},0,0,0,0,0,0,0,0,0,0,0,0,0,0,0,{"$f":"IF(AND(($C$2/(AO$30+1))>=$G$4,($C$2/(AO$30+1))<=$H$4,($C$2/(AO$30+1)*($B38+4))>=$I$4,($C$2/(AO$30+1)*($B38+4))<=$J$4,($C$2/(AO$30+1)*($B38+4)/2^(AO$31))=$C$3),-1,0)","v":0},0,6]
[null,7,0,0,0,0,0,0,0,0,0,0,0,0,0,0,0,0,{"$f":"IF(AND(($C$2/(S$30+1))>=$G$4,($C$2/(S$30+1))<=$H$4,($C$2/(S$30+1)*($B39+4))>=$I$4,($C$2/(S$30+1)*($B39+4))<=$J$4,($C$2/(S$30+1)*($B39+4)/2^(S$31))=$C$3),-1,0)","v":0},0,0,0,0,0,0,0,0,0,0,0,0,0,0,0,0,0,0,0,0,0,0,0,7]
[null,8,0,0,0,0,0,0,0,0,0,0,0,0,0,0,0,0,0,0,0,0,0,0,0,0,0,0,0,0,0,0,0,0,0,0,0,0,0,0,0,0,8]
[null,9,0,0,0,0,0,0,0,0,0,0,0,0,0,0,0,0,0,0,0,0,0,0,0,0,0,0,0,0,0,0,0,0,0,0,0,0,0,0,0,0,9]
[null,10,0,0,0,0,0,0,0,0,0,0,0,0,0,0,0,0,0,0,0,0,0,0,0,0,0,0,0,0,0,0,0,0,0,0,0,0,0,0,0,0,10]
[null,11,0,0,0,0,0,0,0,0,0,0,0,0,0,0,0,0,0,0,0,0,0,0,0,0,0,0,0,0,0,0,0,0,0,0,0,0,0,0,0,0,11]
[null,12,0,0,0,0,0,0,0,0,0,0,0,0,0,0,0,0,0,0,0,0,0,0,0,0,0,0,0,0,0,0,0,0,0,0,0,0,0,0,0,0,12]
[null,13,0,0,0,0,0,0,0,0,0,0,0,0,0,0,0,0,0,0,0,0,0,0,0,0,0,0,0,0,0,0,0,0,0,0,0,0,0,0,0,0,13]
[null,14,0,0,0,0,0,0,0,0,0,0,0,0,0,0,0,0,0,0,0,0,0,0,0,0,0,0,0,0,0,0,0,0,0,0,0,0,0,0,0,0,14]
[null,15,0,0,0,0,0,0,0,0,0,0,0,0,0,0,0,0,0,0,0,0,0,0,0,0,0,0,0,0,0,0,0,0,0,0,0,0,0,0,0,0,15]
[null,16,0,0,0,0,0,0,0,0,0,0,0,0,0,0,0,0,0,0,0,0,0,0,0,0,0,0,0,0,0,0,0,0,0,0,0,0,0,0,0,0,16]
[null,17,0,0,0,0,0,0,0,0,0,0,0,0,0,0,0,0,0,0,0,0,0,0,0,0,0,0,0,0,0,0,0,0,0,0,0,0,0,0,0,0,17]
[null,18,0,0,0,0,0,0,0,0,0,0,0,0,0,0,0,0,0,0,0,0,0,0,0,0,0,0,0,0,0,0,0,0,0,0,0,0,0,0,0,0,18]
[null,19,0,0,0,0,0,0,0,0,0,0,0,0,0,0,0,0,0,0,0,0,0,0,0,0,0,0,0,0,0,0,0,0,0,0,0,0,0,0,0,0,19]
[null,20,0,0,0,0,0,0,0,0,0,0,0,0,0,0,0,0,0,0,0,0,0,0,0,0,0,0,0,0,0,0,0,0,0,0,0,0,0,0,0,0,20]
[null,21,0,0,0,0,0,0,0,0,0,0,0,0,0,0,0,0,0,0,0,0,0,0,0,0,0,0,0,0,0,0,0,0,0,0,0,0,0,0,0,0,21]
[null,22,0,0,0,0,0,0,0,0,0,{"$f":"IF(AND(($C$2/(L$30+1))>=$G$4,($C$2/(L$30+1))<=$H$4,($C$2/(L$30+1)*($B54+4))>=$I$4,($C$2/(L$30+1)*($B54+4))<=$J$4,($C$2/(L$30+1)*($B54+4)/2^(L$31))=$C$3),-1,0)","v":0},0,0,0,0,0,0,0,0,0,0,0,0,0,0,0,0,0,0,0,0,0,0,0,0,0,0,0,0,0,0,22]
[null,23,{"$f":"IF(AND(($C$2/(C$30+1))>=$G$4,($C$2/(C$30+1))<=$H$4,($C$2/(C$30+1)*($B55+4))>=$I$4,($C$2/(C$30+1)*($B55+4))<=$J$4,($C$2/(C$30+1)*($B55+4)/2^(C$31))=$C$3),-1,0)","v":0},0,0,0,0,0,0,0,0,0,0,0,0,0,0,0,0,0,0,0,0,0,0,0,0,0,0,0,0,0,0,0,0,0,0,0,0,0,0,0,23]
[null,24,0,0,0,0,0,0,0,0,0,0,0,0,0,0,0,0,0,0,0,0,0,0,0,0,0,0,{"$f":"IF(AND(($C$2/(AC$30+1))>=$G$4,($C$2/(AC$30+1))<=$H$4,($C$2/(AC$30+1)*($B56+4))>=$I$4,($C$2/(AC$30+1)*($B56+4))<=$J$4,($C$2/(AC$30+1)*($B56+4)/2^(AC$31))=$C$3),-1,0)","v":0},0,0,0,0,0,0,0,0,0,0,0,0,0,24]
[null,25,0,0,0,0,0,0,0,0,0,0,0,0,0,0,0,0,0,0,0,0,0,0,0,0,0,{"$f":"IF(AND(($C$2/(AB$30+1))>=$G$4,($C$2/(AB$30+1))<=$H$4,($C$2/(AB$30+1)*($B57+4))>=$I$4,($C$2/(AB$30+1)*($B57+4))<=$J$4,($C$2/(AB$30+1)*($B57+4)/2^(AB$31))=$C$3),-1,0)","v":0},0,0,0,0,0,0,0,0,0,0,0,0,0,0,25]
[null,26,0,0,0,-1,0,0,0,0,0,0,0,0,0,0,0,0,0,0,0,0,0,0,0,0,0,0,0,0,0,0,0,0,0,0,0,0,0,0,0,0,26]
[null,27,0,0,0,0,0,0,0,0,0,0,0,0,0,0,0,0,0,0,0,0,0,0,0,0,0,0,0,0,0,0,0,0,0,0,0,0,0,0,0,0,27]
[null,28,0,0,0,0,0,0,0,0,0,0,0,0,0,0,0,0,0,0,0,0,0,0,0,0,0,0,0,0,0,0,0,0,0,0,0,0,0,0,0,0,28]
[null,29,0,0,0,0,0,0,0,0,0,0,0,0,0,0,0,0,0,0,0,0,0,0,0,0,0,0,0,0,0,0,0,0,0,0,0,0,0,0,0,0,29]
[null,30,0,0,0,0,0,0,0,0,0,0,0,0,0,0,0,0,0,0,0,0,0,0,0,0,0,0,0,0,0,0,0,0,0,0,0,0,0,0,0,0,30]
[null,31,0,0,0,0,0,0,0,0,0,0,0,0,0,0,0,0,0,0,0,0,0,0,0,0,0,0,0,0,0,0,0,0,0,0,0,0,0,0,0,0,31]
[null,"PREDIF",0,0,0,0,0,0,0,0,1,1,1,1,1,1,1,1,2,2,2,2,2,2,2,2,3,3,3,3,3,3,3,3,4,4,4,4,4,4,4,4]
[null,"RFD",0,1,2,3,4,5,6,7,0,1,2,3,4,5,6,7,0,1,2,3,4,5,6,7,0,1,2,3,4,5,6,7,0,1,2,3,4,5,6,7]
[]
[null,null,{"$f":"IF(ISNUMBER(VLOOKUP(-1,C32:$AQ$63,44-COLUMN(),0)),VLOOKUP(-1,C32:$AQ$63,44-COLUMN(),0),\"-\")","v":"-"},{"$f":"IF(ISNUMBER(VLOOKUP(-1,D32:$AQ$63,44-COLUMN(),0)),VLOOKUP(-1,D32:$AQ$63,44-COLUMN(),0),\"-\")","v":"-"},{"$f":"IF(ISNUMBER(VLOOKUP(-1,E32:$AQ$63,44-COLUMN(),0)),VLOOKUP(-1,E32:$AQ$63,44-COLUMN(),0),\"-\")","v":"-"},{"$f":"IF(ISNUMBER(VLOOKUP(-1,F32:$AQ$63,44-COLUMN(),0)),VLOOKUP(-1,F32:$AQ$63,44-COLUMN(),0),\"-\")","v":26},{"$f":"IF(ISNUMBER(VLOOKUP(-1,G32:$AQ$63,44-COLUMN(),0)),VLOOKUP(-1,G32:$AQ$63,44-COLUMN(),0),\"-\")","v":"-"},{"$f":"IF(ISNUMBER(VLOOKUP(-1,H32:$AQ$63,44-COLUMN(),0)),VLOOKUP(-1,H32:$AQ$63,44-COLUMN(),0),\"-\")","v":"-"},{"$f":"IF(ISNUMBER(VLOOKUP(-1,I32:$AQ$63,44-COLUMN(),0)),VLOOKUP(-1,I32:$AQ$63,44-COLUMN(),0),\"-\")","v":"-"},{"$f":"IF(ISNUMBER(VLOOKUP(-1,J32:$AQ$63,44-COLUMN(),0)),VLOOKUP(-1,J32:$AQ$63,44-COLUMN(),0),\"-\")","v":"-"},{"$f":"IF(ISNUMBER(VLOOKUP(-1,K32:$AQ$63,44-COLUMN(),0)),VLOOKUP(-1,K32:$AQ$63,44-COLUMN(),0),\"-\")","v":"-"},{"$f":"IF(ISNUMBER(VLOOKUP(-1,L32:$AQ$63,44-COLUMN(),0)),VLOOKUP(-1,L32:$AQ$63,44-COLUMN(),0),\"-\")","v":"-"},{"$f":"IF(ISNUMBER(VLOOKUP(-1,M32:$AQ$63,44-COLUMN(),0)),VLOOKUP(-1,M32:$AQ$63,44-COLUMN(),0),\"-\")","v":"-"},{"$f":"IF(ISNUMBER(VLOOKUP(-1,N32:$AQ$63,44-COLUMN(),0)),VLOOKUP(-1,N32:$AQ$63,44-COLUMN(),0),\"-\")","v":"-"},{"$f":"IF(ISNUMBER(VLOOKUP(-1,O32:$AQ$63,44-COLUMN(),0)),VLOOKUP(-1,O32:$AQ$63,44-COLUMN(),0),\"-\")","v":"-"},{"$f":"IF(ISNUMBER(VLOOKUP(-1,P32:$AQ$63,44-COLUMN(),0)),VLOOKUP(-1,P32:$AQ$63,44-COLUMN(),0),\"-\")","v":"-"},{"$f":"IF(ISNUMBER(VLOOKUP(-1,Q32:$AQ$63,44-COLUMN(),0)),VLOOKUP(-1,Q32:$AQ$63,44-COLUMN(),0),\"-\")","v":"-"},{"$f":"IF(ISNUMBER(VLOOKUP(-1,R32:$AQ$63,44-COLUMN(),0)),VLOOKUP(-1,R32:$AQ$63,44-COLUMN(),0),\"-\")","v":"-"},{"$f":"IF(ISNUMBER(VLOOKUP(-1,S32:$AQ$63,44-COLUMN(),0)),VLOOKUP(-1,S32:$AQ$63,44-COLUMN(),0),\"-\")","v":"-"},{"$f":"IF(ISNUMBER(VLOOKUP(-1,T32:$AQ$63,44-COLUMN(),0)),VLOOKUP(-1,T32:$AQ$63,44-COLUMN(),0),\"-\")","v":"-"},{"$f":"IF(ISNUMBER(VLOOKUP(-1,U32:$AQ$63,44-COLUMN(),0)),VLOOKUP(-1,U32:$AQ$63,44-COLUMN(),0),\"-\")","v":"-"},{"$f":"IF(ISNUMBER(VLOOKUP(-1,V32:$AQ$63,44-COLUMN(),0)),VLOOKUP(-1,V32:$AQ$63,44-COLUMN(),0),\"-\")","v":"-"},{"$f":"IF(ISNUMBER(VLOOKUP(-1,W32:$AQ$63,44-COLUMN(),0)),VLOOKUP(-1,W32:$AQ$63,44-COLUMN(),0),\"-\")","v":"-"},{"$f":"IF(ISNUMBER(VLOOKUP(-1,X32:$AQ$63,44-COLUMN(),0)),VLOOKUP(-1,X32:$AQ$63,44-COLUMN(),0),\"-\")","v":"-"},{"$f":"IF(ISNUMBER(VLOOKUP(-1,Y32:$AQ$63,44-COLUMN(),0)),VLOOKUP(-1,Y32:$AQ$63,44-COLUMN(),0),\"-\")","v":"-"},{"$f":"IF(ISNUMBER(VLOOKUP(-1,Z32:$AQ$63,44-COLUMN(),0)),VLOOKUP(-1,Z32:$AQ$63,44-COLUMN(),0),\"-\")","v":"-"},{"$f":"IF(ISNUMBER(VLOOKUP(-1,AA32:$AQ$63,44-COLUMN(),0)),VLOOKUP(-1,AA32:$AQ$63,44-COLUMN(),0),\"-\")","v":"-"},{"$f":"IF(ISNUMBER(VLOOKUP(-1,AB32:$AQ$63,44-COLUMN(),0)),VLOOKUP(-1,AB32:$AQ$63,44-COLUMN(),0),\"-\")","v":"-"},{"$f":"IF(ISNUMBER(VLOOKUP(-1,AC32:$AQ$63,44-COLUMN(),0)),VLOOKUP(-1,AC32:$AQ$63,44-COLUMN(),0),\"-\")","v":"-"},{"$f":"IF(ISNUMBER(VLOOKUP(-1,AD32:$AQ$63,44-COLUMN(),0)),VLOOKUP(-1,AD32:$AQ$63,44-COLUMN(),0),\"-\")","v":"-"},{"$f":"IF(ISNUMBER(VLOOKUP(-1,AE32:$AQ$63,44-COLUMN(),0)),VLOOKUP(-1,AE32:$AQ$63,44-COLUMN(),0),\"-\")","v":"-"},{"$f":"IF(ISNUMBER(VLOOKUP(-1,AF32:$AQ$63,44-COLUMN(),0)),VLOOKUP(-1,AF32:$AQ$63,44-COLUMN(),0),\"-\")","v":"-"},{"$f":"IF(ISNUMBER(VLOOKUP(-1,AG32:$AQ$63,44-COLUMN(),0)),VLOOKUP(-1,AG32:$AQ$63,44-COLUMN(),0),\"-\")","v":"-"},{"$f":"IF(ISNUMBER(VLOOKUP(-1,AH32:$AQ$63,44-COLUMN(),0)),VLOOKUP(-1,AH32:$AQ$63,44-COLUMN(),0),\"-\")","v":"-"},{"$f":"IF(ISNUMBER(VLOOKUP(-1,AI32:$AQ$63,44-COLUMN(),0)),VLOOKUP(-1,AI32:$AQ$63,44-COLUMN(),0),\"-\")","v":"-"},{"$f":"IF(ISNUMBER(VLOOKUP(-1,AJ32:$AQ$63,44-COLUMN(),0)),VLOOKUP(-1,AJ32:$AQ$63,44-COLUMN(),0),\"-\")","v":"-"},{"$f":"IF(ISNUMBER(VLOOKUP(-1,AK32:$AQ$63,44-COLUMN(),0)),VLOOKUP(-1,AK32:$AQ$63,44-COLUMN(),0),\"-\")","v":"-"},{"$f":"IF(ISNUMBER(VLOOKUP(-1,AL32:$AQ$63,44-COLUMN(),0)),VLOOKUP(-1,AL32:$AQ$63,44-COLUMN(),0),\"-\")","v":"-"},{"$f":"IF(ISNUMBER(VLOOKUP(-1,AM32:$AQ$63,44-COLUMN(),0)),VLOOKUP(-1,AM32:$AQ$63,44-COLUMN(),0),\"-\")","v":"-"},{"$f":"IF(ISNUMBER(VLOOKUP(-1,AN32:$AQ$63,44-COLUMN(),0)),VLOOKUP(-1,AN32:$AQ$63,44-COLUMN(),0),\"-\")","v":"-"},{"$f":"IF(ISNUMBER(VLOOKUP(-1,AO32:$AQ$63,44-COLUMN(),0)),VLOOKUP(-1,AO32:$AQ$63,44-COLUMN(),0),\"-\")","v":"-"},{"$f":"IF(ISNUMBER(VLOOKUP(-1,AP32:$AQ$63,44-COLUMN(),0)),VLOOKUP(-1,AP32:$AQ$63,44-COLUMN(),0),\"-\")","v":"-"}]
[null,null,{"$f":"IF(ISNUMBER(C67),C64,\"-\")","v":"-"},"-","-",0,"-","-","-","-","-","-","-","-","-","-","-","-","-","-","-","-","-","-","-","-","-","-","-","-","-","-","-","-","-","-","-","-","-","-","-","-"]
[null,null,{"$f":"IF(ISNUMBER(C67),C65,\"-\")","v":"-"},"-","-",3,"-","-","-","-","-","-","-","-","-","-","-","-","-","-","-","-","-","-","-","-","-","-","-","-","-","-","-","-","-","-","-","-","-","-","-","-"]
[]
[null,null,"MFD","PREDIF","RFD"]
[{"$f":"IF(C72=C71,A71+MATCH(C72,INDEX($C$67:$AP$67,1,A71+1):$AP$67,0),MATCH(C72,$C$67:$AP$67,0))","v":4},null,{"$f":"SMALL(IF(ISNUMBER($C$67:$AP$67),$C$67:$AP$67,\"\"),ROWS($C$72:C72))","v":26},{"$f":"INDEX($C$68:$AP$68,1,A72)","v":0},{"$f":"INDEX($C$69:$AP$69,1,A72)","v":3}]
[{"$f":"IF(C73=C72,A72+MATCH(C73,INDEX($C$67:$AP$67,1,A72+1):$AP$67,0),MATCH(C73,$C$67:$AP$67,0))","v":{"$error":"#NUM!"}},null,{"$f":"SMALL(IF(ISNUMBER($C$67:$AP$67),$C$67:$AP$67,\"\"),ROWS($C$72:C73))","v":{"$error":"#NUM!"}},{"$f":"INDEX($C$68:$AP$68,1,A73)","v":{"$error":"#NUM!"}},{"$f":"INDEX($C$69:$AP$69,1,A73)","v":{"$error":"#NUM!"}}]
[{"$f":"IF(C74=C73,A73+MATCH(C74,INDEX($C$67:$AP$67,1,A73+1):$AP$67,0),MATCH(C74,$C$67:$AP$67,0))","v":{"$error":"#NUM!"}},null,{"$f":"SMALL(IF(ISNUMBER($C$67:$AP$67),$C$67:$AP$67,\"\"),ROWS($C$72:C74))","v":{"$error":"#NUM!"}},{"$error":"#NUM!"},{"$error":"#NUM!"}]
[{"$f":"IF(C75=C74,A74+MATCH(C75,INDEX($C$67:$AP$67,1,A74+1):$AP$67,0),MATCH(C75,$C$67:$AP$67,0))","v":{"$error":"#NUM!"}},null,{"$f":"SMALL(IF(ISNUMBER($C$67:$AP$67),$C$67:$AP$67,\"\"),ROWS($C$72:C75))","v":{"$error":"#NUM!"}},{"$error":"#NUM!"},{"$error":"#NUM!"}]
[{"$f":"IF(C76=C75,A75+MATCH(C76,INDEX($C$67:$AP$67,1,A75+1):$AP$67,0),MATCH(C76,$C$67:$AP$67,0))","v":{"$error":"#NUM!"}},null,{"$f":"SMALL(IF(ISNUMBER($C$67:$AP$67),$C$67:$AP$67,\"\"),ROWS($C$72:C76))","v":{"$error":"#NUM!"}},{"$error":"#NUM!"},{"$error":"#NUM!"}]
[{"$f":"IF(C77=C76,A76+MATCH(C77,INDEX($C$67:$AP$67,1,A76+1):$AP$67,0),MATCH(C77,$C$67:$AP$67,0))","v":{"$error":"#NUM!"}},null,{"$f":"SMALL(IF(ISNUMBER($C$67:$AP$67),$C$67:$AP$67,\"\"),ROWS($C$72:C77))","v":{"$error":"#NUM!"}},{"$error":"#NUM!"},{"$error":"#NUM!"}]
[{"$f":"IF(C78=C77,A77+MATCH(C78,INDEX($C$67:$AP$67,1,A77+1):$AP$67,0),MATCH(C78,$C$67:$AP$67,0))","v":{"$error":"#NUM!"}},null,{"$f":"SMALL(IF(ISNUMBER($C$67:$AP$67),$C$67:$AP$67,\"\"),ROWS($C$72:C78))","v":{"$error":"#NUM!"}},{"$error":"#NUM!"},{"$error":"#NUM!"}]
[{"$f":"IF(C79=C78,A78+MATCH(C79,INDEX($C$67:$AP$67,1,A78+1):$AP$67,0),MATCH(C79,$C$67:$AP$67,0))","v":{"$error":"#NUM!"}},null,{"$f":"SMALL(IF(ISNUMBER($C$67:$AP$67),$C$67:$AP$67,\"\"),ROWS($C$72:C79))","v":{"$error":"#NUM!"}},{"$error":"#NUM!"},{"$error":"#NUM!"}]
[{"$f":"IF(C80=C79,A79+MATCH(C80,INDEX($C$67:$AP$67,1,A79+1):$AP$67,0),MATCH(C80,$C$67:$AP$67,0))","v":{"$error":"#NUM!"}},null,{"$f":"SMALL(IF(ISNUMBER($C$67:$AP$67),$C$67:$AP$67,\"\"),ROWS($C$72:C80))","v":{"$error":"#NUM!"}},{"$error":"#NUM!"},{"$error":"#NUM!"}]
[{"$f":"IF(C81=C80,A80+MATCH(C81,INDEX($C$67:$AP$67,1,A80+1):$AP$67,0),MATCH(C81,$C$67:$AP$67,0))","v":{"$error":"#NUM!"}},null,{"$f":"SMALL(IF(ISNUMBER($C$67:$AP$67),$C$67:$AP$67,\"\"),ROWS($C$72:C81))","v":{"$error":"#NUM!"}},{"$error":"#NUM!"},{"$error":"#NUM!"}]
[{"$f":"IF(C82=C81,A81+MATCH(C82,INDEX($C$67:$AP$67,1,A81+1):$AP$67,0),MATCH(C82,$C$67:$AP$67,0))","v":{"$error":"#NUM!"}},null,{"$f":"SMALL(IF(ISNUMBER($C$67:$AP$67),$C$67:$AP$67,\"\"),ROWS($C$72:C82))","v":{"$error":"#NUM!"}},{"$error":"#NUM!"},{"$error":"#NUM!"}]
[{"$f":"IF(C83=C82,A82+MATCH(C83,INDEX($C$67:$AP$67,1,A82+1):$AP$67,0),MATCH(C83,$C$67:$AP$67,0))","v":{"$error":"#NUM!"}},null,{"$f":"SMALL(IF(ISNUMBER($C$67:$AP$67),$C$67:$AP$67,\"\"),ROWS($C$72:C83))","v":{"$error":"#NUM!"}},{"$error":"#NUM!"},{"$error":"#NUM!"}]
[{"$f":"IF(C84=C83,A83+MATCH(C84,INDEX($C$67:$AP$67,1,A83+1):$AP$67,0),MATCH(C84,$C$67:$AP$67,0))","v":{"$error":"#NUM!"}},null,{"$f":"SMALL(IF(ISNUMBER($C$67:$AP$67),$C$67:$AP$67,\"\"),ROWS($C$72:C84))","v":{"$error":"#NUM!"}},{"$error":"#NUM!"},{"$error":"#NUM!"}]
[]
[]
[]
[null,"selected variant",null,{"$f":"PLL!C10","v":1}]
[]
[null,"MFD","PREDIV","RFD","fsys","SYNCR",null,null,null,"MFD","PREDIV","RFD","fICO","fsys","SYNCR"]
[null,{"$f":"INDEX(B7:B18,$D$88,1)","v":26},{"$f":"INDEX(C7:C18,$D$88,1)","v":0},{"$f":"LARGE(IF(ISNUMBER($H$91:$H$95),$H$91:$H$95,\"\"),ROWS($D$91:D91))","v":7},{"$f":"$C$2/(C91+1)*(B91+4)/2^(D91)","v":3.75},{"$f":"IF(ISNUMBER(B91),\"0x\"&DEC2HEX(C91*2^28+D91*2^19+B91*2^23,8),\"\")","v":"0x0D380000"},null,{"$f":"INDEX(D7:D18,$D$88,1)","v":3},null,2,0,2,{"$f":"$C$2/(K91+1)*(J91+4)","v":96},{"$f":"$C$2/(K91+1)*(J91+4)/2^(L91)","v":24},{"$f":"\"0x\"&DEC2HEX(K91*2^28+L91*2^19+J91*2^23,8)","v":"0x01100000"}]
[null,{"$f":"B91","v":26},{"$f":"C91","v":0},{"$f":"LARGE(IF(ISNUMBER($H$91:$H$95),$H$91:$H$95,\"\"),ROWS($D$91:D92))","v":6},{"$f":"$C$2/(C92+1)*(B92+4)/2^(D92)","v":7.5},{"$f":"IF(ISNUMBER(B92),\"0x\"&DEC2HEX(C92*2^28+D92*2^19+B92*2^23,8),\"\")","v":"0x0D300000"},null,{"$f":"IF((H91+1)<=7,H91+1,\"\")","v":4},null,{"$f":"J91","v":2},{"$f":"K91","v":0},4,96,6,"0x01200000"]
[null,{"$f":"B92","v":26},{"$f":"C92","v":0},{"$f":"LARGE(IF(ISNUMBER($H$91:$H$95),$H$91:$H$95,\"\"),ROWS($D$91:D93))","v":5},{"$f":"$C$2/(C93+1)*(B93+4)/2^(D93)","v":15},{"$f":"IF(ISNUMBER(B93),\"0x\"&DEC2HEX(C93*2^28+D93*2^19+B93*2^23,8),\"\")","v":"0x0D280000"},null,{"$f":"IF((H92+1)<=7,H92+1,\"\")","v":5},null,{"$f":"INDEX(B7:B18,$D$88,1)","v":26},{"$f":"INDEX(C7:C18,$D$88,1)","v":0},{"$f":"D91","v":7},480,3.75,"0x0D380000"]
[null,26,0,{"$f":"LARGE(IF(ISNUMBER($H$91:$H$95),$H$91:$H$95,\"\"),ROWS($D$91:D94))","v":4},30,"0x0D200000",null,6,null,{"$f":"$J$93","v":26},{"$f":"$K$93","v":0},{"$f":"D92","v":6},480,7.5,"0x0D300000"]
[null,26,0,{"$f":"LARGE(IF(ISNUMBER($H$91:$H$95),$H$91:$H$95,\"\"),ROWS($D$91:D95))","v":3},60,"0x0D180000",null,7,null,{"$f":"$J$93","v":26},{"$f":"$K$93","v":0},{"$f":"D93","v":5},480,15,"0x0D280000"]
[null,null,null,{"$f":"E","v":{"$error":"#NAME?"}},null,null,null,null,null,{"$f":"$J$93","v":26},{"$f":"$K$93","v":0},{"$f":"D94","v":4},480,30,"0x0D200000"]
[null,null,null,null,null,null,null,null,null,{"$f":"$J$93","v":26},{"$f":"$K$93","v":0},{"$f":"D95","v":3},480,60,"0x0D180000"]
[null,null,null,null,null,null,null,null,null,null,null,{"$f":"er","v":{"$error":"#NAME?"}}]
[]
[null,{"$f":"\"/* Set sysclk = \"&C3&\"MHz running from PLL with \"&C2&\" MHz crystal reference. */\"","v":"/* Set sysclk = 60MHz running from PLL with 16 MHz crystal reference. */"},null,null,null,null,null,null,null,{"$f":"\"/* Set sysclk = \"&C3&\"MHz running from PLL with \"&C2&\" MHz crystal reference. */\"","v":"/* Set sysclk = 60MHz running from PLL with 16 MHz crystal reference. */"}]
[null,{"$f":"\"void initSysclk (void) {\"","v":"void initSysclk (void) {"},null,null,null,null,null,null,null,{"$f":"\"void initSysclk (void) {\"","v":"void initSysclk (void) {"}]
[null,{"$f":"\"FMPLL.SYNCR.R = \"&F91&\";\"&CHAR(9)&CHAR(9)&\"/* Fsys =\"&E91&\"Mhz */\"","v":"FMPLL.SYNCR.R = 0x0D380000;\t\t/* Fsys =3.75Mhz */"},null,null,null,null,null,null,null,{"$f":"\"FMPLL.SYNCR.R = \"&O92&\";\"&CHAR(9)&CHAR(9)&\"/* Fsys =\"&N92&\"Mhz */\"","v":"FMPLL.SYNCR.R = 0x01200000;\t\t/* Fsys =6Mhz */"}]
[null,{"$f":"\"while (FMPLL.SYNSR.B.LOCK != 1) {};\"&CHAR(9)&CHAR(9)&\" /* Wait for FMPLL to LOCK  */\"","v":"while (FMPLL.SYNSR.B.LOCK != 1) {};\t\t /* Wait for FMPLL to LOCK  */"},null,null,null,null,null,null,null,{"$f":"\"FMPLL.SYNCR.R = \"&O93&\";\"&CHAR(9)&CHAR(9)&\"/* Fsys =\"&N93&\"Mhz */\"","v":"FMPLL.SYNCR.R = 0x0D380000;\t\t/* Fsys =3.75Mhz */"}]
[null,{"$f":"IF(ISNUMBER(D92),\"FMPLL.SYNCR.R = \"&F92&\";\"&CHAR(9)&CHAR(9)&\"/* Fsys =\"&E92&\"Mhz */\",IF(AND(ISNUMBER(D91),ISERR(D92)),\"}\",\"\"))","v":"FMPLL.SYNCR.R = 0x0D300000;\t\t/* Fsys =7.5Mhz */"},null,null,null,null,null,null,null,{"$f":"\"while (FMPLL.SYNSR.B.LOCK != 1) {};\"&CHAR(9)&CHAR(9)&\"/* Wait for FMPLL to LOCK  */\"","v":"while (FMPLL.SYNSR.B.LOCK != 1) {};\t\t/* Wait for FMPLL to LOCK  */"}]
[null,{"$f":"IF(ISNUMBER(D93),\"FMPLL.SYNCR.R = \"&F93&\";\"&CHAR(9)&CHAR(9)&\"/* Fsys =\"&E93&\"Mhz */\",IF(AND(ISNUMBER(D92),ISERR(D93)),\"}\",\"\"))","v":"FMPLL.SYNCR.R = 0x0D280000;\t\t/* Fsys =15Mhz */"},null,null,null,null,null,null,null,{"$f":"IF(ISNUMBER(L94),\"FMPLL.SYNCR.R = \"&O94&\";\"&CHAR(9)&CHAR(9)&\"/* Fsys =\"&N94&\"Mhz */\",IF(AND(ISNUMBER(L93),ISERR(L94)),\"}\",\"\"))","v":"FMPLL.SYNCR.R = 0x0D300000;\t\t/* Fsys =7.5Mhz */"}]
[null,{"$f":"IF(ISNUMBER(D94),\"FMPLL.SYNCR.R = \"&F94&\";\"&CHAR(9)&CHAR(9)&\"/* Fsys =\"&E94&\"Mhz */\",IF(AND(ISNUMBER(D93),ISERR(D94)),\"}\",\"\"))","v":"FMPLL.SYNCR.R = 0x0D200000;\t\t/* Fsys =30Mhz */"},null,null,null,null,null,null,null,{"$f":"IF(ISNUMBER(L95),\"FMPLL.SYNCR.R = \"&O95&\";\"&CHAR(9)&CHAR(9)&\"/* Fsys =\"&N95&\"Mhz */\",IF(AND(ISNUMBER(L94),ISERR(L95)),\"}\",\"\"))","v":"FMPLL.SYNCR.R = 0x0D280000;\t\t/* Fsys =15Mhz */"}]
[null,{"$f":"IF(ISNUMBER(D95),\"FMPLL.SYNCR.R = \"&F95&\";\"&CHAR(9)&CHAR(9)&\"/* Fsys =\"&E95&\"Mhz */\",IF(AND(ISNUMBER(D94),ISERR(D95)),\"}\",\"\"))","v":"FMPLL.SYNCR.R = 0x0D180000;\t\t/* Fsys =60Mhz */"},null,null,null,null,null,null,null,{"$f":"IF(ISNUMBER(L96),\"FMPLL.SYNCR.R = \"&O96&\";\"&CHAR(9)&CHAR(9)&\"/* Fsys =\"&N96&\"Mhz */\",IF(AND(ISNUMBER(L95),ISERR(L96)),\"}\",\"\"))","v":"FMPLL.SYNCR.R = 0x0D200000;\t\t/* Fsys =30Mhz */"}]
[null,{"$f":"IF(ISNUMBER(D96),\"FMPLL.SYNCR.R = \"&F96&\";\"&CHAR(9)&CHAR(9)&\"/* Fsys =\"&E96&\"Mhz */\",IF(AND(ISNUMBER(D95),ISERR(D96)),\"}\",\"\"))","v":"}"},null,null,null,null,null,null,null,{"$f":"IF(ISNUMBER(L97),\"FMPLL.SYNCR.R = \"&O97&\";\"&CHAR(9)&CHAR(9)&\"/* Fsys =\"&N97&\"Mhz */\",IF(AND(ISNUMBER(L96),ISERR(L97)),\"}\",\"\"))","v":"FMPLL.SYNCR.R = 0x0D180000;\t\t/* Fsys =60Mhz */"}]
[null,{"$f":"\"\"","v":""},null,null,null,null,null,null,null,{"$f":"IF(ISNUMBER(L98),\"FMPLL.SYNCR.R = \"&O98&\";\"&CHAR(9)&CHAR(9)&\"/* Fsys =\"&N98&\"Mhz */\",IF(AND(ISNUMBER(L97),ISERR(L98)),\"}\",\"\"))","v":"}"}]
[null,{"$f":"\"\"","v":""},null,null,null,null,null,null,null,{"$f":"\"\"","v":""}]
[null,{"$f":"\"\"","v":""},null,null,null,null,null,null,null,{"$f":"\"\"","v":""}]
[null,{"$f":"\"\"","v":""},null,null,null,null,null,null,null,{"$f":"\"\"","v":""}]
[null,{"$f":"\"\"","v":""},null,null,null,null,null,null,null,{"$f":"\"\"","v":""}]
[null,{"$f":"\"\"","v":""},null,null,null,null,null,null,null,{"$f":"\"\"","v":""}]
[null,{"$f":"\"\"","v":""},null,null,null,null,null,null,null,{"$f":"\"\"","v":""}]
[null,{"$f":"\"\"","v":""},null,null,null,null,null,null,null,{"$f":"\"\"","v":""}]
[null,{"$f":"\"\"","v":""},null,null,null,null,null,null,null,{"$f":"\"\"","v":""}]
[null,{"$f":"\"\"","v":""},null,null,null,null,null,null,null,{"$f":"\"\"","v":""}]
[null,{"$f":"\"\"","v":""},null,null,null,null,null,null,null,{"$f":"\"\"","v":""}]
[null,{"$f":"\"\"","v":""},null,null,null,null,null,null,null,{"$f":"\"\"","v":""}]

{"sheet":"PLL_2","index":4,"n_rows":222,"n_cols":67,"rows_kept":222,"cut":false,"hidden":true,"merged":[[1,11,1,12],[2,21,3,21],[3,16,3,17],[1,8,1,9],[1,4,1,5],[1,6,1,7],[2,14,3,15],[2,16,2,17],[2,19,3,20]]}
[]
[null,"Fin",{"$f":"PLL!C5","v":16},null,"f_osc/xtal",null,"f_pll_in",null,"f_VCO/ICO",null,null,"code variant"]
[null,"Fsys",{"$f":"PLL!C6","v":60},null,"min","max","min","max","min","max",null,"col","row",null,"fsys = fin *",null,{"$f":"IF(C5=1,\"MFD + 4\",\"EMFD\")","v":"MFD + 4"},null,null,"fvco = fsys *",null,{"$f":"IF(C5=1,\"4 * 2^RFD\",\"2^(ERFD+1)\")","v":"4 * 2^RFD"}]
[null,"Fmax",{"$f":"Devices!C7","v":80},null,{"$f":"Devices!G4","v":4},{"$f":"Devices!H4","v":20},{"$f":"Devices!I4","v":4},{"$f":"Devices!J4","v":16},{"$f":"Devices!K4","v":256},{"$f":"Devices!L4","v":512},null,{"$f":"IF(C5=1,\"B\",\"J\")","v":"B"},202,null,null,null,{"$f":"IF(C5=1,Q8,Q9)","v":"(PREDIV + 1) * 2^RFD"}]
[null,"Legacy ",{"$f":"IF(PLL!C8=\"Yes\",0,1)","v":1}]
[" ",{"$f":"IF($C$5=1,H56,H174)","v":"MFD"},{"$f":"IF($C$5=1,I56,I174)","v":"PREDIF"},{"$f":"IF($C$5=1,J56,J174)","v":"RFD"},{"$f":"IF($C$5=1,K56,K174)","v":" "},{"$f":"IF($C$5=1,L56,L174)","v":"fPLLin"},{"$f":"IF($C$5=1,M56,M174)","v":"fVCO"},{"$f":"IF($C$5=1,N56,N174)","v":"fsys"}," ",{"$f":"IF($C$5=1,P56,P174)","v":"SYNCR"},{"$f":"IF($C$5=1,Q56,Q174)","v":""}]
[{"$f":"IF(ISNUMBER(B7),1,\"\")","v":1},11,1,1," ",8,480,60," ","0x15880000",""]
[{"$f":"IF(ISNUMBER(B8),A7+1,\"\")","v":""},"","",""," ","","",""," ","","",null,null,null,null,null,{"$f":"\"(PREDIV + 1) * 2^RFD\"","v":"(PREDIV + 1) * 2^RFD"}]
[{"$f":"IF(ISNUMBER(B9),A8+1,\"\")","v":""},{"$f":"IF($C$5=1,H59,H177)","v":""},{"$f":"IF($C$5=1,I59,I177)","v":""},{"$f":"IF($C$5=1,J59,J177)","v":""},{"$f":"IF($C$5=1,K59,K177)","v":" "},{"$f":"IF($C$5=1,L59,L177)","v":""},{"$f":"IF($C$5=1,M59,M177)","v":""},{"$f":"IF($C$5=1,N59,N177)","v":""}," ",{"$f":"IF($C$5=1,P59,P177)","v":""},"",null,null,null,null,null,{"$f":"\"(EPREDIV+1) * 2^(ERFD+1)\"","v":"(EPREDIV+1) * 2^(ERFD+1)"}]
["","","",""," ","","",""," ","",""]
["","","",""," ","","",""," ","",""]
["","","",""," ","","",""," ","",""]
["","","",""," ","","",""," ","",""]
["","","",""," ","","",""," ","",""]
["","","",""," ","","",""," ","",""]
["","","",""," ","","",""," ","",""]
["","","",""," ","","",""," ","",""]
["","","",""," ","","",""," ","",""]
["","","",""," ","","",""," ","",""]
["","","",""," ","","",""," ","",""]
["","","",""," ","","",""," ","",""]
[{"$f":"IF(ISNUMBER(B22),A21+1,\"\")","v":""},{"$f":"IF($C$5=1,H72,H190)","v":""},{"$f":"IF($C$5=1,I72,I190)","v":""},{"$f":"IF($C$5=1,J72,J190)","v":""},{"$f":"IF($C$5=1,K72,K190)","v":" "},{"$f":"IF($C$5=1,L72,L190)","v":""},{"$f":"IF($C$5=1,M72,M190)","v":""},{"$f":"IF($C$5=1,N72,N190)","v":""}," ",{"$f":"IF($C$5=1,P72,P190)","v":""},{"$f":"IF($C$5=1,Q72,Q190)","v":""}]
["","","",""," ","","",""," ","",""]
["","","",""," ","","",""," ","",""]
["","","",""," ","","",""," ","",""]
[]
[]
[]
[]
[null,"PREDIF",0,0,0,1,1,1,2,2,2,3,3,3,4,4,4,5,5,5,6,6,6]
[null,"RFD",0,1,2,0,1,2,0,1,2,0,1,2,0,1,2,0,1,2,0,1,2]
["MFD",4,{"$f":"IF(AND(($C$2/(C$30+1))>=$G$4,($C$2/(C$30+1))<=$H$4,(4*$C$2/(C$30+1)*($B32+4))>=$I$4,(4*$C$2/(C$30+1)*($B32+4))<=$J$4,($C$2/(C$30+1)*($B32+4)/2^(C$31))=$C$3),-1,0)","v":0},{"$f":"IF(AND(($C$2/(D$30+1))>=$G$4,($C$2/(D$30+1))<=$H$4,(4*$C$2/(D$30+1)*($B32+4))>=$I$4,(4*$C$2/(D$30+1)*($B32+4))<=$J$4,($C$2/(D$30+1)*($B32+4)/2^(D$31))=$C$3),-1,0)","v":0},0,0,0,0,0,0,0,0,0,0,0,0,0,0,0,0,0,0,0,4]
[null,5,{"$f":"IF(AND(($C$2/(C$30+1))>=$G$4,($C$2/(C$30+1))<=$H$4,(4*$C$2/(C$30+1)*($B33+4))>=$I$4,(4*$C$2/(C$30+1)*($B33+4))<=$J$4,($C$2/(C$30+1)*($B33+4)/2^(C$31))=$C$3),-1,0)","v":0},0,0,0,0,0,0,0,0,0,0,0,0,0,0,0,0,0,0,0,0,5]
[null,6,0,0,0,0,0,0,0,0,0,0,0,0,0,0,0,0,0,0,0,0,0,6]
[null,7,0,0,0,0,0,0,0,0,0,0,0,0,0,0,0,0,0,0,0,0,0,7]
[null,8,0,0,0,0,0,0,0,0,0,0,0,0,0,0,0,0,0,0,0,0,0,8]
[null,9,0,0,0,0,0,0,0,0,0,0,0,0,0,0,0,0,0,0,0,0,0,9]
[null,10,0,0,0,0,0,0,0,0,0,0,0,0,0,0,0,0,0,0,0,0,0,10]
[null,11,0,0,0,0,-1,0,0,0,0,0,0,0,0,0,0,0,0,0,0,0,0,11]
[null,12,0,0,0,0,0,0,0,0,0,0,0,0,0,0,0,0,0,0,0,0,0,12]
[null,13,0,0,0,0,0,0,0,0,0,0,0,0,0,0,0,0,0,0,0,0,0,13]
[null,14,0,0,0,0,0,0,0,0,0,0,0,0,0,0,0,0,0,0,0,0,0,14]
[null,15,0,0,0,0,0,0,0,0,0,0,0,0,0,0,0,0,0,0,0,0,0,15]
[null,16,0,0,0,0,0,0,0,0,0,0,0,0,0,0,0,0,{"$f":"IF(AND(($C$2/(S$30+1))>=$G$4,($C$2/(S$30+1))<=$H$4,(4*$C$2/(S$30+1)*($B44+4))>=$I$4,(4*$C$2/(S$30+1)*($B44+4))<=$J$4,($C$2/(S$30+1)*($B44+4)/2^(S$31))=$C$3),-1,0)","v":0},0,0,0,0,16]
[null,17,0,0,0,0,0,0,0,0,0,0,0,0,0,0,0,0,0,0,0,0,0,17]
[null,18,0,0,0,0,0,0,0,0,0,0,0,0,0,0,0,0,0,0,0,0,0,18]
[null,19,0,0,0,0,0,0,0,0,0,0,0,0,0,0,0,0,0,0,0,0,0,19]
[null,20,0,0,0,0,0,0,0,0,0,0,0,0,0,0,0,0,0,0,0,0,0,20]
[null,"PREDIF",0,0,0,1,1,1,2,2,2,3,3,3,4,4,4,5,5,5,6,6,6]
[null,"RFD",0,1,2,0,1,2,0,1,2,0,1,2,0,1,2,0,1,2,0,1,2]
[]
[null,null,{"$f":"IF(ISNUMBER(VLOOKUP(-1,C32:$X$48,25-COLUMN(),0)),VLOOKUP(-1,C32:$X$48,25-COLUMN(),0),\"-\")","v":"-"},{"$f":"IF(ISNUMBER(VLOOKUP(-1,D32:$X$48,25-COLUMN(),0)),VLOOKUP(-1,D32:$X$48,25-COLUMN(),0),\"-\")","v":"-"},{"$f":"IF(ISNUMBER(VLOOKUP(-1,E32:$X$48,25-COLUMN(),0)),VLOOKUP(-1,E32:$X$48,25-COLUMN(),0),\"-\")","v":"-"},{"$f":"IF(ISNUMBER(VLOOKUP(-1,F32:$X$48,25-COLUMN(),0)),VLOOKUP(-1,F32:$X$48,25-COLUMN(),0),\"-\")","v":"-"},{"$f":"IF(ISNUMBER(VLOOKUP(-1,G32:$X$48,25-COLUMN(),0)),VLOOKUP(-1,G32:$X$48,25-COLUMN(),0),\"-\")","v":11},{"$f":"IF(ISNUMBER(VLOOKUP(-1,H32:$X$48,25-COLUMN(),0)),VLOOKUP(-1,H32:$X$48,25-COLUMN(),0),\"-\")","v":"-"},{"$f":"IF(ISNUMBER(VLOOKUP(-1,I32:$X$48,25-COLUMN(),0)),VLOOKUP(-1,I32:$X$48,25-COLUMN(),0),\"-\")","v":"-"},{"$f":"IF(ISNUMBER(VLOOKUP(-1,J32:$X$48,25-COLUMN(),0)),VLOOKUP(-1,J32:$X$48,25-COLUMN(),0),\"-\")","v":"-"},{"$f":"IF(ISNUMBER(VLOOKUP(-1,K32:$X$48,25-COLUMN(),0)),VLOOKUP(-1,K32:$X$48,25-COLUMN(),0),\"-\")","v":"-"},{"$f":"IF(ISNUMBER(VLOOKUP(-1,L32:$X$48,25-COLUMN(),0)),VLOOKUP(-1,L32:$X$48,25-COLUMN(),0),\"-\")","v":"-"},{"$f":"IF(ISNUMBER(VLOOKUP(-1,M32:$X$48,25-COLUMN(),0)),VLOOKUP(-1,M32:$X$48,25-COLUMN(),0),\"-\")","v":"-"},{"$f":"IF(ISNUMBER(VLOOKUP(-1,N32:$X$48,25-COLUMN(),0)),VLOOKUP(-1,N32:$X$48,25-COLUMN(),0),\"-\")","v":"-"},{"$f":"IF(ISNUMBER(VLOOKUP(-1,O32:$X$48,25-COLUMN(),0)),VLOOKUP(-1,O32:$X$48,25-COLUMN(),0),\"-\")","v":"-"},{"$f":"IF(ISNUMBER(VLOOKUP(-1,P32:$X$48,25-COLUMN(),0)),VLOOKUP(-1,P32:$X$48,25-COLUMN(),0),\"-\")","v":"-"},{"$f":"IF(ISNUMBER(VLOOKUP(-1,Q32:$X$48,25-COLUMN(),0)),VLOOKUP(-1,Q32:$X$48,25-COLUMN(),0),\"-\")","v":"-"},{"$f":"IF(ISNUMBER(VLOOKUP(-1,R32:$X$48,25-COLUMN(),0)),VLOOKUP(-1,R32:$X$48,25-COLUMN(),0),\"-\")","v":"-"},{"$f":"IF(ISNUMBER(VLOOKUP(-1,S32:$X$48,25-COLUMN(),0)),VLOOKUP(-1,S32:$X$48,25-COLUMN(),0),\"-\")","v":"-"},{"$f":"IF(ISNUMBER(VLOOKUP(-1,T32:$X$48,25-COLUMN(),0)),VLOOKUP(-1,T32:$X$48,25-COLUMN(),0),\"-\")","v":"-"},{"$f":"IF(ISNUMBER(VLOOKUP(-1,U32:$X$48,25-COLUMN(),0)),VLOOKUP(-1,U32:$X$48,25-COLUMN(),0),\"-\")","v":"-"},{"$f":"IF(ISNUMBER(VLOOKUP(-1,V32:$X$48,25-COLUMN(),0)),VLOOKUP(-1,V32:$X$48,25-COLUMN(),0),\"-\")","v":"-"},{"$f":"IF(ISNUMBER(VLOOKUP(-1,W32:$X$48,25-COLUMN(),0)),VLOOKUP(-1,W32:$X$48,25-COLUMN(),0),\"-\")","v":"-"}]
[null,null,{"$f":"IF(ISNUMBER(C52),C49,\"-\")","v":"-"},{"$f":"IF(ISNUMBER(D52),D49,\"-\")","v":"-"},"-","-",1,"-","-","-","-","-","-","-","-","-","-","-","-","-","-","-","-"]
[null,null,{"$f":"IF(ISNUMBER(C52),C50,\"-\")","v":"-"},{"$f":"IF(ISNUMBER(D52),D50,\"-\")","v":"-"},"-","-",1,"-","-","-","-","-","-","-","-","-","-","-","-","-","-","-","-"]
[]
[null,null,"MFD","PREDIF","RFD",null,null,"MFD","PREDIF","RFD"," ","fPLLin","fVCO","fsys",null,"SYNCR",{"$f":"\"\"","v":""}]
[{"$f":"IF(C57=C56,A56+MATCH(C57,INDEX($C$52:$W$52,1,A56+1):$W$52,0),MATCH(C57,$C$52:$W$52,0))","v":5},null,{"$f":"SMALL(IF(ISNUMBER($C$52:$W$52),$C$52:$W$52,\"\"),ROWS($C$57:C57))","v":11},{"$f":"INDEX($C$53:$W$53,1,A57)","v":1},{"$f":"INDEX($C$54:$W$54,1,A57)","v":1},null,null,{"$f":"IF(ISNUMBER(C57),C57,\"\")","v":11},{"$f":"IF(ISNUMBER(C57),D57,\"\")","v":1},{"$f":"IF(ISNUMBER(C57),E57,\"\")","v":1}," ",{"$f":"IF(ISNUMBER(H57),$C$2/(I57+1),\"\")","v":8},{"$f":"IF(ISNUMBER(H57),4*$C$2/(I57+1)*(H57+4),\"\")","v":480},{"$f":"IF(ISNUMBER(H57),$C$2/(I57+1)*(H57+4)/2^(J57),\"\")","v":60},null,{"$f":"IF(ISNUMBER(H57),\"0x\"&DEC2HEX(I57*2^28+J57*2^19+H57*2^23,8),\"\")","v":"0x15880000"},{"$f":"\"\"","v":""}]
[{"$f":"IF(C58=C57,A57+MATCH(C58,INDEX($C$52:$W$52,1,A57+1):$W$52,0),MATCH(C58,$C$52:$W$52,0))","v":{"$error":"#NUM!"}},null,{"$f":"SMALL(IF(ISNUMBER($C$52:$W$52),$C$52:$W$52,\"\"),ROWS($C$57:C58))","v":{"$error":"#NUM!"}},{"$f":"INDEX($C$53:$W$53,1,A58)","v":{"$error":"#NUM!"}},{"$f":"INDEX($C$54:$W$54,1,A58)","v":{"$error":"#NUM!"}},null,null,{"$f":"IF(ISNUMBER(C58),C58,\"\")","v":""},{"$f":"IF(ISNUMBER(C58),D58,\"\")","v":""},{"$f":"IF(ISNUMBER(C58),E58,\"\")","v":""}," ",{"$f":"IF(ISNUMBER(H58),$C$2/(I58+1),\"\")","v":""},{"$f":"IF(ISNUMBER(H58),4*$C$2/(I58+1)*(H58+4),\"\")","v":""},{"$f":"IF(ISNUMBER(H58),$C$2/(I58+1)*(H58+4)/2^(J58),\"\")","v":""},null,{"$f":"IF(ISNUMBER(H58),\"0x\"&DEC2HEX(I58*2^28+J58*2^19+H58*2^23,8),\"\")","v":""},{"$f":"\"\"","v":""}]
[{"$f":"IF(C59=C58,A58+MATCH(C59,INDEX($C$52:$W$52,1,A58+1):$W$52,0),MATCH(C59,$C$52:$W$52,0))","v":{"$error":"#NUM!"}},null,{"$f":"SMALL(IF(ISNUMBER($C$52:$W$52),$C$52:$W$52,\"\"),ROWS($C$57:C59))","v":{"$error":"#NUM!"}},{"$error":"#NUM!"},{"$error":"#NUM!"},null,null,"","",""," ","","","",null,"",{"$f":"\"\"","v":""}]
[{"$f":"IF(C60=C59,A59+MATCH(C60,INDEX($C$52:$W$52,1,A59+1):$W$52,0),MATCH(C60,$C$52:$W$52,0))","v":{"$error":"#NUM!"}},null,{"$f":"SMALL(IF(ISNUMBER($C$52:$W$52),$C$52:$W$52,\"\"),ROWS($C$57:C60))","v":{"$error":"#NUM!"}},{"$error":"#NUM!"},{"$error":"#NUM!"},null,null,"","",""," ","","","",null,"",{"$f":"\"\"","v":""}]
[{"$f":"IF(C61=C60,A60+MATCH(C61,INDEX($C$52:$W$52,1,A60+1):$W$52,0),MATCH(C61,$C$52:$W$52,0))","v":{"$error":"#NUM!"}},null,{"$f":"SMALL(IF(ISNUMBER($C$52:$W$52),$C$52:$W$52,\"\"),ROWS($C$57:C61))","v":{"$error":"#NUM!"}},{"$error":"#NUM!"},{"$error":"#NUM!"},null,null,"","",""," ","","","",null,"",{"$f":"\"\"","v":""}]
[{"$f":"IF(C62=C61,A61+MATCH(C62,INDEX($C$52:$W$52,1,A61+1):$W$52,0),MATCH(C62,$C$52:$W$52,0))","v":{"$error":"#NUM!"}},null,{"$f":"SMALL(IF(ISNUMBER($C$52:$W$52),$C$52:$W$52,\"\"),ROWS($C$57:C62))","v":{"$error":"#NUM!"}},{"$error":"#NUM!"},{"$error":"#NUM!"},null,null,"","",""," ","","","",null,"",{"$f":"\"\"","v":""}]
[{"$f":"IF(C63=C62,A62+MATCH(C63,INDEX($C$52:$W$52,1,A62+1):$W$52,0),MATCH(C63,$C$52:$W$52,0))","v":{"$error":"#NUM!"}},null,{"$f":"SMALL(IF(ISNUMBER($C$52:$W$52),$C$52:$W$52,\"\"),ROWS($C$57:C63))","v":{"$error":"#NUM!"}},{"$error":"#NUM!"},{"$error":"#NUM!"},null,null,"","",""," ","","","",null,"",{"$f":"\"\"","v":""}]
[{"$f":"IF(C64=C63,A63+MATCH(C64,INDEX($C$52:$W$52,1,A63+1):$W$52,0),MATCH(C64,$C$52:$W$52,0))","v":{"$error":"#NUM!"}},null,{"$f":"SMALL(IF(ISNUMBER($C$52:$W$52),$C$52:$W$52,\"\"),ROWS($C$57:C64))","v":{"$error":"#NUM!"}},{"$error":"#NUM!"},{"$error":"#NUM!"},null,null,"","",""," ","","","",null,"",{"$f":"\"\"","v":""}]
[{"$f":"IF(C65=C64,A64+MATCH(C65,INDEX($C$52:$W$52,1,A64+1):$W$52,0),MATCH(C65,$C$52:$W$52,0))","v":{"$error":"#NUM!"}},null,{"$f":"SMALL(IF(ISNUMBER($C$52:$W$52),$C$52:$W$52,\"\"),ROWS($C$57:C65))","v":{"$error":"#NUM!"}},{"$error":"#NUM!"},{"$error":"#NUM!"},null,null,"","",""," ","","","",null,"",{"$f":"\"\"","v":""}]
[{"$f":"IF(C66=C65,A65+MATCH(C66,INDEX($C$52:$W$52,1,A65+1):$W$52,0),MATCH(C66,$C$52:$W$52,0))","v":{"$error":"#NUM!"}},null,{"$f":"SMALL(IF(ISNUMBER($C$52:$W$52),$C$52:$W$52,\"\"),ROWS($C$57:C66))","v":{"$error":"#NUM!"}},{"$error":"#NUM!"},{"$error":"#NUM!"},null,null,"","",""," ","","","",null,"",{"$f":"\"\"","v":""}]
[{"$f":"IF(C67=C66,A66+MATCH(C67,INDEX($C$52:$W$52,1,A66+1):$W$52,0),MATCH(C67,$C$52:$W$52,0))","v":{"$error":"#NUM!"}},null,{"$f":"SMALL(IF(ISNUMBER($C$52:$W$52),$C$52:$W$52,\"\"),ROWS($C$57:C67))","v":{"$error":"#NUM!"}},{"$error":"#NUM!"},{"$error":"#NUM!"},null,null,"","",""," ","","","",null,"",{"$f":"\"\"","v":""}]
[{"$f":"IF(C68=C67,A67+MATCH(C68,INDEX($C$52:$W$52,1,A67+1):$W$52,0),MATCH(C68,$C$52:$W$52,0))","v":{"$error":"#NUM!"}},null,{"$f":"SMALL(IF(ISNUMBER($C$52:$W$52),$C$52:$W$52,\"\"),ROWS($C$57:C68))","v":{"$error":"#NUM!"}},{"$error":"#NUM!"},{"$error":"#NUM!"},null,null,"","",""," ","","","",null,"",{"$f":"\"\"","v":""}]
[null,null,null,null,null,null,null,"","",""," ","","","",null,"",{"$f":"\"\"","v":""}]
[null,null,null,null,null,null,null,"","",""," ","","","",null,"",{"$f":"\"\"","v":""}]
[null,null,null,null,null,null,null,"","",""," ","","","",null,"",{"$f":"\"\"","v":""}]
[null,null,null,null,null,null,null,"","",""," ","","","",null,"",{"$f":"\"\"","v":""}]
[null,null,null,null,null,null,null,"","",""," ","","","",null,"",{"$f":"\"\"","v":""}]
[null,null,null,null,null,null,null,"","",""," ","","","",null,"",{"$f":"\"\"","v":""}]
[null,null,null,null,null,null,null,"","",""," ","","","",null,"",{"$f":"\"\"","v":""}]
[]
[]
[]
[]
[]
[]
[]
[]
[]
[]
[]
[]
[]
[]
[]
[]
[]
[]
[]
[]
[]
[]
[]
[]
[null,"EPREDIF",0,0,0,0,1,1,1,1,2,2,2,2,3,3,3,3,4,4,4,4,5,5,5,5,6,6,6,6,7,7,7,7,8,8,8,8,9,9,9,9,10,10,10,10,11,11,11,11,12,12,12,12,13,13,13,13,14,14,14,14,15,15,15,15]
[null,"ERFD",0,1,2,3,0,1,2,3,0,1,2,3,0,1,2,3,0,1,2,3,0,1,2,3,0,1,2,3,0,1,2,3,0,1,2,3,0,1,2,3,0,1,2,3,0,1,2,3,0,1,2,3,0,1,2,3,0,1,2,3,0,1,2,3]
["EMFD",32,{"$f":"IF(AND(($C$2/(C$100+1))>=$G$4,($C$2/(C$100+1))<=$H$4,($C$2/(C$100+1)*$B102)>=$I$4,($C$2/(C$100+1)*$B102)<=$J$4,($C$2/(C$100+1)*$B102/2^(C$101+1))=$C$3,($C$2/(C$100+1)*$B102/2^(C$101+1))<=$C$4),-1,0)","v":0},{"$f":"IF(AND(($C$2/(D$100+1))>=$G$4,($C$2/(D$100+1))<=$H$4,($C$2/(D$100+1)*$B102)>=$I$4,($C$2/(D$100+1)*$B102)<=$J$4,($C$2/(D$100+1)*$B102/2^(D$101+1))=$C$3,($C$2/(D$100+1)*$B102/2^(D$101+1))<=$C$4),-1,0)","v":0},0,0,0,0,0,0,0,0,0,0,0,0,0,0,0,0,0,0,0,0,0,0,0,0,0,0,0,0,0,0,0,0,0,0,0,0,0,0,0,0,0,0,0,0,0,0,0,0,0,0,0,0,0,0,0,0,0,0,0,0,0,0,32]
[null,33,{"$f":"IF(AND(($C$2/(C$100+1))>=$G$4,($C$2/(C$100+1))<=$H$4,($C$2/(C$100+1)*$B103)>=$I$4,($C$2/(C$100+1)*$B103)<=$J$4,($C$2/(C$100+1)*$B103/2^(C$101+1))=$C$3,($C$2/(C$100+1)*$B103/2^(C$101+1))<=$C$4),-1,0)","v":0},0,0,0,0,0,0,0,0,0,0,0,0,0,0,0,0,0,0,0,0,0,0,0,0,0,0,0,0,0,0,0,0,0,0,0,0,0,0,0,0,0,0,0,0,0,0,0,0,0,0,0,0,0,0,0,0,0,0,0,0,0,0,0,33]
[null,34,0,0,0,0,0,0,0,0,0,0,0,0,0,0,0,0,0,0,0,0,0,0,0,0,0,0,0,0,0,0,0,0,0,0,0,0,0,0,0,0,0,0,0,0,0,0,0,0,0,0,0,0,0,0,0,0,0,0,0,0,0,0,0,0,34]
[null,35,0,0,0,0,0,0,0,0,0,0,0,0,0,0,0,0,0,0,0,0,0,0,0,0,0,0,0,0,0,0,0,0,0,0,0,0,0,0,0,0,0,0,0,0,0,0,0,0,0,0,0,0,0,0,0,0,0,0,0,0,0,0,0,0,35]
[null,36,0,0,0,0,{"$f":"IF(AND(($C$2/(G$100+1))>=$G$4,($C$2/(G$100+1))<=$H$4,($C$2/(G$100+1)*$B106)>=$I$4,($C$2/(G$100+1)*$B106)<=$J$4,($C$2/(G$100+1)*$B106/2^(G$101+1))=$C$3,($C$2/(G$100+1)*$B106/2^(G$101+1))<=$C$4),-1,0)","v":0},0,0,0,0,0,0,0,0,0,0,0,0,0,0,0,{"$f":"IF(AND(($C$2/(W$100+1))>=$G$4,($C$2/(W$100+1))<=$H$4,($C$2/(W$100+1)*$B106)>=$I$4,($C$2/(W$100+1)*$B106)<=$J$4,($C$2/(W$100+1)*$B106/2^(W$101+1))=$C$3,($C$2/(W$100+1)*$B106/2^(W$101+1))<=$C$4),-1,0)","v":0},0,0,0,0,0,0,0,0,0,0,0,0,0,0,0,{"$f":"IF(AND(($C$2/(AM$100+1))>=$G$4,($C$2/(AM$100+1))<=$H$4,($C$2/(AM$100+1)*$B106)>=$I$4,($C$2/(AM$100+1)*$B106)<=$J$4,($C$2/(AM$100+1)*$B106/2^(AM$101+1))=$C$3,($C$2/(AM$100+1)*$B106/2^(AM$101+1))<=$C$4),-1,0)","v":0},0,0,0,0,0,0,0,0,0,0,0,0,0,0,0,{"$f":"IF(AND(($C$2/(BC$100+1))>=$G$4,($C$2/(BC$100+1))<=$H$4,($C$2/(BC$100+1)*$B106)>=$I$4,($C$2/(BC$100+1)*$B106)<=$J$4,($C$2/(BC$100+1)*$B106/2^(BC$101+1))=$C$3,($C$2/(BC$100+1)*$B106/2^(BC$101+1))<=$C$4),-1,0)","v":0},0,0,0,0,0,0,0,0,0,0,0,36]
[null,37,0,0,0,0,0,0,0,0,0,0,0,0,0,0,0,0,0,0,0,0,0,0,0,0,0,0,0,0,0,0,0,0,0,0,0,0,0,0,0,0,0,0,0,0,0,0,0,0,0,0,0,0,0,0,0,0,0,0,0,0,0,0,0,0,37]
[null,38,0,0,0,0,0,0,0,0,0,0,0,0,0,0,0,0,0,0,0,0,0,0,0,0,0,0,0,0,0,0,0,0,0,0,0,0,0,0,0,0,0,0,0,0,0,0,0,0,0,0,0,0,0,0,0,0,0,0,0,0,0,0,0,0,38]
[null,39,0,0,0,0,0,0,0,0,0,0,0,0,0,0,0,0,0,0,0,0,0,0,0,0,0,0,0,0,0,0,0,0,0,0,0,0,0,0,0,0,0,0,0,0,0,0,0,0,0,0,0,0,0,0,0,0,0,0,0,0,0,0,0,0,39]
[null,40,0,0,0,0,0,0,0,0,0,0,0,0,0,0,0,0,0,0,0,0,0,0,0,0,0,0,0,0,0,0,0,0,0,0,0,0,0,0,0,0,0,0,0,0,0,0,0,0,0,0,0,0,0,0,0,0,0,0,0,0,0,0,0,0,40]
[null,41,0,0,0,0,0,0,0,0,0,0,0,0,0,0,0,0,0,0,0,0,0,0,0,0,0,0,0,0,0,0,0,0,0,0,0,0,0,0,0,0,0,0,0,0,0,0,0,0,0,0,0,0,0,0,0,0,0,0,0,0,0,0,0,0,41]
[null,42,0,0,0,0,0,0,0,0,0,0,0,0,0,0,0,0,0,0,0,0,0,0,0,0,0,0,0,0,0,0,0,0,0,0,0,0,0,0,0,0,0,0,0,0,0,0,0,0,0,0,0,0,0,0,0,0,0,0,0,0,0,0,0,0,42]
[null,43,0,0,0,0,0,0,0,0,0,0,0,0,0,0,0,0,0,0,0,0,0,0,0,0,0,0,0,0,0,0,0,0,0,0,0,0,0,0,0,0,0,0,0,0,0,0,0,0,0,0,0,0,0,0,0,0,0,0,0,0,0,0,0,0,43]
[null,44,0,0,0,0,0,0,0,0,0,0,0,0,0,0,0,0,0,0,0,0,0,0,0,0,0,0,0,0,0,0,0,0,0,0,0,0,0,0,0,0,0,0,0,0,0,0,0,0,0,0,0,0,0,0,0,0,0,0,0,0,0,0,0,0,44]
[null,45,0,0,0,0,0,0,0,0,0,0,0,0,0,0,0,0,0,0,0,0,0,0,0,0,0,0,0,0,0,0,0,0,0,0,0,0,0,0,0,0,0,0,0,0,0,0,0,0,0,0,0,0,0,0,0,0,0,0,0,0,0,0,0,0,45]
[null,46,0,0,0,0,0,0,0,0,0,0,0,0,0,0,0,0,0,0,0,0,0,0,0,0,0,0,0,0,0,0,0,0,0,0,0,0,0,0,0,0,0,0,0,0,0,0,0,0,0,0,0,0,0,0,0,0,0,0,0,0,0,0,0,0,46]
[null,47,0,0,0,0,0,0,0,0,0,0,0,0,0,0,0,0,0,0,0,0,0,0,0,0,0,0,0,0,0,0,0,0,0,0,0,0,0,0,0,0,0,0,0,0,0,0,0,0,0,0,0,0,0,0,0,0,0,0,0,0,0,0,0,0,47]
[null,48,0,0,0,0,0,0,0,0,0,0,0,0,0,0,0,0,0,0,0,0,0,0,0,0,0,0,0,0,0,0,0,0,0,0,0,0,0,0,0,0,0,0,0,0,0,0,0,0,0,0,0,0,0,0,0,0,0,0,0,0,0,0,0,0,48]
[null,49,0,0,0,0,0,0,0,0,0,0,0,0,0,0,0,0,0,0,0,0,0,0,0,0,0,0,0,0,0,0,0,0,0,0,0,0,0,0,0,0,0,0,0,0,0,0,0,0,0,0,0,0,0,0,0,0,0,0,0,0,0,0,0,0,49]
[null,50,0,0,0,0,0,0,0,0,0,0,0,0,0,0,0,0,0,0,0,0,0,0,0,0,0,0,0,0,0,0,0,0,0,0,0,0,0,0,0,0,0,0,0,0,0,0,0,0,0,0,0,0,0,0,0,0,0,0,0,0,0,0,0,0,50]
[null,51,0,0,0,0,0,0,0,0,0,0,0,0,0,0,0,0,0,0,0,0,0,0,0,0,0,0,0,0,0,0,0,0,0,0,0,{"$f":"IF(AND(($C$2/(AL$100+1))>=$G$4,($C$2/(AL$100+1))<=$H$4,($C$2/(AL$100+1)*$B121)>=$I$4,($C$2/(AL$100+1)*$B121)<=$J$4,($C$2/(AL$100+1)*$B121/2^(AL$101+1))=$C$3,($C$2/(AL$100+1)*$B121/2^(AL$101+1))<=$C$4),-1,0)","v":0},0,0,0,0,0,0,0,0,0,0,0,0,0,0,0,0,0,0,0,0,0,0,0,0,0,0,0,0,51]
[null,52,0,0,0,0,0,0,0,0,0,0,0,{"$f":"IF(AND(($C$2/(N$100+1))>=$G$4,($C$2/(N$100+1))<=$H$4,($C$2/(N$100+1)*$B122)>=$I$4,($C$2/(N$100+1)*$B122)<=$J$4,($C$2/(N$100+1)*$B122/2^(N$101+1))=$C$3,($C$2/(N$100+1)*$B122/2^(N$101+1))<=$C$4),-1,0)","v":0},0,0,0,0,0,0,0,0,0,0,0,0,0,0,0,{"$f":"IF(AND(($C$2/(AD$100+1))>=$G$4,($C$2/(AD$100+1))<=$H$4,($C$2/(AD$100+1)*$B122)>=$I$4,($C$2/(AD$100+1)*$B122)<=$J$4,($C$2/(AD$100+1)*$B122/2^(AD$101+1))=$C$3,($C$2/(AD$100+1)*$B122/2^(AD$101+1))<=$C$4),-1,0)","v":0},0,0,0,0,0,0,0,0,0,0,0,0,0,0,0,0,0,0,0,0,0,0,0,0,0,0,0,0,0,0,0,0,0,0,0,0,52]
[null,53,{"$f":"IF(AND(($C$2/(C$100+1))>=$G$4,($C$2/(C$100+1))<=$H$4,($C$2/(C$100+1)*$B123)>=$I$4,($C$2/(C$100+1)*$B123)<=$J$4,($C$2/(C$100+1)*$B123/2^(C$101+1))=$C$3,($C$2/(C$100+1)*$B123/2^(C$101+1))<=$C$4),-1,0)","v":0},0,0,0,0,0,0,0,0,0,0,0,0,0,0,0,0,0,0,0,0,0,0,0,0,0,0,0,0,0,0,0,0,0,0,0,0,0,0,0,0,0,0,0,0,0,0,0,0,0,0,0,0,0,0,0,0,0,0,0,0,0,0,0,53]
[null,54,0,0,0,0,0,0,0,0,0,0,0,0,0,0,0,0,0,0,0,0,0,0,0,0,0,0,0,0,0,0,0,0,0,0,0,0,0,0,0,0,0,0,0,0,0,0,0,0,0,0,0,0,0,0,0,0,0,0,0,0,0,0,0,0,54]
[null,55,0,0,0,0,0,0,0,0,0,0,0,0,0,0,0,0,0,0,0,0,0,0,0,0,0,0,0,0,0,0,0,0,0,0,0,0,0,0,0,0,0,0,0,0,0,0,0,0,0,0,0,0,0,0,0,0,0,0,0,0,0,0,0,0,55]
[null,56,0,0,0,0,0,0,0,0,0,0,0,0,0,0,0,0,0,0,0,0,0,0,0,0,0,0,0,0,0,0,0,0,0,0,0,0,0,0,0,0,0,0,0,0,0,0,0,0,0,0,0,0,0,0,0,0,0,0,0,0,0,0,0,0,56]
[null,57,0,0,0,0,0,0,0,0,0,0,0,0,0,0,0,0,0,0,0,0,0,0,0,0,0,0,0,0,0,0,0,0,0,0,0,0,0,0,0,0,0,0,0,0,0,0,0,0,0,0,0,0,0,0,0,{"$f":"IF(AND(($C$2/(BF$100+1))>=$G$4,($C$2/(BF$100+1))<=$H$4,($C$2/(BF$100+1)*$B127)>=$I$4,($C$2/(BF$100+1)*$B127)<=$J$4,($C$2/(BF$100+1)*$B127/2^(BF$101+1))=$C$3,($C$2/(BF$100+1)*$B127/2^(BF$101+1))<=$C$4),-1,0)","v":0},0,0,0,0,0,0,0,0,57]
[null,58,0,0,0,0,0,0,0,0,0,0,0,0,0,0,0,0,0,0,0,0,0,0,0,0,0,0,0,0,0,0,0,0,0,0,0,0,0,0,0,0,0,0,0,0,0,0,0,0,0,0,0,0,{"$f":"IF(AND(($C$2/(BC$100+1))>=$G$4,($C$2/(BC$100+1))<=$H$4,($C$2/(BC$100+1)*$B128)>=$I$4,($C$2/(BC$100+1)*$B128)<=$J$4,($C$2/(BC$100+1)*$B128/2^(BC$101+1))=$C$3,($C$2/(BC$100+1)*$B128/2^(BC$101+1))<=$C$4),-1,0)","v":0},0,0,0,0,0,0,0,0,0,0,0,58]
[null,59,0,0,0,0,0,0,0,0,0,0,0,0,0,0,0,0,0,0,0,0,0,0,0,0,0,0,0,0,0,0,0,0,0,0,0,0,0,0,0,0,0,0,0,0,0,0,0,0,0,0,0,0,0,0,0,0,0,0,0,0,0,0,0,0,59]
[null,60,0,0,0,0,0,0,-1,0,0,0,0,0,0,0,0,0,0,0,0,0,0,0,0,0,0,0,0,0,0,0,0,0,0,0,0,0,0,0,0,0,0,0,0,0,0,0,0,0,0,0,0,0,0,0,0,0,0,0,0,0,0,0,0,0,60]
[null,61,0,0,0,0,0,0,0,0,0,0,0,0,0,0,0,0,0,0,0,0,0,0,0,0,0,0,0,0,0,0,0,0,0,0,0,0,0,0,0,0,0,0,0,0,0,0,0,0,0,0,0,0,0,0,0,0,0,0,0,0,0,0,0,0,61]
[null,62,0,0,0,0,0,0,0,0,0,0,0,0,0,0,0,0,0,0,0,0,0,0,0,0,0,0,0,0,0,0,0,0,0,0,0,0,0,0,0,0,0,0,0,0,0,0,0,0,0,0,0,0,0,0,0,0,0,0,0,0,0,0,0,0,62]
[null,63,0,0,0,0,0,0,0,0,0,0,0,0,0,0,0,0,0,0,0,0,0,0,0,0,0,0,0,0,0,0,0,0,0,0,0,0,0,0,0,0,0,0,0,0,0,0,0,0,0,0,0,0,0,0,0,0,0,0,0,0,0,0,0,0,63]
[null,64,0,0,0,0,0,0,0,0,0,0,0,0,0,0,0,0,0,0,0,0,0,0,0,0,0,0,0,0,0,0,0,0,0,0,0,0,0,0,0,0,0,0,0,0,0,0,0,0,0,0,0,0,0,0,0,0,0,0,0,0,0,0,0,0,64]
[null,65,0,0,0,0,0,0,0,0,0,0,0,0,0,0,0,0,0,0,0,0,0,0,0,0,0,0,0,0,0,0,0,0,0,0,0,0,0,0,0,0,0,0,0,0,0,0,0,0,0,0,0,0,0,0,0,0,0,0,0,0,0,0,0,0,65]
[null,66,0,0,0,0,0,0,0,0,0,0,0,0,0,0,0,0,0,0,0,0,0,0,0,0,0,0,0,0,0,0,0,0,0,0,0,0,0,0,0,0,0,0,0,0,0,0,0,0,0,0,0,{"$f":"IF(AND(($C$2/(BB$100+1))>=$G$4,($C$2/(BB$100+1))<=$H$4,($C$2/(BB$100+1)*$B136)>=$I$4,($C$2/(BB$100+1)*$B136)<=$J$4,($C$2/(BB$100+1)*$B136/2^(BB$101+1))=$C$3,($C$2/(BB$100+1)*$B136/2^(BB$101+1))<=$C$4),-1,0)","v":0},0,0,0,0,0,0,0,0,0,0,0,0,66]
[null,67,0,0,0,0,0,0,0,0,0,0,0,0,0,0,0,0,0,0,0,0,0,0,0,0,0,0,0,0,0,0,0,0,0,0,0,0,0,0,0,0,0,0,{"$f":"IF(AND(($C$2/(AS$100+1))>=$G$4,($C$2/(AS$100+1))<=$H$4,($C$2/(AS$100+1)*$B137)>=$I$4,($C$2/(AS$100+1)*$B137)<=$J$4,($C$2/(AS$100+1)*$B137/2^(AS$101+1))=$C$3,($C$2/(AS$100+1)*$B137/2^(AS$101+1))<=$C$4),-1,0)","v":0},0,0,0,0,0,0,0,0,0,0,0,0,0,0,0,0,0,0,0,0,0,67]
[null,68,0,0,0,0,0,0,0,0,0,0,0,0,0,0,0,{"$f":"IF(AND(($C$2/(R$100+1))>=$G$4,($C$2/(R$100+1))<=$H$4,($C$2/(R$100+1)*$B138)>=$I$4,($C$2/(R$100+1)*$B138)<=$J$4,($C$2/(R$100+1)*$B138/2^(R$101+1))=$C$3,($C$2/(R$100+1)*$B138/2^(R$101+1))<=$C$4),-1,0)","v":0},0,0,0,0,0,0,0,0,0,0,0,0,0,0,0,{"$f":"IF(AND(($C$2/(AH$100+1))>=$G$4,($C$2/(AH$100+1))<=$H$4,($C$2/(AH$100+1)*$B138)>=$I$4,($C$2/(AH$100+1)*$B138)<=$J$4,($C$2/(AH$100+1)*$B138/2^(AH$101+1))=$C$3,($C$2/(AH$100+1)*$B138/2^(AH$101+1))<=$C$4),-1,0)","v":0},0,0,0,0,0,0,0,0,0,0,0,0,0,0,0,0,0,0,0,0,0,0,0,0,0,0,0,0,0,0,0,0,68]
[null,69,{"$f":"IF(AND(($C$2/(C$100+1))>=$G$4,($C$2/(C$100+1))<=$H$4,($C$2/(C$100+1)*$B139)>=$I$4,($C$2/(C$100+1)*$B139)<=$J$4,($C$2/(C$100+1)*$B139/2^(C$101+1))=$C$3,($C$2/(C$100+1)*$B139/2^(C$101+1))<=$C$4),-1,0)","v":0},0,0,0,0,0,0,0,0,0,0,0,0,0,0,0,0,0,0,0,0,0,0,0,0,0,0,0,0,0,0,0,0,0,0,0,0,0,0,0,0,0,0,0,0,0,0,0,0,0,0,0,0,0,0,0,0,0,0,0,0,0,0,0,69]
[null,70,0,0,0,0,0,0,0,0,0,0,0,0,0,0,0,0,0,0,0,0,0,0,0,0,0,0,0,0,0,0,0,0,0,0,0,0,0,0,0,0,0,0,0,0,0,0,0,0,0,0,0,0,0,0,0,0,0,0,0,0,0,0,0,0,70]
[null,71,0,0,0,0,0,0,0,0,0,0,0,0,0,0,0,0,0,0,0,0,0,0,0,0,0,0,0,0,0,0,0,0,0,0,0,0,0,0,0,0,0,0,0,0,0,0,0,0,0,0,0,0,0,0,0,0,0,0,0,0,0,0,0,0,71]
[null,72,0,0,0,0,0,0,0,0,0,0,0,0,0,0,0,0,0,0,0,0,0,0,0,0,0,0,0,0,0,0,0,0,0,0,0,0,0,0,0,0,0,0,0,0,0,0,0,0,0,0,0,0,0,0,0,0,0,0,0,0,0,0,0,0,72]
[null,73,0,0,0,0,0,0,0,0,0,0,0,0,0,0,0,0,0,0,0,0,0,0,0,0,0,0,0,0,0,0,0,0,0,0,0,0,0,0,0,0,0,0,0,0,0,0,0,0,0,0,0,0,0,0,0,0,0,0,0,0,0,0,0,0,73]
[null,74,0,0,0,0,0,0,0,0,0,0,0,0,0,0,0,0,0,0,0,0,0,0,0,0,0,0,0,0,0,0,0,0,0,0,0,0,0,0,0,0,0,0,0,0,0,0,0,0,0,0,0,0,0,0,0,0,0,0,0,0,0,0,0,0,74]
[null,75,0,0,0,0,0,0,0,0,0,0,0,0,0,0,0,0,0,0,0,0,0,0,0,0,0,0,0,0,0,0,0,0,0,0,0,0,0,0,0,0,0,0,0,0,0,0,0,0,0,0,0,0,0,0,0,0,0,0,0,0,0,0,0,0,75]
[null,76,0,0,0,0,0,0,0,0,0,0,0,0,0,0,0,0,0,0,0,0,0,0,0,0,0,0,0,0,0,0,0,0,0,0,0,0,0,0,0,0,0,0,0,0,0,0,0,0,0,0,0,0,0,0,0,0,0,0,0,0,0,0,0,0,76]
[null,77,0,0,0,0,0,0,0,0,0,0,0,0,0,0,0,0,0,0,0,0,0,0,0,0,0,0,0,0,0,0,0,0,0,0,0,0,0,0,0,0,0,0,0,0,0,0,0,0,0,0,0,0,0,0,0,0,0,0,0,0,0,0,0,0,77]
[null,78,0,0,0,0,0,0,0,0,0,0,0,0,0,0,0,0,0,0,0,0,0,0,0,0,0,0,0,0,0,0,0,0,0,0,0,0,0,0,0,0,0,0,0,0,0,0,0,0,0,0,0,0,0,0,0,0,0,0,0,0,0,0,0,0,78]
[null,79,0,0,0,0,0,0,0,0,0,0,0,0,0,0,0,0,0,0,0,0,0,0,0,0,0,0,0,0,0,0,0,0,0,0,0,0,0,0,0,0,0,0,0,0,0,0,0,0,0,0,0,0,0,0,0,0,0,0,0,0,0,0,0,0,79]
[null,80,0,0,0,0,0,0,0,0,0,0,0,0,0,0,0,0,0,0,0,0,0,0,0,0,0,0,0,0,0,0,0,0,0,0,0,0,0,0,0,0,0,0,0,0,0,0,0,0,0,0,0,0,0,0,0,0,0,0,0,0,0,0,0,0,80]
[null,81,0,0,0,0,0,0,0,0,0,0,0,0,0,0,0,0,0,0,0,0,0,0,0,0,0,0,0,0,0,0,0,0,0,0,0,0,0,0,0,0,0,0,0,0,0,0,0,0,0,0,0,0,0,0,0,0,0,0,0,0,0,0,0,0,81]
[null,82,0,0,0,0,0,0,0,0,0,0,0,0,0,0,0,0,0,0,0,0,0,0,0,0,0,0,0,0,0,0,0,0,0,0,0,0,0,0,0,0,0,0,0,0,0,0,0,0,0,0,0,0,0,0,0,0,0,0,0,0,0,0,0,0,82]
[null,83,0,0,0,0,0,0,0,0,0,0,0,0,0,0,0,0,0,0,0,0,0,0,0,0,0,0,0,0,0,0,0,0,0,0,0,0,0,0,0,0,0,0,0,0,0,0,{"$f":"IF(AND(($C$2/(AW$100+1))>=$G$4,($C$2/(AW$100+1))<=$H$4,($C$2/(AW$100+1)*$B153)>=$I$4,($C$2/(AW$100+1)*$B153)<=$J$4,($C$2/(AW$100+1)*$B153/2^(AW$101+1))=$C$3,($C$2/(AW$100+1)*$B153/2^(AW$101+1))<=$C$4),-1,0)","v":0},0,0,0,0,0,0,0,0,0,0,0,0,0,0,0,0,0,83]
[null,84,0,0,0,0,0,0,0,0,0,0,0,0,0,0,0,{"$f":"IF(AND(($C$2/(R$100+1))>=$G$4,($C$2/(R$100+1))<=$H$4,($C$2/(R$100+1)*$B154)>=$I$4,($C$2/(R$100+1)*$B154)<=$J$4,($C$2/(R$100+1)*$B154/2^(R$101+1))=$C$3,($C$2/(R$100+1)*$B154/2^(R$101+1))<=$C$4),-1,0)","v":0},0,0,0,0,0,0,0,0,0,0,0,0,0,0,0,{"$f":"IF(AND(($C$2/(AH$100+1))>=$G$4,($C$2/(AH$100+1))<=$H$4,($C$2/(AH$100+1)*$B154)>=$I$4,($C$2/(AH$100+1)*$B154)<=$J$4,($C$2/(AH$100+1)*$B154/2^(AH$101+1))=$C$3,($C$2/(AH$100+1)*$B154/2^(AH$101+1))<=$C$4),-1,0)","v":0},0,0,0,0,0,0,0,0,0,0,0,0,0,0,0,0,0,0,0,0,0,0,0,0,0,0,0,0,0,0,0,0,84]
[null,85,{"$f":"IF(AND(($C$2/(C$100+1))>=$G$4,($C$2/(C$100+1))<=$H$4,($C$2/(C$100+1)*$B155)>=$I$4,($C$2/(C$100+1)*$B155)<=$J$4,($C$2/(C$100+1)*$B155/2^(C$101+1))=$C$3,($C$2/(C$100+1)*$B155/2^(C$101+1))<=$C$4),-1,0)","v":0},0,0,0,0,0,0,0,0,0,0,0,0,0,0,0,0,0,0,0,0,0,0,0,0,0,0,0,0,0,0,0,0,0,0,0,0,0,0,0,0,0,0,0,0,0,0,0,0,0,0,0,0,0,0,0,0,0,0,0,0,0,0,0,85]
[null,86,0,0,0,0,0,0,0,0,0,0,0,0,0,0,0,0,0,0,0,0,0,0,0,0,0,0,0,0,0,0,0,0,0,0,0,0,0,0,0,0,0,0,0,0,0,0,0,0,0,0,0,0,0,0,0,0,0,0,0,0,0,0,0,0,86]
[null,87,0,0,0,0,0,0,0,0,0,0,0,0,0,0,0,0,0,0,0,0,0,0,0,0,0,0,0,0,0,0,0,0,0,0,0,0,0,0,0,0,0,0,0,0,0,0,0,0,0,0,0,0,0,0,0,0,0,0,0,0,0,0,0,0,87]
[null,88,0,0,0,0,0,0,0,0,0,0,0,0,0,0,0,0,0,0,0,0,0,0,0,0,0,0,0,0,0,0,0,0,0,0,0,0,0,0,0,0,0,0,0,0,0,0,0,0,0,0,0,0,0,0,0,0,0,0,0,0,0,0,0,0,88]
[null,89,0,0,0,0,0,0,0,0,0,0,0,0,0,0,0,0,0,0,0,0,0,0,0,0,0,0,0,0,0,0,0,0,0,0,0,0,0,0,0,0,0,0,0,0,0,0,0,0,0,0,0,0,0,0,0,0,0,0,0,0,0,0,0,0,89]
[null,90,0,0,0,0,0,0,0,0,0,0,-1,0,0,0,0,0,0,0,0,0,0,0,0,0,0,0,0,0,0,0,0,0,0,0,0,0,0,0,0,0,0,0,0,0,0,0,0,0,0,0,0,0,0,0,0,0,0,0,0,0,0,0,0,0,90]
[null,91,0,0,0,0,0,0,0,0,0,0,0,0,0,0,0,0,0,0,0,0,0,0,0,0,0,0,0,0,0,0,0,0,0,0,0,0,0,0,0,0,0,0,0,0,0,0,0,0,0,0,0,0,0,0,0,0,0,0,0,0,0,0,0,0,91]
[null,92,0,0,0,0,0,0,0,0,0,0,0,0,0,0,0,0,0,0,0,0,0,0,0,0,0,0,0,0,0,0,0,0,0,0,0,0,0,0,0,0,0,0,0,0,0,0,0,0,0,0,0,0,0,0,0,0,0,0,0,0,0,0,0,0,92]
[null,93,0,0,0,0,0,0,0,0,0,0,0,0,0,0,0,0,0,0,0,0,0,0,0,0,0,0,0,0,0,0,0,0,0,0,0,0,0,0,0,0,0,0,0,0,0,0,0,0,0,0,0,0,0,0,0,0,0,0,0,0,0,0,0,0,93]
[null,94,0,0,0,0,0,0,0,0,0,0,0,0,0,0,0,0,0,0,0,0,0,0,0,0,0,0,0,0,0,0,0,0,0,0,0,0,0,0,0,0,0,0,0,0,0,0,0,0,0,0,0,0,0,0,0,0,0,0,0,0,0,0,0,0,94]
[null,95,0,0,0,0,0,0,0,0,0,0,0,0,0,0,0,0,0,0,0,0,0,0,0,0,0,0,0,0,0,0,0,0,0,0,0,0,0,0,0,0,0,0,0,0,0,0,0,0,0,0,0,0,0,0,0,0,0,0,0,0,0,0,0,0,95]
[null,96,0,0,0,0,0,0,0,0,0,0,0,0,0,0,0,0,0,0,0,0,0,0,0,0,0,0,0,0,0,0,0,0,0,0,0,0,0,0,0,0,0,0,0,0,0,0,0,0,0,0,0,0,0,0,0,0,0,0,0,0,0,0,0,0,96]
[null,"EPREDIF",0,0,0,0,1,1,1,1,2,2,2,2,3,3,3,3,4,4,4,4,5,5,5,5,6,6,6,6,7,7,7,7,8,8,8,8,9,9,9,9,10,10,10,10,11,11,11,11,12,12,12,12,13,13,13,13,14,14,14,14,15,15,15,15]
[null,"ERFD",0,1,2,3,0,1,2,3,0,1,2,3,0,1,2,3,0,1,2,3,0,1,2,3,0,1,2,3,0,1,2,3,0,1,2,3,0,1,2,3,0,1,2,3,0,1,2,3,0,1,2,3,0,1,2,3,0,1,2,3,0,1,2,3]
[]
[null,null,{"$f":"IF(ISNUMBER(VLOOKUP(-1,C102:$BO$166,68-COLUMN(),0)),VLOOKUP(-1,C102:$BO$166,68-COLUMN(),0),\"-\")","v":"-"},{"$f":"IF(ISNUMBER(VLOOKUP(-1,D102:$BO$166,68-COLUMN(),0)),VLOOKUP(-1,D102:$BO$166,68-COLUMN(),0),\"-\")","v":"-"},{"$f":"IF(ISNUMBER(VLOOKUP(-1,E102:$BO$166,68-COLUMN(),0)),VLOOKUP(-1,E102:$BO$166,68-COLUMN(),0),\"-\")","v":"-"},{"$f":"IF(ISNUMBER(VLOOKUP(-1,F102:$BO$166,68-COLUMN(),0)),VLOOKUP(-1,F102:$BO$166,68-COLUMN(),0),\"-\")","v":"-"},{"$f":"IF(ISNUMBER(VLOOKUP(-1,G102:$BO$166,68-COLUMN(),0)),VLOOKUP(-1,G102:$BO$166,68-COLUMN(),0),\"-\")","v":"-"},{"$f":"IF(ISNUMBER(VLOOKUP(-1,H102:$BO$166,68-COLUMN(),0)),VLOOKUP(-1,H102:$BO$166,68-COLUMN(),0),\"-\")","v":"-"},{"$f":"IF(ISNUMBER(VLOOKUP(-1,I102:$BO$166,68-COLUMN(),0)),VLOOKUP(-1,I102:$BO$166,68-COLUMN(),0),\"-\")","v":60},{"$f":"IF(ISNUMBER(VLOOKUP(-1,J102:$BO$166,68-COLUMN(),0)),VLOOKUP(-1,J102:$BO$166,68-COLUMN(),0),\"-\")","v":"-"},{"$f":"IF(ISNUMBER(VLOOKUP(-1,K102:$BO$166,68-COLUMN(),0)),VLOOKUP(-1,K102:$BO$166,68-COLUMN(),0),\"-\")","v":"-"},{"$f":"IF(ISNUMBER(VLOOKUP(-1,L102:$BO$166,68-COLUMN(),0)),VLOOKUP(-1,L102:$BO$166,68-COLUMN(),0),\"-\")","v":"-"},{"$f":"IF(ISNUMBER(VLOOKUP(-1,M102:$BO$166,68-COLUMN(),0)),VLOOKUP(-1,M102:$BO$166,68-COLUMN(),0),\"-\")","v":90},{"$f":"IF(ISNUMBER(VLOOKUP(-1,N102:$BO$166,68-COLUMN(),0)),VLOOKUP(-1,N102:$BO$166,68-COLUMN(),0),\"-\")","v":"-"},{"$f":"IF(ISNUMBER(VLOOKUP(-1,O102:$BO$166,68-COLUMN(),0)),VLOOKUP(-1,O102:$BO$166,68-COLUMN(),0),\"-\")","v":"-"},{"$f":"IF(ISNUMBER(VLOOKUP(-1,P102:$BO$166,68-COLUMN(),0)),VLOOKUP(-1,P102:$BO$166,68-COLUMN(),0),\"-\")","v":"-"},{"$f":"IF(ISNUMBER(VLOOKUP(-1,Q102:$BO$166,68-COLUMN(),0)),VLOOKUP(-1,Q102:$BO$166,68-COLUMN(),0),\"-\")","v":"-"},{"$f":"IF(ISNUMBER(VLOOKUP(-1,R102:$BO$166,68-COLUMN(),0)),VLOOKUP(-1,R102:$BO$166,68-COLUMN(),0),\"-\")","v":"-"},{"$f":"IF(ISNUMBER(VLOOKUP(-1,S102:$BO$166,68-COLUMN(),0)),VLOOKUP(-1,S102:$BO$166,68-COLUMN(),0),\"-\")","v":"-"},{"$f":"IF(ISNUMBER(VLOOKUP(-1,T102:$BO$166,68-COLUMN(),0)),VLOOKUP(-1,T102:$BO$166,68-COLUMN(),0),\"-\")","v":"-"},{"$f":"IF(ISNUMBER(VLOOKUP(-1,U102:$BO$166,68-COLUMN(),0)),VLOOKUP(-1,U102:$BO$166,68-COLUMN(),0),\"-\")","v":"-"},{"$f":"IF(ISNUMBER(VLOOKUP(-1,V102:$BO$166,68-COLUMN(),0)),VLOOKUP(-1,V102:$BO$166,68-COLUMN(),0),\"-\")","v":"-"},{"$f":"IF(ISNUMBER(VLOOKUP(-1,W102:$BO$166,68-COLUMN(),0)),VLOOKUP(-1,W102:$BO$166,68-COLUMN(),0),\"-\")","v":"-"},{"$f":"IF(ISNUMBER(VLOOKUP(-1,X102:$BO$166,68-COLUMN(),0)),VLOOKUP(-1,X102:$BO$166,68-COLUMN(),0),\"-\")","v":"-"},{"$f":"IF(ISNUMBER(VLOOKUP(-1,Y102:$BO$166,68-COLUMN(),0)),VLOOKUP(-1,Y102:$BO$166,68-COLUMN(),0),\"-\")","v":"-"},{"$f":"IF(ISNUMBER(VLOOKUP(-1,Z102:$BO$166,68-COLUMN(),0)),VLOOKUP(-1,Z102:$BO$166,68-COLUMN(),0),\"-\")","v":"-"},{"$f":"IF(ISNUMBER(VLOOKUP(-1,AA102:$BO$166,68-COLUMN(),0)),VLOOKUP(-1,AA102:$BO$166,68-COLUMN(),0),\"-\")","v":"-"},{"$f":"IF(ISNUMBER(VLOOKUP(-1,AB102:$BO$166,68-COLUMN(),0)),VLOOKUP(-1,AB102:$BO$166,68-COLUMN(),0),\"-\")","v":"-"},{"$f":"IF(ISNUMBER(VLOOKUP(-1,AC102:$BO$166,68-COLUMN(),0)),VLOOKUP(-1,AC102:$BO$166,68-COLUMN(),0),\"-\")","v":"-"},{"$f":"IF(ISNUMBER(VLOOKUP(-1,AD102:$BO$166,68-COLUMN(),0)),VLOOKUP(-1,AD102:$BO$166,68-COLUMN(),0),\"-\")","v":"-"},{"$f":"IF(ISNUMBER(VLOOKUP(-1,AE102:$BO$166,68-COLUMN(),0)),VLOOKUP(-1,AE102:$BO$166,68-COLUMN(),0),\"-\")","v":"-"},{"$f":"IF(ISNUMBER(VLOOKUP(-1,AF102:$BO$166,68-COLUMN(),0)),VLOOKUP(-1,AF102:$BO$166,68-COLUMN(),0),\"-\")","v":"-"},{"$f":"IF(ISNUMBER(VLOOKUP(-1,AG102:$BO$166,68-COLUMN(),0)),VLOOKUP(-1,AG102:$BO$166,68-COLUMN(),0),\"-\")","v":"-"},{"$f":"IF(ISNUMBER(VLOOKUP(-1,AH102:$BO$166,68-COLUMN(),0)),VLOOKUP(-1,AH102:$BO$166,68-COLUMN(),0),\"-\")","v":"-"},{"$f":"IF(ISNUMBER(VLOOKUP(-1,AI102:$BO$166,68-COLUMN(),0)),VLOOKUP(-1,AI102:$BO$166,68-COLUMN(),0),\"-\")","v":"-"},{"$f":"IF(ISNUMBER(VLOOKUP(-1,AJ102:$BO$166,68-COLUMN(),0)),VLOOKUP(-1,AJ102:$BO$166,68-COLUMN(),0),\"-\")","v":"-"},{"$f":"IF(ISNUMBER(VLOOKUP(-1,AK102:$BO$166,68-COLUMN(),0)),VLOOKUP(-1,AK102:$BO$166,68-COLUMN(),0),\"-\")","v":"-"},{"$f":"IF(ISNUMBER(VLOOKUP(-1,AL102:$BO$166,68-COLUMN(),0)),VLOOKUP(-1,AL102:$BO$166,68-COLUMN(),0),\"-\")","v":"-"},{"$f":"IF(ISNUMBER(VLOOKUP(-1,AM102:$BO$166,68-COLUMN(),0)),VLOOKUP(-1,AM102:$BO$166,68-COLUMN(),0),\"-\")","v":"-"},{"$f":"IF(ISNUMBER(VLOOKUP(-1,AN102:$BO$166,68-COLUMN(),0)),VLOOKUP(-1,AN102:$BO$166,68-COLUMN(),0),\"-\")","v":"-"},{"$f":"IF(ISNUMBER(VLOOKUP(-1,AO102:$BO$166,68-COLUMN(),0)),VLOOKUP(-1,AO102:$BO$166,68-COLUMN(),0),\"-\")","v":"-"},{"$f":"IF(ISNUMBER(VLOOKUP(-1,AP102:$BO$166,68-COLUMN(),0)),VLOOKUP(-1,AP102:$BO$166,68-COLUMN(),0),\"-\")","v":"-"},{"$f":"IF(ISNUMBER(VLOOKUP(-1,AQ102:$BO$166,68-COLUMN(),0)),VLOOKUP(-1,AQ102:$BO$166,68-COLUMN(),0),\"-\")","v":"-"},{"$f":"IF(ISNUMBER(VLOOKUP(-1,AR102:$BO$166,68-COLUMN(),0)),VLOOKUP(-1,AR102:$BO$166,68-COLUMN(),0),\"-\")","v":"-"},{"$f":"IF(ISNUMBER(VLOOKUP(-1,AS102:$BO$166,68-COLUMN(),0)),VLOOKUP(-1,AS102:$BO$166,68-COLUMN(),0),\"-\")","v":"-"},{"$f":"IF(ISNUMBER(VLOOKUP(-1,AT102:$BO$166,68-COLUMN(),0)),VLOOKUP(-1,AT102:$BO$166,68-COLUMN(),0),\"-\")","v":"-"},{"$f":"IF(ISNUMBER(VLOOKUP(-1,AU102:$BO$166,68-COLUMN(),0)),VLOOKUP(-1,AU102:$BO$166,68-COLUMN(),0),\"-\")","v":"-"},{"$f":"IF(ISNUMBER(VLOOKUP(-1,AV102:$BO$166,68-COLUMN(),0)),VLOOKUP(-1,AV102:$BO$166,68-COLUMN(),0),\"-\")","v":"-"},{"$f":"IF(ISNUMBER(VLOOKUP(-1,AW102:$BO$166,68-COLUMN(),0)),VLOOKUP(-1,AW102:$BO$166,68-COLUMN(),0),\"-\")","v":"-"},{"$f":"IF(ISNUMBER(VLOOKUP(-1,AX102:$BO$166,68-COLUMN(),0)),VLOOKUP(-1,AX102:$BO$166,68-COLUMN(),0),\"-\")","v":"-"},{"$f":"IF(ISNUMBER(VLOOKUP(-1,AY102:$BO$166,68-COLUMN(),0)),VLOOKUP(-1,AY102:$BO$166,68-COLUMN(),0),\"-\")","v":"-"},{"$f":"IF(ISNUMBER(VLOOKUP(-1,AZ102:$BO$166,68-COLUMN(),0)),VLOOKUP(-1,AZ102:$BO$166,68-COLUMN(),0),\"-\")","v":"-"},{"$f":"IF(ISNUMBER(VLOOKUP(-1,BA102:$BO$166,68-COLUMN(),0)),VLOOKUP(-1,BA102:$BO$166,68-COLUMN(),0),\"-\")","v":"-"},{"$f":"IF(ISNUMBER(VLOOKUP(-1,BB102:$BO$166,68-COLUMN(),0)),VLOOKUP(-1,BB102:$BO$166,68-COLUMN(),0),\"-\")","v":"-"},{"$f":"IF(ISNUMBER(VLOOKUP(-1,BC102:$BO$166,68-COLUMN(),0)),VLOOKUP(-1,BC102:$BO$166,68-COLUMN(),0),\"-\")","v":"-"},{"$f":"IF(ISNUMBER(VLOOKUP(-1,BD102:$BO$166,68-COLUMN(),0)),VLOOKUP(-1,BD102:$BO$166,68-COLUMN(),0),\"-\")","v":"-"},{"$f":"IF(ISNUMBER(VLOOKUP(-1,BE102:$BO$166,68-COLUMN(),0)),VLOOKUP(-1,BE102:$BO$166,68-COLUMN(),0),\"-\")","v":"-"},{"$f":"IF(ISNUMBER(VLOOKUP(-1,BF102:$BO$166,68-COLUMN(),0)),VLOOKUP(-1,BF102:$BO$166,68-COLUMN(),0),\"-\")","v":"-"},{"$f":"IF(ISNUMBER(VLOOKUP(-1,BG102:$BO$166,68-COLUMN(),0)),VLOOKUP(-1,BG102:$BO$166,68-COLUMN(),0),\"-\")","v":"-"},{"$f":"IF(ISNUMBER(VLOOKUP(-1,BH102:$BO$166,68-COLUMN(),0)),VLOOKUP(-1,BH102:$BO$166,68-COLUMN(),0),\"-\")","v":"-"},{"$f":"IF(ISNUMBER(VLOOKUP(-1,BI102:$BO$166,68-COLUMN(),0)),VLOOKUP(-1,BI102:$BO$166,68-COLUMN(),0),\"-\")","v":"-"},{"$f":"IF(ISNUMBER(VLOOKUP(-1,BJ102:$BO$166,68-COLUMN(),0)),VLOOKUP(-1,BJ102:$BO$166,68-COLUMN(),0),\"-\")","v":"-"},{"$f":"IF(ISNUMBER(VLOOKUP(-1,BK102:$BO$166,68-COLUMN(),0)),VLOOKUP(-1,BK102:$BO$166,68-COLUMN(),0),\"-\")","v":"-"},{"$f":"IF(ISNUMBER(VLOOKUP(-1,BL102:$BO$166,68-COLUMN(),0)),VLOOKUP(-1,BL102:$BO$166,68-COLUMN(),0),\"-\")","v":"-"},{"$f":"IF(ISNUMBER(VLOOKUP(-1,BM102:$BO$166,68-COLUMN(),0)),VLOOKUP(-1,BM102:$BO$166,68-COLUMN(),0),\"-\")","v":"-"},{"$f":"IF(ISNUMBER(VLOOKUP(-1,BN102:$BO$166,68-COLUMN(),0)),VLOOKUP(-1,BN102:$BO$166,68-COLUMN(),0),\"-\")","v":"-"}]
[null,null,{"$f":"IF(ISNUMBER(C170),C167,\"-\")","v":"-"},{"$f":"IF(ISNUMBER(D170),D167,\"-\")","v":"-"},"-","-","-","-",1,"-","-","-",2,"-","-","-","-","-","-","-","-","-","-","-","-","-","-","-","-","-","-","-","-","-","-","-","-","-","-","-","-","-","-","-","-","-","-","-","-","-","-","-","-","-","-","-","-","-","-","-","-","-","-","-","-","-"]
[null,null,{"$f":"IF(ISNUMBER(C170),C168,\"-\")","v":"-"},{"$f":"IF(ISNUMBER(D170),D168,\"-\")","v":"-"},"-","-","-","-",2,"-","-","-",2,"-","-","-","-","-","-","-","-","-","-","-","-","-","-","-","-","-","-","-","-","-","-","-","-","-","-","-","-","-","-","-","-","-","-","-","-","-","-","-","-","-","-","-","-","-","-","-","-","-","-","-","-","-"]
[]
[null,null,"EMFD","EPREDIV","ERFD",null,null,"EMFD","EPREDIV","ERFD"," ","fPLLin","fVCO","fsys",null,"ESYNCR1","ESYNCR2"]
[{"$f":"IF(C175=C174,A174+MATCH(C175,INDEX($C$170:$BN$170,1,A174+1):$BN$170,0),MATCH(C175,$C$170:$BN$170,0))","v":7},null,{"$f":"SMALL(IF(ISNUMBER($C$170:$BN$170),$C$170:$BN$170,\"\"),ROWS($C$175:C175))","v":60},{"$f":"INDEX($C$171:$BN$171,1,A175)","v":1},{"$f":"INDEX($C$172:$BN$172,1,A175)","v":2},null,null,{"$f":"IF(ISNUMBER(C175),C175,\"\")","v":60},{"$f":"IF(ISNUMBER(C175),D175,\"\")","v":1},{"$f":"IF(ISNUMBER(C175),E175,\"\")","v":2}," ",{"$f":"IF(ISNUMBER(H175),$C$2/(I175+1),\"\")","v":8},{"$f":"IF(ISNUMBER(H175),$C$2/(I175+1)*(H175),\"\")","v":480},{"$f":"IF(ISNUMBER(H175),$C$2/(I175+1)*(H175)/2^(J175+1),\"\")","v":60},null,{"$f":"IF(ISNUMBER(H175),\"0x\"&DEC2HEX(15*2^28+I175*2^16+H175,8),\"\")","v":"0xF001003C"},{"$f":"IF(ISNUMBER(H175),\"0x\"&DEC2HEX(J175,8),\"\")","v":"0x00000002"}]
[{"$f":"IF(C176=C175,A175+MATCH(C176,INDEX($C$170:$BN$170,1,A175+1):$BN$170,0),MATCH(C176,$C$170:$BN$170,0))","v":11},null,{"$f":"SMALL(IF(ISNUMBER($C$170:$BN$170),$C$170:$BN$170,\"\"),ROWS($C$175:C176))","v":90},{"$f":"INDEX($C$171:$BN$171,1,A176)","v":2},{"$f":"INDEX($C$172:$BN$172,1,A176)","v":2},null,null,{"$f":"IF(ISNUMBER(C176),C176,\"\")","v":90},{"$f":"IF(ISNUMBER(C176),D176,\"\")","v":2},{"$f":"IF(ISNUMBER(C176),E176,\"\")","v":2}," ",{"$f":"IF(ISNUMBER(H176),$C$2/(I176+1),\"\")","v":5.333333333333333},{"$f":"IF(ISNUMBER(H176),$C$2/(I176+1)*(H176),\"\")","v":480},{"$f":"IF(ISNUMBER(H176),$C$2/(I176+1)*(H176)/2^(J176+1),\"\")","v":60},null,{"$f":"IF(ISNUMBER(H176),\"0x\"&DEC2HEX(15*2^28+I176*2^16+H176,8),\"\")","v":"0xF002005A"},{"$f":"IF(ISNUMBER(H176),\"0x\"&DEC2HEX(J176,8),\"\")","v":"0x00000002"}]
[{"$f":"IF(C177=C176,A176+MATCH(C177,INDEX($C$170:$BN$170,1,A176+1):$BN$170,0),MATCH(C177,$C$170:$BN$170,0))","v":{"$error":"#NUM!"}},null,{"$f":"SMALL(IF(ISNUMBER($C$170:$BN$170),$C$170:$BN$170,\"\"),ROWS($C$175:C177))","v":{"$error":"#NUM!"}},{"$error":"#NUM!"},{"$error":"#NUM!"},null,null,"","",""," ","","","",null,"",""]
[{"$f":"IF(C178=C177,A177+MATCH(C178,INDEX($C$170:$BN$170,1,A177+1):$BN$170,0),MATCH(C178,$C$170:$BN$170,0))","v":{"$error":"#NUM!"}},null,{"$f":"SMALL(IF(ISNUMBER($C$170:$BN$170),$C$170:$BN$170,\"\"),ROWS($C$175:C178))","v":{"$error":"#NUM!"}},{"$error":"#NUM!"},{"$error":"#NUM!"},null,null,"","",""," ","","","",null,"",""]
[{"$f":"IF(C179=C178,A178+MATCH(C179,INDEX($C$170:$BN$170,1,A178+1):$BN$170,0),MATCH(C179,$C$170:$BN$170,0))","v":{"$error":"#NUM!"}},null,{"$f":"SMALL(IF(ISNUMBER($C$170:$BN$170),$C$170:$BN$170,\"\"),ROWS($C$175:C179))","v":{"$error":"#NUM!"}},{"$error":"#NUM!"},{"$error":"#NUM!"},null,null,"","",""," ","","","",null,"",""]
[{"$f":"IF(C180=C179,A179+MATCH(C180,INDEX($C$170:$BN$170,1,A179+1):$BN$170,0),MATCH(C180,$C$170:$BN$170,0))","v":{"$error":"#NUM!"}},null,{"$f":"SMALL(IF(ISNUMBER($C$170:$BN$170),$C$170:$BN$170,\"\"),ROWS($C$175:C180))","v":{"$error":"#NUM!"}},{"$error":"#NUM!"},{"$error":"#NUM!"},null,null,"","",""," ","","","",null,"",""]
[{"$f":"IF(C181=C180,A180+MATCH(C181,INDEX($C$170:$BN$170,1,A180+1):$BN$170,0),MATCH(C181,$C$170:$BN$170,0))","v":{"$error":"#NUM!"}},null,{"$f":"SMALL(IF(ISNUMBER($C$170:$BN$170),$C$170:$BN$170,\"\"),ROWS($C$175:C181))","v":{"$error":"#NUM!"}},{"$error":"#NUM!"},{"$error":"#NUM!"},null,null,"","",""," ","","","",null,"",""]
[{"$f":"IF(C182=C181,A181+MATCH(C182,INDEX($C$170:$BN$170,1,A181+1):$BN$170,0),MATCH(C182,$C$170:$BN$170,0))","v":{"$error":"#NUM!"}},null,{"$f":"SMALL(IF(ISNUMBER($C$170:$BN$170),$C$170:$BN$170,\"\"),ROWS($C$175:C182))","v":{"$error":"#NUM!"}},{"$error":"#NUM!"},{"$error":"#NUM!"},null,null,"","",""," ","","","",null,"",""]
[{"$f":"IF(C183=C182,A182+MATCH(C183,INDEX($C$170:$BN$170,1,A182+1):$BN$170,0),MATCH(C183,$C$170:$BN$170,0))","v":{"$error":"#NUM!"}},null,{"$f":"SMALL(IF(ISNUMBER($C$170:$BN$170),$C$170:$BN$170,\"\"),ROWS($C$175:C183))","v":{"$error":"#NUM!"}},{"$error":"#NUM!"},{"$error":"#NUM!"},null,null,"","",""," ","","","",null,"",""]
[{"$f":"IF(C184=C183,A183+MATCH(C184,INDEX($C$170:$BN$170,1,A183+1):$BN$170,0),MATCH(C184,$C$170:$BN$170,0))","v":{"$error":"#NUM!"}},null,{"$f":"SMALL(IF(ISNUMBER($C$170:$BN$170),$C$170:$BN$170,\"\"),ROWS($C$175:C184))","v":{"$error":"#NUM!"}},{"$error":"#NUM!"},{"$error":"#NUM!"},null,null,"","",""," ","","","",null,"",""]
[{"$f":"IF(C185=C184,A184+MATCH(C185,INDEX($C$170:$BN$170,1,A184+1):$BN$170,0),MATCH(C185,$C$170:$BN$170,0))","v":{"$error":"#NUM!"}},null,{"$f":"SMALL(IF(ISNUMBER($C$170:$BN$170),$C$170:$BN$170,\"\"),ROWS($C$175:C185))","v":{"$error":"#NUM!"}},{"$error":"#NUM!"},{"$error":"#NUM!"},null,null,"","",""," ","","","",null,"",""]
[{"$f":"IF(C186=C185,A185+MATCH(C186,INDEX($C$170:$BN$170,1,A185+1):$BN$170,0),MATCH(C186,$C$170:$BN$170,0))","v":{"$error":"#NUM!"}},null,{"$f":"SMALL(IF(ISNUMBER($C$170:$BN$170),$C$170:$BN$170,\"\"),ROWS($C$175:C186))","v":{"$error":"#NUM!"}},{"$error":"#NUM!"},{"$error":"#NUM!"},null,null,"","",""," ","","","",null,"",""]
[null,null,null,null,null,null,null,"","",""," ","","","",null,"",""]
[null,null,null,null,null,null,null,"","",""," ","","","",null,"",""]
[null,null,null,null,null,null,null,"","",""," ","","","",null,"",""]
[null,null,null,null,null,null,null,"","",""," ","","","",null,"",""]
[null,null,null,null,null,null,null,"","",""," ","","","",null,"",""]
[null,null,null,null,null,null,null,"","",""," ","","","",null,"",""]
[null,null,null,null,null,null,null,"","",""," ","","","",null,"",""]
[]
[null,"selected variant",null,{"$f":"PLL!C10","v":1}]
[]
[null,"MFD","PREDIV","RFD"," ","SYNCR",null,null,null,"EMFD","EPREDIV","ERFD","fsys","ESYNCR1","ESYNCR2"]
[null,{"$f":"INDEX(B7:B18,$D$195,1)","v":11},{"$f":"INDEX(C7:C18,$D$195,1)","v":1},{"$f":"INDEX(D7:D18,$D$195,1)","v":1},{"$f":"$C$2/(C198+1)*(B198+4)/2^(D198)","v":60},{"$f":"IF(ISNUMBER(B198),\"0x\"&DEC2HEX(C198*2^28+D198*2^19+B198*2^23,8),\"\")","v":"0x15880000"},null,null,null,{"$f":"INDEX(B7:B18,$D$195,1)","v":11},{"$f":"INDEX(C7:C18,$D$195,1)","v":1},{"$f":"INDEX(D7:D18,$D$195,1)","v":1},{"$f":"$C$2/(C198+1)*(B198)/2^(D198+1)","v":22},{"$f":"\"0x\"&DEC2HEX(15*2^28+K198*2^16+J198,8)","v":"0xF001000B"},{"$f":"\"0x\"&DEC2HEX(L198,8)","v":"0x00000001"}]
[null,{"$f":"B198","v":11},{"$f":"C198","v":1},{"$f":"D198+1","v":2},{"$f":"$C$2/(C199+1)*(B199+4)/2^(D199)","v":30},{"$f":"IF(ISNUMBER(B199),\"0x\"&DEC2HEX(C199*2^28+D199*2^19+B199*2^23,8),\"\")","v":"0x15900000"},null,null,null,{"$f":"J198","v":11},{"$f":"K198","v":1},{"$f":"L198+1","v":2},{"$f":"$C$2/(C199+1)*(B199)/2^(D199+1)","v":11},null,{"$f":"\"0x\"&DEC2HEX(L199,8)","v":"0x00000002"}]
[]
[]
[null,{"$f":"\"/* Set sysclk = \"&C3&\"MHz running from PLL with \"&C2&\" MHz crystal reference. */\"","v":"/* Set sysclk = 60MHz running from PLL with 16 MHz crystal reference. */"},null,null,null,null,null,null,null,{"$f":"\"/* Set sysclk = \"&C3&\"MHz running from PLL with \"&C2&\" MHz crystal reference. */\"","v":"/* Set sysclk = 60MHz running from PLL with 16 MHz crystal reference. */"}]
[null,{"$f":"\"void initSysclk (void) {\"","v":"void initSysclk (void) {"},null,null,null,null,null,null,null,{"$f":"\"void initSysclk (void) {\"","v":"void initSysclk (void) {"}]
[null,{"$f":"\"FMPLL.ESYNCR1.B.CLKCFG = 0X7;\"&CHAR(9)&\"/* Change clk to PLL normal mode from crystal */\"","v":"FMPLL.ESYNCR1.B.CLKCFG = 0X7;\t/* Change clk to PLL normal mode from crystal */"},null,null,null,null,null,null,null,{"$f":"\"FMPLL.ESYNCR2.R = \"&O199&\";\"","v":"FMPLL.ESYNCR2.R = 0x00000002;"}]
[null,{"$f":"\"FMPLL.SYNCR.R = \"&F199&\";\"&CHAR(9)&CHAR(9)&\"/* Fsys =\"&E199&\"Mhz */\"","v":"FMPLL.SYNCR.R = 0x15900000;\t\t/* Fsys =30Mhz */"},null,null,null,null,null,null,null,{"$f":"\"FMPLL.ESYNCR1.R = \"&N198&\";\"","v":"FMPLL.ESYNCR1.R = 0xF001000B;"}]
[null,{"$f":"\"while (FMPLL.SYNSR.B.LOCK != 1) {};\"&CHAR(9)&CHAR(9)&\"/* Wait for FMPLL to LOCK  */\"","v":"while (FMPLL.SYNSR.B.LOCK != 1) {};\t\t/* Wait for FMPLL to LOCK  */"},null,null,null,null,null,null,null,{"$f":"\"while (FMPLL.SYNSR.B.LOCK != 1) {};\"&CHAR(9)&\"/* Wait for FMPLL to LOCK  */\"","v":"while (FMPLL.SYNSR.B.LOCK != 1) {};\t/* Wait for FMPLL to LOCK  */"}]
[null,{"$f":"\"FMPLL.SYNCR.R = \"&F198&\";\"&CHAR(9)&CHAR(9)&\"/* Fsys =\"&E198&\"Mhz */\"","v":"FMPLL.SYNCR.R = 0x15880000;\t\t/* Fsys =60Mhz */"},null,null,null,null,null,null,null,{"$f":"\"FMPLL.ESYNCR2.R = \"&O198&\";\"&CHAR(9)&CHAR(9)&\"/* Fsys =\"&M198&\"Mhz */\"","v":"FMPLL.ESYNCR2.R = 0x00000001;\t\t/* Fsys =22Mhz */"}]
[null,{"$f":"\"}\"","v":"}"},null,null,null,null,null,null,null,{"$f":"\"}\"","v":"}"}]
[null,{"$f":"\"\"","v":""},null,null,null,null,null,null,null,{"$f":"\"\"","v":""}]
[null,{"$f":"\"\"","v":""},null,null,null,null,null,null,null,{"$f":"\"\"","v":""}]
[null,{"$f":"\"\"","v":""},null,null,null,null,null,null,null,{"$f":"\"\"","v":""}]
[null,{"$f":"\"\"","v":""},null,null,null,null,null,null,null,{"$f":"\"\"","v":""}]
[null,{"$f":"\"\"","v":""},null,null,null,null,null,null,null,{"$f":"\"\"","v":""}]
[null,{"$f":"\"\"","v":""},null,null,null,null,null,null,null,{"$f":"\"\"","v":""}]
[null,{"$f":"\"\"","v":""},null,null,null,null,null,null,null,{"$f":"\"\"","v":""}]
[null,{"$f":"\"\"","v":""},null,null,null,null,null,null,null,{"$f":"\"\"","v":""}]
[null,{"$f":"\"\"","v":""},null,null,null,null,null,null,null,{"$f":"\"\"","v":""}]
[null,{"$f":"\"\"","v":""},null,null,null,null,null,null,null,{"$f":"\"\"","v":""}]
[null,{"$f":"\"\"","v":""},null,null,null,null,null,null,null,{"$f":"\"\"","v":""}]
[null,{"$f":"\"\"","v":""},null,null,null,null,null,null,null,{"$f":"\"\"","v":""}]
[null,{"$f":"\"\"","v":""},null,null,null,null,null,null,null,{"$f":"\"\"","v":""}]
[null,{"$f":"\"\"","v":""},null,null,null,null,null,null,null,{"$f":"\"\"","v":""}]

{"sheet":"PLL_3","index":5,"n_rows":146,"n_cols":78,"rows_kept":146,"cut":false,"hidden":true,"merged":[[1,11,1,12],[1,4,1,5],[1,6,1,7],[1,8,1,9],[2,21,3,21],[2,16,2,17],[3,16,3,17],[2,14,3,15],[2,19,3,20]]}
[]
[null,"Fin",{"$f":"PLL!C5","v":16},null,"f_osc/xtal",null,"f_pll_in",null,"f_VCO/ICO",null,null,"code variant"]
[null,"Fsys",{"$f":"IF(OR(Devices!C2=\"MPC5645S\",Devices!C2=\"PXD20\"),PLL!C6*2,PLL!C6)","v":60},null,"min","max","min","max","min","max",null,"col","row",null,"fsys = fin *",null,"NDIV",null,null,"fvco = fsys *",null,"2^(ODF+1)"]
[null,"Fmax",{"$f":"IF(OR(Devices!C2=\"MPC5645S\",Devices!C2=\"PXD20\"),Devices!C7*2,Devices!C7)","v":80},null,{"$f":"Devices!G4","v":4},{"$f":"Devices!H4","v":20},{"$f":"Devices!I4","v":4},{"$f":"Devices!J4","v":16},{"$f":"Devices!K4","v":256},{"$f":"Devices!L4","v":512},null,{"$f":"INDEX(Devices!$R$14:$R$44,Devices!$C$1,1)","v":0},126,null,null,null,"(IDF+1) * 2^(ODF+1)"]
[]
[" ","NDIV","IDF","ODF"," ","fPLLin","fVCO","fsys"," ","FMPLL_CR",{"$f":"\"\"","v":""}]
[{"$f":"IF(ISNUMBER(B7),1,\"\")","v":1},{"$f":"IF(ISNUMBER(C105),C105,\"\")","v":60},{"$f":"IF(ISNUMBER(C105),D105,\"\")","v":1},{"$f":"IF(ISNUMBER(C105),E105,\"\")","v":2}," ",{"$f":"IF(ISNUMBER(B7),$C$2/(C7+1),\"\")","v":8},{"$f":"IF(ISNUMBER(B7),$C$2/(C7+1)*B7,\"\")","v":480},{"$f":"IF(ISNUMBER(B7),IF(OR(Devices!$C$2=\"MPC5645S\",Devices!$C$2=\"PXD20\"),$C$2/(C7+1)*B7/2^(D7+1)/2,$C$2/(C7+1)*B7/2^(D7+1)),\"\")","v":60}," ",{"$f":"IF(ISNUMBER(B7),\"0x\"&DEC2HEX(C7*2^26+D7*2^24+B7*2^16+2^8,8),\"\")","v":"0x063C0100"},{"$f":"\"\"","v":""}]
[{"$f":"IF(ISNUMBER(B8),A7+1,\"\")","v":2},{"$f":"IF(ISNUMBER(C106),C106,\"\")","v":90},{"$f":"IF(ISNUMBER(C106),D106,\"\")","v":2},{"$f":"IF(ISNUMBER(C106),E106,\"\")","v":2}," ",{"$f":"IF(ISNUMBER(B8),$C$2/(C8+1),\"\")","v":5.333333333333333},{"$f":"IF(ISNUMBER(B8),$C$2/(C8+1)*B8,\"\")","v":480},{"$f":"IF(ISNUMBER(B8),IF(OR(Devices!$C$2=\"MPC5645S\",Devices!$C$2=\"PXD20\"),$C$2/(C8+1)*B8/2^(D8+1)/2,$C$2/(C8+1)*B8/2^(D8+1)),\"\")","v":60}," ",{"$f":"IF(ISNUMBER(B8),\"0x\"&DEC2HEX(C8*2^26+D8*2^24+B8*2^16+2^8,8),\"\")","v":"0x0A5A0100"},{"$f":"\"\"","v":""}]
[{"$f":"IF(ISNUMBER(B9),A8+1,\"\")","v":""},{"$f":"IF(ISNUMBER(C107),C107,\"\")","v":""},{"$f":"IF(ISNUMBER(C107),D107,\"\")","v":""},{"$f":"IF(ISNUMBER(C107),E107,\"\")","v":""}," ",{"$f":"IF(ISNUMBER(B9),$C$2/(C9+1),\"\")","v":""},{"$f":"IF(ISNUMBER(B9),$C$2/(C9+1)*B9,\"\")","v":""},{"$f":"IF(ISNUMBER(B9),IF(OR(Devices!$C$2=\"MPC5645S\",Devices!$C$2=\"PXD20\"),$C$2/(C9+1)*B9/2^(D9+1)/2,$C$2/(C9+1)*B9/2^(D9+1)),\"\")","v":""}," ",{"$f":"IF(ISNUMBER(B9),\"0x\"&DEC2HEX(C9*2^26+D9*2^24+B9*2^16+2^8,8),\"\")","v":""},{"$f":"\"\"","v":""}]
["","","",""," ","","",{"$f":"IF(ISNUMBER(B10),IF(OR(Devices!$C$2=\"MPC5645S\",Devices!$C$2=\"PXD20\"),$C$2/(C10+1)*B10/2^(D10+1)/2,$C$2/(C10+1)*B10/2^(D10+1)),\"\")","v":""}," ","",{"$f":"\"\"","v":""}]
["","","",""," ","","",{"$f":"IF(ISNUMBER(B11),IF(OR(Devices!$C$2=\"MPC5645S\",Devices!$C$2=\"PXD20\"),$C$2/(C11+1)*B11/2^(D11+1)/2,$C$2/(C11+1)*B11/2^(D11+1)),\"\")","v":""}," ","",{"$f":"\"\"","v":""}]
["","","",""," ","","",{"$f":"IF(ISNUMBER(B12),IF(OR(Devices!$C$2=\"MPC5645S\",Devices!$C$2=\"PXD20\"),$C$2/(C12+1)*B12/2^(D12+1)/2,$C$2/(C12+1)*B12/2^(D12+1)),\"\")","v":""}," ","",{"$f":"\"\"","v":""}]
["","","",""," ","","",{"$f":"IF(ISNUMBER(B13),IF(OR(Devices!$C$2=\"MPC5645S\",Devices!$C$2=\"PXD20\"),$C$2/(C13+1)*B13/2^(D13+1)/2,$C$2/(C13+1)*B13/2^(D13+1)),\"\")","v":""}," ","",{"$f":"\"\"","v":""}]
["","","",""," ","","",{"$f":"IF(ISNUMBER(B14),IF(OR(Devices!$C$2=\"MPC5645S\",Devices!$C$2=\"PXD20\"),$C$2/(C14+1)*B14/2^(D14+1)/2,$C$2/(C14+1)*B14/2^(D14+1)),\"\")","v":""}," ","",{"$f":"\"\"","v":""}]
["","","",""," ","","",{"$f":"IF(ISNUMBER(B15),IF(OR(Devices!$C$2=\"MPC5645S\",Devices!$C$2=\"PXD20\"),$C$2/(C15+1)*B15/2^(D15+1)/2,$C$2/(C15+1)*B15/2^(D15+1)),\"\")","v":""}," ","",{"$f":"\"\"","v":""}]
["","","",""," ","","",{"$f":"IF(ISNUMBER(B16),IF(OR(Devices!$C$2=\"MPC5645S\",Devices!$C$2=\"PXD20\"),$C$2/(C16+1)*B16/2^(D16+1)/2,$C$2/(C16+1)*B16/2^(D16+1)),\"\")","v":""}," ","",{"$f":"\"\"","v":""}]
["","","",""," ","","",{"$f":"IF(ISNUMBER(B17),IF(OR(Devices!$C$2=\"MPC5645S\",Devices!$C$2=\"PXD20\"),$C$2/(C17+1)*B17/2^(D17+1)/2,$C$2/(C17+1)*B17/2^(D17+1)),\"\")","v":""}," ","",{"$f":"\"\"","v":""}]
["","","",""," ","","",{"$f":"IF(ISNUMBER(B18),IF(OR(Devices!$C$2=\"MPC5645S\",Devices!$C$2=\"PXD20\"),$C$2/(C18+1)*B18/2^(D18+1)/2,$C$2/(C18+1)*B18/2^(D18+1)),\"\")","v":""}," ","",{"$f":"\"\"","v":""}]
["","","",""," ","","",{"$f":"IF(ISNUMBER(B19),IF(OR(Devices!$C$2=\"MPC5645S\",Devices!$C$2=\"PXD20\"),$C$2/(C19+1)*B19/2^(D19+1)/2,$C$2/(C19+1)*B19/2^(D19+1)),\"\")","v":""}," ","",{"$f":"\"\"","v":""}]
["","","",""," ","","",{"$f":"IF(ISNUMBER(B20),IF(OR(Devices!$C$2=\"MPC5645S\",Devices!$C$2=\"PXD20\"),$C$2/(C20+1)*B20/2^(D20+1)/2,$C$2/(C20+1)*B20/2^(D20+1)),\"\")","v":""}," ","",{"$f":"\"\"","v":""}]
["","","",""," ","","",{"$f":"IF(ISNUMBER(B21),IF(OR(Devices!$C$2=\"MPC5645S\",Devices!$C$2=\"PXD20\"),$C$2/(C21+1)*B21/2^(D21+1)/2,$C$2/(C21+1)*B21/2^(D21+1)),\"\")","v":""}," ","",{"$f":"\"\"","v":""}]
["","","",""," ","","",{"$f":"IF(ISNUMBER(B22),IF(OR(Devices!$C$2=\"MPC5645S\",Devices!$C$2=\"PXD20\"),$C$2/(C22+1)*B22/2^(D22+1)/2,$C$2/(C22+1)*B22/2^(D22+1)),\"\")","v":""}," ","",{"$f":"\"\"","v":""}]
["","","",""," ","","",{"$f":"IF(ISNUMBER(B23),IF(OR(Devices!$C$2=\"MPC5645S\",Devices!$C$2=\"PXD20\"),$C$2/(C23+1)*B23/2^(D23+1)/2,$C$2/(C23+1)*B23/2^(D23+1)),\"\")","v":""}," ","",{"$f":"\"\"","v":""}]
["","","",""," ","","",{"$f":"IF(ISNUMBER(B24),IF(OR(Devices!$C$2=\"MPC5645S\",Devices!$C$2=\"PXD20\"),$C$2/(C24+1)*B24/2^(D24+1)/2,$C$2/(C24+1)*B24/2^(D24+1)),\"\")","v":""}," ","",{"$f":"\"\"","v":""}]
["","","",""," ","","",{"$f":"IF(ISNUMBER(B25),IF(OR(Devices!$C$2=\"MPC5645S\",Devices!$C$2=\"PXD20\"),$C$2/(C25+1)*B25/2^(D25+1)/2,$C$2/(C25+1)*B25/2^(D25+1)),\"\")","v":""}," ","",{"$f":"\"\"","v":""}]
[]
[]
[]
[]
[null,"IFD",0,0,0,0,1,1,1,1,2,2,2,2,3,3,3,3,4,4,4,4,5,5,5,5,6,6,6,6,7,7,7,7,8,8,8,8,9,9,9,9,10,10,10,10,11,11,11,11,12,12,12,12,13,13,13,13,14,14,14,14,15,15,15,15]
[null,"ODF",0,1,2,3,0,1,2,3,0,1,2,3,0,1,2,3,0,1,2,3,0,1,2,3,0,1,2,3,0,1,2,3,0,1,2,3,0,1,2,3,0,1,2,3,0,1,2,3,0,1,2,3,0,1,2,3,0,1,2,3,0,1,2,3]
["Ndiv",32,{"$f":"IF(AND(($C$2/(C$30+1))>=$G$4,($C$2/(C$30+1))<=$H$4,($C$2/(C$30+1)*$B32)>=$I$4,($C$2/(C$30+1)*$B32)<=$J$4,($C$2/(C$30+1)*$B32/2^(C$31+1))=$C$3,($C$2/(C$30+1)*$B32/2^(C$31+1))<=$C$4),-1,0)","v":0},{"$f":"IF(AND(($C$2/(D$30+1))>=$G$4,($C$2/(D$30+1))<=$H$4,($C$2/(D$30+1)*$B32)>=$I$4,($C$2/(D$30+1)*$B32)<=$J$4,($C$2/(D$30+1)*$B32/2^(D$31+1))=$C$3,($C$2/(D$30+1)*$B32/2^(D$31+1))<=$C$4),-1,0)","v":0},0,0,0,0,0,0,0,0,0,0,0,0,0,0,0,0,0,0,0,0,0,0,0,0,0,0,0,0,0,0,0,0,0,0,0,0,0,0,0,0,0,0,0,0,0,0,0,0,0,0,0,0,0,0,0,0,0,0,0,0,0,0,32]
[null,33,{"$f":"IF(AND(($C$2/(C$30+1))>=$G$4,($C$2/(C$30+1))<=$H$4,($C$2/(C$30+1)*$B33)>=$I$4,($C$2/(C$30+1)*$B33)<=$J$4,($C$2/(C$30+1)*$B33/2^(C$31+1))=$C$3,($C$2/(C$30+1)*$B33/2^(C$31+1))<=$C$4),-1,0)","v":0},0,0,0,0,0,0,0,0,0,0,0,0,0,0,0,0,0,0,0,0,0,0,0,0,0,0,0,0,0,0,0,0,0,0,0,0,0,0,0,0,0,0,0,0,0,0,0,0,0,0,0,0,0,0,0,0,0,0,0,0,0,0,0,33]
[null,34,0,0,0,0,0,0,0,0,0,0,0,0,0,0,0,0,0,0,0,0,0,0,0,0,0,0,0,0,0,0,0,0,0,0,0,0,0,0,0,0,0,0,0,0,0,0,0,0,0,0,0,0,0,0,0,0,0,0,0,0,0,0,0,0,34]
[null,35,0,0,0,0,0,0,0,0,0,0,0,0,0,0,0,0,0,0,0,0,0,0,0,0,0,0,0,0,0,0,0,0,0,0,0,0,0,0,0,0,0,0,0,0,0,0,0,0,0,0,0,0,0,0,0,0,0,0,0,0,0,0,0,0,35]
[null,36,0,0,0,0,{"$f":"IF(AND(($C$2/(G$30+1))>=$G$4,($C$2/(G$30+1))<=$H$4,($C$2/(G$30+1)*$B36)>=$I$4,($C$2/(G$30+1)*$B36)<=$J$4,($C$2/(G$30+1)*$B36/2^(G$31+1))=$C$3,($C$2/(G$30+1)*$B36/2^(G$31+1))<=$C$4),-1,0)","v":0},0,0,0,0,0,0,0,0,0,0,0,0,0,0,0,{"$f":"IF(AND(($C$2/(W$30+1))>=$G$4,($C$2/(W$30+1))<=$H$4,($C$2/(W$30+1)*$B36)>=$I$4,($C$2/(W$30+1)*$B36)<=$J$4,($C$2/(W$30+1)*$B36/2^(W$31+1))=$C$3,($C$2/(W$30+1)*$B36/2^(W$31+1))<=$C$4),-1,0)","v":0},0,0,0,0,0,0,0,0,0,0,0,0,0,0,0,{"$f":"IF(AND(($C$2/(AM$30+1))>=$G$4,($C$2/(AM$30+1))<=$H$4,($C$2/(AM$30+1)*$B36)>=$I$4,($C$2/(AM$30+1)*$B36)<=$J$4,($C$2/(AM$30+1)*$B36/2^(AM$31+1))=$C$3,($C$2/(AM$30+1)*$B36/2^(AM$31+1))<=$C$4),-1,0)","v":0},0,0,0,0,0,0,0,0,0,0,0,0,0,0,0,{"$f":"IF(AND(($C$2/(BC$30+1))>=$G$4,($C$2/(BC$30+1))<=$H$4,($C$2/(BC$30+1)*$B36)>=$I$4,($C$2/(BC$30+1)*$B36)<=$J$4,($C$2/(BC$30+1)*$B36/2^(BC$31+1))=$C$3,($C$2/(BC$30+1)*$B36/2^(BC$31+1))<=$C$4),-1,0)","v":0},0,0,0,0,0,0,0,0,0,0,0,36]
[null,37,0,0,0,0,0,0,0,0,0,0,0,0,0,0,0,0,0,0,0,0,0,0,0,0,0,0,0,0,0,0,0,0,0,0,0,0,0,0,0,0,0,0,0,0,0,0,0,0,0,0,0,0,0,0,0,0,0,0,0,0,0,0,0,0,37]
[null,38,0,0,0,0,0,0,0,0,0,0,0,0,0,0,0,0,0,0,0,0,0,0,0,0,0,0,0,0,0,0,0,0,0,0,0,0,0,0,0,0,0,0,0,0,0,0,0,0,0,0,0,0,0,0,0,0,0,0,0,0,0,0,0,0,38]
[null,39,0,0,0,0,0,0,0,0,0,0,0,0,0,0,0,0,0,0,0,0,0,0,0,0,0,0,0,0,0,0,0,0,0,0,0,0,0,0,0,0,0,0,0,0,0,0,0,0,0,0,0,0,0,0,0,0,0,0,0,0,0,0,0,0,39]
[null,40,0,0,0,0,0,0,0,0,0,0,0,0,0,0,0,0,0,0,0,0,0,0,0,0,0,0,0,0,0,0,0,0,0,0,0,0,0,0,0,0,0,0,0,0,0,0,0,0,0,0,0,0,0,0,0,0,0,0,0,0,0,0,0,0,40]
[null,41,0,0,0,0,0,0,0,0,0,0,0,0,0,0,0,0,0,0,0,0,0,0,0,0,0,0,0,0,0,0,0,0,0,0,0,0,0,0,0,0,0,0,0,0,0,0,0,0,0,0,0,0,0,0,0,0,0,0,0,0,0,0,0,0,41]
[null,42,0,0,0,0,0,0,0,0,0,0,0,0,0,0,0,0,0,0,0,0,0,0,0,0,0,0,0,0,0,0,0,0,0,0,0,0,0,0,0,0,0,0,0,0,0,0,0,0,0,0,0,0,0,0,0,0,0,0,0,0,0,0,0,0,42]
[null,43,0,0,0,0,0,0,0,0,0,0,0,0,0,0,0,0,0,0,0,0,0,0,0,0,0,0,0,0,0,0,0,0,0,0,0,0,0,0,0,0,0,0,0,0,0,0,0,0,0,0,0,0,0,0,0,0,0,0,0,0,0,0,0,0,43]
[null,44,0,0,0,0,0,0,0,0,0,0,0,0,0,0,0,0,0,0,0,0,0,0,0,0,0,0,0,0,0,0,0,0,0,0,0,0,0,0,0,0,0,0,0,0,0,0,0,0,0,0,0,0,0,0,0,0,0,0,0,0,0,0,0,0,44]
[null,45,0,0,0,0,0,0,0,0,0,0,0,0,0,0,0,0,0,0,0,0,0,0,0,0,0,0,0,0,0,0,0,0,0,0,0,0,0,0,0,0,0,0,0,0,0,0,0,0,0,0,0,0,0,0,0,0,0,0,0,0,0,0,0,0,45]
[null,46,0,0,0,0,0,0,0,0,0,0,0,0,0,0,0,0,0,0,0,0,0,0,0,0,0,0,0,0,0,0,0,0,0,0,0,0,0,0,0,0,0,0,0,0,0,0,0,0,0,0,0,0,0,0,0,0,0,0,0,0,0,0,0,0,46]
[null,47,0,0,0,0,0,0,0,0,0,0,0,0,0,0,0,0,0,0,0,0,0,0,0,0,0,0,0,0,0,0,0,0,0,0,0,0,0,0,0,0,0,0,0,0,0,0,0,0,0,0,0,0,0,0,0,0,0,0,0,0,0,0,0,0,47]
[null,48,0,0,0,0,0,0,0,0,0,0,0,0,0,0,0,0,0,0,0,0,0,0,0,0,0,0,0,0,0,0,0,0,0,0,0,0,0,0,0,0,0,0,0,0,0,0,0,0,0,0,0,0,0,0,0,0,0,0,0,0,0,0,0,0,48]
[null,49,0,0,0,0,0,0,0,0,0,0,0,0,0,0,0,0,0,0,0,0,0,0,0,0,0,0,0,0,0,0,0,0,0,0,0,0,0,0,0,0,0,0,0,0,0,0,0,0,0,0,0,0,0,0,0,0,0,0,0,0,0,0,0,0,49]
[null,50,0,0,0,0,0,0,0,0,0,0,0,0,0,0,0,0,0,0,0,0,0,0,0,0,0,0,0,0,0,0,0,0,0,0,0,0,0,0,0,0,0,0,0,0,0,0,0,0,0,0,0,0,0,0,0,0,0,0,0,0,0,0,0,0,50]
[null,51,0,0,0,0,0,0,0,0,0,0,0,0,0,0,0,0,0,0,0,0,0,0,0,0,0,0,0,0,0,0,0,0,0,0,0,{"$f":"IF(AND(($C$2/(AL$30+1))>=$G$4,($C$2/(AL$30+1))<=$H$4,($C$2/(AL$30+1)*$B51)>=$I$4,($C$2/(AL$30+1)*$B51)<=$J$4,($C$2/(AL$30+1)*$B51/2^(AL$31+1))=$C$3,($C$2/(AL$30+1)*$B51/2^(AL$31+1))<=$C$4),-1,0)","v":0},0,0,0,0,0,0,0,0,0,0,0,0,0,0,0,0,0,0,0,0,0,0,0,0,0,0,0,0,51]
[null,52,0,0,0,0,0,0,0,0,0,0,0,{"$f":"IF(AND(($C$2/(N$30+1))>=$G$4,($C$2/(N$30+1))<=$H$4,($C$2/(N$30+1)*$B52)>=$I$4,($C$2/(N$30+1)*$B52)<=$J$4,($C$2/(N$30+1)*$B52/2^(N$31+1))=$C$3,($C$2/(N$30+1)*$B52/2^(N$31+1))<=$C$4),-1,0)","v":0},0,0,0,0,0,0,0,0,0,0,0,0,0,0,0,{"$f":"IF(AND(($C$2/(AD$30+1))>=$G$4,($C$2/(AD$30+1))<=$H$4,($C$2/(AD$30+1)*$B52)>=$I$4,($C$2/(AD$30+1)*$B52)<=$J$4,($C$2/(AD$30+1)*$B52/2^(AD$31+1))=$C$3,($C$2/(AD$30+1)*$B52/2^(AD$31+1))<=$C$4),-1,0)","v":0},0,0,0,0,0,0,0,0,0,0,0,0,0,0,0,0,0,0,0,0,0,0,0,0,0,0,0,0,0,0,0,0,0,0,0,0,52]
[null,53,{"$f":"IF(AND(($C$2/(C$30+1))>=$G$4,($C$2/(C$30+1))<=$H$4,($C$2/(C$30+1)*$B53)>=$I$4,($C$2/(C$30+1)*$B53)<=$J$4,($C$2/(C$30+1)*$B53/2^(C$31+1))=$C$3,($C$2/(C$30+1)*$B53/2^(C$31+1))<=$C$4),-1,0)","v":0},0,0,0,0,0,0,0,0,0,0,0,0,0,0,0,0,0,0,0,0,0,0,0,0,0,0,0,0,0,0,0,0,0,0,0,0,0,0,0,0,0,0,0,0,0,0,0,0,0,0,0,0,0,0,0,0,0,0,0,0,0,0,0,53]
[null,54,0,0,0,0,0,0,0,0,0,0,0,0,0,0,0,0,0,0,0,0,0,0,0,0,0,0,0,0,0,0,0,0,0,0,0,0,0,0,0,0,0,0,0,0,0,0,0,0,0,0,0,0,0,0,0,0,0,0,0,0,0,0,0,0,54]
[null,55,0,0,0,0,0,0,0,0,0,0,0,0,0,0,0,0,0,0,0,0,0,0,0,0,0,0,0,0,0,0,0,0,0,0,0,0,0,0,0,0,0,0,0,0,0,0,0,0,0,0,0,0,0,0,0,0,0,0,0,0,0,0,0,0,55]
[null,56,0,0,0,0,0,0,0,0,0,0,0,0,0,0,0,0,0,0,0,0,0,0,0,0,0,0,0,0,0,0,0,0,0,0,0,0,0,0,0,0,0,0,0,0,0,0,0,0,0,0,0,0,0,0,0,0,0,0,0,0,0,0,0,0,56]
[null,57,0,0,0,0,0,0,0,0,0,0,0,0,0,0,0,0,0,0,0,0,0,0,0,0,0,0,0,0,0,0,0,0,0,0,0,0,0,0,0,0,0,0,0,0,0,0,0,0,0,0,0,0,0,0,0,{"$f":"IF(AND(($C$2/(BF$30+1))>=$G$4,($C$2/(BF$30+1))<=$H$4,($C$2/(BF$30+1)*$B57)>=$I$4,($C$2/(BF$30+1)*$B57)<=$J$4,($C$2/(BF$30+1)*$B57/2^(BF$31+1))=$C$3,($C$2/(BF$30+1)*$B57/2^(BF$31+1))<=$C$4),-1,0)","v":0},0,0,0,0,0,0,0,0,57]
[null,58,0,0,0,0,0,0,0,0,0,0,0,0,0,0,0,0,0,0,0,0,0,0,0,0,0,0,0,0,0,0,0,0,0,0,0,0,0,0,0,0,0,0,0,0,0,0,0,0,0,0,0,0,{"$f":"IF(AND(($C$2/(BC$30+1))>=$G$4,($C$2/(BC$30+1))<=$H$4,($C$2/(BC$30+1)*$B58)>=$I$4,($C$2/(BC$30+1)*$B58)<=$J$4,($C$2/(BC$30+1)*$B58/2^(BC$31+1))=$C$3,($C$2/(BC$30+1)*$B58/2^(BC$31+1))<=$C$4),-1,0)","v":0},0,0,0,0,0,0,0,0,0,0,0,58]
[null,59,0,0,0,0,0,0,0,0,0,0,0,0,0,0,0,0,0,0,0,0,0,0,0,0,0,0,0,0,0,0,0,0,0,0,0,0,0,0,0,0,0,0,0,0,0,0,0,0,0,0,0,0,0,0,0,0,0,0,0,0,0,0,0,0,59]
[null,60,0,0,0,0,0,0,-1,0,0,0,0,0,0,0,0,0,0,0,0,0,0,0,0,0,0,0,0,0,0,0,0,0,0,0,0,0,0,0,0,0,0,0,0,0,0,0,0,0,0,0,0,0,0,0,0,0,0,0,0,0,0,0,0,0,60]
[null,61,0,0,0,0,0,0,0,0,0,0,0,0,0,0,0,0,0,0,0,0,0,0,0,0,0,0,0,0,0,0,0,0,0,0,0,0,0,0,0,0,0,0,0,0,0,0,0,0,0,0,0,0,0,0,0,0,0,0,0,0,0,0,0,0,61]
[null,62,0,0,0,0,0,0,0,0,0,0,0,0,0,0,0,0,0,0,0,0,0,0,0,0,0,0,0,0,0,0,0,0,0,0,0,0,0,0,0,0,0,0,0,0,0,0,0,0,0,0,0,0,0,0,0,0,0,0,0,0,0,0,0,0,62]
[null,63,0,0,0,0,0,0,0,0,0,0,0,0,0,0,0,0,0,0,0,0,0,0,0,0,0,0,0,0,0,0,0,0,0,0,0,0,0,0,0,0,0,0,0,0,0,0,0,0,0,0,0,0,0,0,0,0,0,0,0,0,0,0,0,0,63]
[null,64,0,0,0,0,0,0,0,0,0,0,0,0,0,0,0,0,0,0,0,0,0,0,0,0,0,0,0,0,0,0,0,0,0,0,0,0,0,0,0,0,0,0,0,0,0,0,0,0,0,0,0,0,0,0,0,0,0,0,0,0,0,0,0,0,64]
[null,65,0,0,0,0,0,0,0,0,0,0,0,0,0,0,0,0,0,0,0,0,0,0,0,0,0,0,0,0,0,0,0,0,0,0,0,0,0,0,0,0,0,0,0,0,0,0,0,0,0,0,0,0,0,0,0,0,0,0,0,0,0,0,0,0,65]
[null,66,0,0,0,0,0,0,0,0,0,0,0,0,0,0,0,0,0,0,0,0,0,0,0,0,0,0,0,0,0,0,0,0,0,0,0,0,0,0,0,0,0,0,0,0,0,0,0,0,0,0,0,{"$f":"IF(AND(($C$2/(BB$30+1))>=$G$4,($C$2/(BB$30+1))<=$H$4,($C$2/(BB$30+1)*$B66)>=$I$4,($C$2/(BB$30+1)*$B66)<=$J$4,($C$2/(BB$30+1)*$B66/2^(BB$31+1))=$C$3,($C$2/(BB$30+1)*$B66/2^(BB$31+1))<=$C$4),-1,0)","v":0},0,0,0,0,0,0,0,0,0,0,0,0,66]
[null,67,0,0,0,0,0,0,0,0,0,0,0,0,0,0,0,0,0,0,0,0,0,0,0,0,0,0,0,0,0,0,0,0,0,0,0,0,0,0,0,0,0,0,{"$f":"IF(AND(($C$2/(AS$30+1))>=$G$4,($C$2/(AS$30+1))<=$H$4,($C$2/(AS$30+1)*$B67)>=$I$4,($C$2/(AS$30+1)*$B67)<=$J$4,($C$2/(AS$30+1)*$B67/2^(AS$31+1))=$C$3,($C$2/(AS$30+1)*$B67/2^(AS$31+1))<=$C$4),-1,0)","v":0},0,0,0,0,0,0,0,0,0,0,0,0,0,0,0,0,0,0,0,0,0,67]
[null,68,0,0,0,0,0,0,0,0,0,0,0,0,0,0,0,{"$f":"IF(AND(($C$2/(R$30+1))>=$G$4,($C$2/(R$30+1))<=$H$4,($C$2/(R$30+1)*$B68)>=$I$4,($C$2/(R$30+1)*$B68)<=$J$4,($C$2/(R$30+1)*$B68/2^(R$31+1))=$C$3,($C$2/(R$30+1)*$B68/2^(R$31+1))<=$C$4),-1,0)","v":0},0,0,0,0,0,0,0,0,0,0,0,0,0,0,0,{"$f":"IF(AND(($C$2/(AH$30+1))>=$G$4,($C$2/(AH$30+1))<=$H$4,($C$2/(AH$30+1)*$B68)>=$I$4,($C$2/(AH$30+1)*$B68)<=$J$4,($C$2/(AH$30+1)*$B68/2^(AH$31+1))=$C$3,($C$2/(AH$30+1)*$B68/2^(AH$31+1))<=$C$4),-1,0)","v":0},0,0,0,0,0,0,0,0,0,0,0,0,0,0,0,0,0,0,0,0,0,0,0,0,0,0,0,0,0,0,0,0,68]
[null,69,{"$f":"IF(AND(($C$2/(C$30+1))>=$G$4,($C$2/(C$30+1))<=$H$4,($C$2/(C$30+1)*$B69)>=$I$4,($C$2/(C$30+1)*$B69)<=$J$4,($C$2/(C$30+1)*$B69/2^(C$31+1))=$C$3,($C$2/(C$30+1)*$B69/2^(C$31+1))<=$C$4),-1,0)","v":0},0,0,0,0,0,0,0,0,0,0,0,0,0,0,0,0,0,0,0,0,0,0,0,0,0,0,0,0,0,0,0,0,0,0,0,0,0,0,0,0,0,0,0,0,0,0,0,0,0,0,0,0,0,0,0,0,0,0,0,0,0,0,0,69]
[null,70,0,0,0,0,0,0,0,0,0,0,0,0,0,0,0,0,0,0,0,0,0,0,0,0,0,0,0,0,0,0,0,0,0,0,0,0,0,0,0,0,0,0,0,0,0,0,0,0,0,0,0,0,0,0,0,0,0,0,0,0,0,0,0,0,70]
[null,71,0,0,0,0,0,0,0,0,0,0,0,0,0,0,0,0,0,0,0,0,0,0,0,0,0,0,0,0,0,0,0,0,0,0,0,0,0,0,0,0,0,0,0,0,0,0,0,0,0,0,0,0,0,0,0,0,0,0,0,0,0,0,0,0,71]
[null,72,0,0,0,0,0,0,0,0,0,0,0,0,0,0,0,0,0,0,0,0,0,0,0,0,0,0,0,0,0,0,0,0,0,0,0,0,0,0,0,0,0,0,0,0,0,0,0,0,0,0,0,0,0,0,0,0,0,0,0,0,0,0,0,0,72]
[null,73,0,0,0,0,0,0,0,0,0,0,0,0,0,0,0,0,0,0,0,0,0,0,0,0,0,0,0,0,0,0,0,0,0,0,0,0,0,0,0,0,0,0,0,0,0,0,0,0,0,0,0,0,0,0,0,0,0,0,0,0,0,0,0,0,73]
[null,74,0,0,0,0,0,0,0,0,0,0,0,0,0,0,0,0,0,0,0,0,0,0,0,0,0,0,0,0,0,0,0,0,0,0,0,0,0,0,0,0,0,0,0,0,0,0,0,0,0,0,0,0,0,0,0,0,0,0,0,0,0,0,0,0,74]
[null,75,0,0,0,0,0,0,0,0,0,0,0,0,0,0,0,0,0,0,0,0,0,0,0,0,0,0,0,0,0,0,0,0,0,0,0,0,0,0,0,0,0,0,0,0,0,0,0,0,0,0,0,0,0,0,0,0,0,0,0,0,0,0,0,0,75]
[null,76,0,0,0,0,0,0,0,0,0,0,0,0,0,0,0,0,0,0,0,0,0,0,0,0,0,0,0,0,0,0,0,0,0,0,0,0,0,0,0,0,0,0,0,0,0,0,0,0,0,0,0,0,0,0,0,0,0,0,0,0,0,0,0,0,76]
[null,77,0,0,0,0,0,0,0,0,0,0,0,0,0,0,0,0,0,0,0,0,0,0,0,0,0,0,0,0,0,0,0,0,0,0,0,0,0,0,0,0,0,0,0,0,0,0,0,0,0,0,0,0,0,0,0,0,0,0,0,0,0,0,0,0,77]
[null,78,0,0,0,0,0,0,0,0,0,0,0,0,0,0,0,0,0,0,0,0,0,0,0,0,0,0,0,0,0,0,0,0,0,0,0,0,0,0,0,0,0,0,0,0,0,0,0,0,0,0,0,0,0,0,0,0,0,0,0,0,0,0,0,0,78]
[null,79,0,0,0,0,0,0,0,0,0,0,0,0,0,0,0,0,0,0,0,0,0,0,0,0,0,0,0,0,0,0,0,0,0,0,0,0,0,0,0,0,0,0,0,0,0,0,0,0,0,0,0,0,0,0,0,0,0,0,0,0,0,0,0,0,79]
[null,80,0,0,0,0,0,0,0,0,0,0,0,0,0,0,0,0,0,0,0,0,0,0,0,0,0,0,0,0,0,0,0,0,0,0,0,0,0,0,0,0,0,0,0,0,0,0,0,0,0,0,0,0,0,0,0,0,0,0,0,0,0,0,0,0,80]
[null,81,0,0,0,0,0,0,0,0,0,0,0,0,0,0,0,0,0,0,0,0,0,0,0,0,0,0,0,0,0,0,0,0,0,0,0,0,0,0,0,0,0,0,0,0,0,0,0,0,0,0,0,0,0,0,0,0,0,0,0,0,0,0,0,0,81]
[null,82,0,0,0,0,0,0,0,0,0,0,0,0,0,0,0,0,0,0,0,0,0,0,0,0,0,0,0,0,0,0,0,0,0,0,0,0,0,0,0,0,0,0,0,0,0,0,0,0,0,0,0,0,0,0,0,0,0,0,0,0,0,0,0,0,82]
[null,83,0,0,0,0,0,0,0,0,0,0,0,0,0,0,0,0,0,0,0,0,0,0,0,0,0,0,0,0,0,0,0,0,0,0,0,0,0,0,0,0,0,0,0,0,0,0,{"$f":"IF(AND(($C$2/(AW$30+1))>=$G$4,($C$2/(AW$30+1))<=$H$4,($C$2/(AW$30+1)*$B83)>=$I$4,($C$2/(AW$30+1)*$B83)<=$J$4,($C$2/(AW$30+1)*$B83/2^(AW$31+1))=$C$3,($C$2/(AW$30+1)*$B83/2^(AW$31+1))<=$C$4),-1,0)","v":0},0,0,0,0,0,0,0,0,0,0,0,0,0,0,0,0,0,83]
[null,84,0,0,0,0,0,0,0,0,0,0,0,0,0,0,0,{"$f":"IF(AND(($C$2/(R$30+1))>=$G$4,($C$2/(R$30+1))<=$H$4,($C$2/(R$30+1)*$B84)>=$I$4,($C$2/(R$30+1)*$B84)<=$J$4,($C$2/(R$30+1)*$B84/2^(R$31+1))=$C$3,($C$2/(R$30+1)*$B84/2^(R$31+1))<=$C$4),-1,0)","v":0},0,0,0,0,0,0,0,0,0,0,0,0,0,0,0,{"$f":"IF(AND(($C$2/(AH$30+1))>=$G$4,($C$2/(AH$30+1))<=$H$4,($C$2/(AH$30+1)*$B84)>=$I$4,($C$2/(AH$30+1)*$B84)<=$J$4,($C$2/(AH$30+1)*$B84/2^(AH$31+1))=$C$3,($C$2/(AH$30+1)*$B84/2^(AH$31+1))<=$C$4),-1,0)","v":0},0,0,0,0,0,0,0,0,0,0,0,0,0,0,0,0,0,0,0,0,0,0,0,0,0,0,0,0,0,0,0,0,84]
[null,85,{"$f":"IF(AND(($C$2/(C$30+1))>=$G$4,($C$2/(C$30+1))<=$H$4,($C$2/(C$30+1)*$B85)>=$I$4,($C$2/(C$30+1)*$B85)<=$J$4,($C$2/(C$30+1)*$B85/2^(C$31+1))=$C$3,($C$2/(C$30+1)*$B85/2^(C$31+1))<=$C$4),-1,0)","v":0},0,0,0,0,0,0,0,0,0,0,0,0,0,0,0,0,0,0,0,0,0,0,0,0,0,0,0,0,0,0,0,0,0,0,0,0,0,0,0,0,0,0,0,0,0,0,0,0,0,0,0,0,0,0,0,0,0,0,0,0,0,0,0,85]
[null,86,0,0,0,0,0,0,0,0,0,0,0,0,0,0,0,0,0,0,0,0,0,0,0,0,0,0,0,0,0,0,0,0,0,0,0,0,0,0,0,0,0,0,0,0,0,0,0,0,0,0,0,0,0,0,0,0,0,0,0,0,0,0,0,0,86]
[null,87,0,0,0,0,0,0,0,0,0,0,0,0,0,0,0,0,0,0,0,0,0,0,0,0,0,0,0,0,0,0,0,0,0,0,0,0,0,0,0,0,0,0,0,0,0,0,0,0,0,0,0,0,0,0,0,0,0,0,0,0,0,0,0,0,87]
[null,88,0,0,0,0,0,0,0,0,0,0,0,0,0,0,0,0,0,0,0,0,0,0,0,0,0,0,0,0,0,0,0,0,0,0,0,0,0,0,0,0,0,0,0,0,0,0,0,0,0,0,0,0,0,0,0,0,0,0,0,0,0,0,0,0,88]
[null,89,0,0,0,0,0,0,0,0,0,0,0,0,0,0,0,0,0,0,0,0,0,0,0,0,0,0,0,0,0,0,0,0,0,0,0,0,0,0,0,0,0,0,0,0,0,0,0,0,0,0,0,0,0,0,0,0,0,0,0,0,0,0,0,0,89]
[null,90,0,0,0,0,0,0,0,0,0,0,-1,0,0,0,0,0,0,0,0,0,0,0,0,0,0,0,0,0,0,0,0,0,0,0,0,0,0,0,0,0,0,0,0,0,0,0,0,0,0,0,0,0,0,0,0,0,0,0,0,0,0,0,0,0,90]
[null,91,0,0,0,0,0,0,0,0,0,0,0,0,0,0,0,0,0,0,0,0,0,0,0,0,0,0,0,0,0,0,0,0,0,0,0,0,0,0,0,0,0,0,0,0,0,0,0,0,0,0,0,0,0,0,0,0,0,0,0,0,0,0,0,0,91]
[null,92,0,0,0,0,0,0,0,0,0,0,0,0,0,0,0,0,0,0,0,0,0,0,0,0,0,0,0,0,0,0,0,0,0,0,0,0,0,0,0,0,0,0,0,0,0,0,0,0,0,0,0,0,0,0,0,0,0,0,0,0,0,0,0,0,92]
[null,93,0,0,0,0,0,0,0,0,0,0,0,0,0,0,0,0,0,0,0,0,0,0,0,0,0,0,0,0,0,0,0,0,0,0,0,0,0,0,0,0,0,0,0,0,0,0,0,0,0,0,0,0,0,0,0,0,0,0,0,0,0,0,0,0,93]
[null,94,0,0,0,0,0,0,0,0,0,0,0,0,0,0,0,0,0,0,0,0,0,0,0,0,0,0,0,0,0,0,0,0,0,0,0,0,0,0,0,0,0,0,0,0,0,0,0,0,0,0,0,0,0,0,0,0,0,0,0,0,0,0,0,0,94]
[null,95,0,0,0,0,0,0,0,0,0,0,0,0,0,0,0,0,0,0,0,0,0,0,0,0,0,0,0,0,0,0,0,0,0,0,0,0,0,0,0,0,0,0,0,0,0,0,0,0,0,0,0,0,0,0,0,0,0,0,0,0,0,0,0,0,95]
[null,96,0,0,0,0,0,0,0,0,0,0,0,0,0,0,0,0,0,0,0,0,0,0,0,0,0,0,0,0,0,0,0,0,0,0,0,0,0,0,0,0,0,0,0,0,0,0,0,0,0,0,0,0,0,0,0,0,0,0,0,0,0,0,0,0,96]
[null,"IFD",0,0,0,0,1,1,1,1,2,2,2,2,3,3,3,3,4,4,4,4,5,5,5,5,6,6,6,6,7,7,7,7,8,8,8,8,9,9,9,9,10,10,10,10,11,11,11,11,12,12,12,12,13,13,13,13,14,14,14,14,15,15,15,15]
[null,"ODF",0,1,2,3,0,1,2,3,0,1,2,3,0,1,2,3,0,1,2,3,0,1,2,3,0,1,2,3,0,1,2,3,0,1,2,3,0,1,2,3,0,1,2,3,0,1,2,3,0,1,2,3,0,1,2,3,0,1,2,3,0,1,2,3]
[]
[null,null,{"$f":"IF(ISNUMBER(VLOOKUP(-1,C32:$BO$96,68-COLUMN(),0)),VLOOKUP(-1,C32:$BO$96,68-COLUMN(),0),\"-\")","v":"-"},{"$f":"IF(ISNUMBER(VLOOKUP(-1,D32:$BO$96,68-COLUMN(),0)),VLOOKUP(-1,D32:$BO$96,68-COLUMN(),0),\"-\")","v":"-"},{"$f":"IF(ISNUMBER(VLOOKUP(-1,E32:$BO$96,68-COLUMN(),0)),VLOOKUP(-1,E32:$BO$96,68-COLUMN(),0),\"-\")","v":"-"},{"$f":"IF(ISNUMBER(VLOOKUP(-1,F32:$BO$96,68-COLUMN(),0)),VLOOKUP(-1,F32:$BO$96,68-COLUMN(),0),\"-\")","v":"-"},{"$f":"IF(ISNUMBER(VLOOKUP(-1,G32:$BO$96,68-COLUMN(),0)),VLOOKUP(-1,G32:$BO$96,68-COLUMN(),0),\"-\")","v":"-"},{"$f":"IF(ISNUMBER(VLOOKUP(-1,H32:$BO$96,68-COLUMN(),0)),VLOOKUP(-1,H32:$BO$96,68-COLUMN(),0),\"-\")","v":"-"},{"$f":"IF(ISNUMBER(VLOOKUP(-1,I32:$BO$96,68-COLUMN(),0)),VLOOKUP(-1,I32:$BO$96,68-COLUMN(),0),\"-\")","v":60},{"$f":"IF(ISNUMBER(VLOOKUP(-1,J32:$BO$96,68-COLUMN(),0)),VLOOKUP(-1,J32:$BO$96,68-COLUMN(),0),\"-\")","v":"-"},{"$f":"IF(ISNUMBER(VLOOKUP(-1,K32:$BO$96,68-COLUMN(),0)),VLOOKUP(-1,K32:$BO$96,68-COLUMN(),0),\"-\")","v":"-"},{"$f":"IF(ISNUMBER(VLOOKUP(-1,L32:$BO$96,68-COLUMN(),0)),VLOOKUP(-1,L32:$BO$96,68-COLUMN(),0),\"-\")","v":"-"},{"$f":"IF(ISNUMBER(VLOOKUP(-1,M32:$BO$96,68-COLUMN(),0)),VLOOKUP(-1,M32:$BO$96,68-COLUMN(),0),\"-\")","v":90},{"$f":"IF(ISNUMBER(VLOOKUP(-1,N32:$BO$96,68-COLUMN(),0)),VLOOKUP(-1,N32:$BO$96,68-COLUMN(),0),\"-\")","v":"-"},{"$f":"IF(ISNUMBER(VLOOKUP(-1,O32:$BO$96,68-COLUMN(),0)),VLOOKUP(-1,O32:$BO$96,68-COLUMN(),0),\"-\")","v":"-"},{"$f":"IF(ISNUMBER(VLOOKUP(-1,P32:$BO$96,68-COLUMN(),0)),VLOOKUP(-1,P32:$BO$96,68-COLUMN(),0),\"-\")","v":"-"},{"$f":"IF(ISNUMBER(VLOOKUP(-1,Q32:$BO$96,68-COLUMN(),0)),VLOOKUP(-1,Q32:$BO$96,68-COLUMN(),0),\"-\")","v":"-"},{"$f":"IF(ISNUMBER(VLOOKUP(-1,R32:$BO$96,68-COLUMN(),0)),VLOOKUP(-1,R32:$BO$96,68-COLUMN(),0),\"-\")","v":"-"},{"$f":"IF(ISNUMBER(VLOOKUP(-1,S32:$BO$96,68-COLUMN(),0)),VLOOKUP(-1,S32:$BO$96,68-COLUMN(),0),\"-\")","v":"-"},{"$f":"IF(ISNUMBER(VLOOKUP(-1,T32:$BO$96,68-COLUMN(),0)),VLOOKUP(-1,T32:$BO$96,68-COLUMN(),0),\"-\")","v":"-"},{"$f":"IF(ISNUMBER(VLOOKUP(-1,U32:$BO$96,68-COLUMN(),0)),VLOOKUP(-1,U32:$BO$96,68-COLUMN(),0),\"-\")","v":"-"},{"$f":"IF(ISNUMBER(VLOOKUP(-1,V32:$BO$96,68-COLUMN(),0)),VLOOKUP(-1,V32:$BO$96,68-COLUMN(),0),\"-\")","v":"-"},{"$f":"IF(ISNUMBER(VLOOKUP(-1,W32:$BO$96,68-COLUMN(),0)),VLOOKUP(-1,W32:$BO$96,68-COLUMN(),0),\"-\")","v":"-"},{"$f":"IF(ISNUMBER(VLOOKUP(-1,X32:$BO$96,68-COLUMN(),0)),VLOOKUP(-1,X32:$BO$96,68-COLUMN(),0),\"-\")","v":"-"},{"$f":"IF(ISNUMBER(VLOOKUP(-1,Y32:$BO$96,68-COLUMN(),0)),VLOOKUP(-1,Y32:$BO$96,68-COLUMN(),0),\"-\")","v":"-"},{"$f":"IF(ISNUMBER(VLOOKUP(-1,Z32:$BO$96,68-COLUMN(),0)),VLOOKUP(-1,Z32:$BO$96,68-COLUMN(),0),\"-\")","v":"-"},{"$f":"IF(ISNUMBER(VLOOKUP(-1,AA32:$BO$96,68-COLUMN(),0)),VLOOKUP(-1,AA32:$BO$96,68-COLUMN(),0),\"-\")","v":"-"},{"$f":"IF(ISNUMBER(VLOOKUP(-1,AB32:$BO$96,68-COLUMN(),0)),VLOOKUP(-1,AB32:$BO$96,68-COLUMN(),0),\"-\")","v":"-"},{"$f":"IF(ISNUMBER(VLOOKUP(-1,AC32:$BO$96,68-COLUMN(),0)),VLOOKUP(-1,AC32:$BO$96,68-COLUMN(),0),\"-\")","v":"-"},{"$f":"IF(ISNUMBER(VLOOKUP(-1,AD32:$BO$96,68-COLUMN(),0)),VLOOKUP(-1,AD32:$BO$96,68-COLUMN(),0),\"-\")","v":"-"},{"$f":"IF(ISNUMBER(VLOOKUP(-1,AE32:$BO$96,68-COLUMN(),0)),VLOOKUP(-1,AE32:$BO$96,68-COLUMN(),0),\"-\")","v":"-"},{"$f":"IF(ISNUMBER(VLOOKUP(-1,AF32:$BO$96,68-COLUMN(),0)),VLOOKUP(-1,AF32:$BO$96,68-COLUMN(),0),\"-\")","v":"-"},{"$f":"IF(ISNUMBER(VLOOKUP(-1,AG32:$BO$96,68-COLUMN(),0)),VLOOKUP(-1,AG32:$BO$96,68-COLUMN(),0),\"-\")","v":"-"},{"$f":"IF(ISNUMBER(VLOOKUP(-1,AH32:$BO$96,68-COLUMN(),0)),VLOOKUP(-1,AH32:$BO$96,68-COLUMN(),0),\"-\")","v":"-"},{"$f":"IF(ISNUMBER(VLOOKUP(-1,AI32:$BO$96,68-COLUMN(),0)),VLOOKUP(-1,AI32:$BO$96,68-COLUMN(),0),\"-\")","v":"-"},{"$f":"IF(ISNUMBER(VLOOKUP(-1,AJ32:$BO$96,68-COLUMN(),0)),VLOOKUP(-1,AJ32:$BO$96,68-COLUMN(),0),\"-\")","v":"-"},{"$f":"IF(ISNUMBER(VLOOKUP(-1,AK32:$BO$96,68-COLUMN(),0)),VLOOKUP(-1,AK32:$BO$96,68-COLUMN(),0),\"-\")","v":"-"},{"$f":"IF(ISNUMBER(VLOOKUP(-1,AL32:$BO$96,68-COLUMN(),0)),VLOOKUP(-1,AL32:$BO$96,68-COLUMN(),0),\"-\")","v":"-"},{"$f":"IF(ISNUMBER(VLOOKUP(-1,AM32:$BO$96,68-COLUMN(),0)),VLOOKUP(-1,AM32:$BO$96,68-COLUMN(),0),\"-\")","v":"-"},{"$f":"IF(ISNUMBER(VLOOKUP(-1,AN32:$BO$96,68-COLUMN(),0)),VLOOKUP(-1,AN32:$BO$96,68-COLUMN(),0),\"-\")","v":"-"},{"$f":"IF(ISNUMBER(VLOOKUP(-1,AO32:$BO$96,68-COLUMN(),0)),VLOOKUP(-1,AO32:$BO$96,68-COLUMN(),0),\"-\")","v":"-"},{"$f":"IF(ISNUMBER(VLOOKUP(-1,AP32:$BO$96,68-COLUMN(),0)),VLOOKUP(-1,AP32:$BO$96,68-COLUMN(),0),\"-\")","v":"-"},{"$f":"IF(ISNUMBER(VLOOKUP(-1,AQ32:$BO$96,68-COLUMN(),0)),VLOOKUP(-1,AQ32:$BO$96,68-COLUMN(),0),\"-\")","v":"-"},{"$f":"IF(ISNUMBER(VLOOKUP(-1,AR32:$BO$96,68-COLUMN(),0)),VLOOKUP(-1,AR32:$BO$96,68-COLUMN(),0),\"-\")","v":"-"},{"$f":"IF(ISNUMBER(VLOOKUP(-1,AS32:$BO$96,68-COLUMN(),0)),VLOOKUP(-1,AS32:$BO$96,68-COLUMN(),0),\"-\")","v":"-"},{"$f":"IF(ISNUMBER(VLOOKUP(-1,AT32:$BO$96,68-COLUMN(),0)),VLOOKUP(-1,AT32:$BO$96,68-COLUMN(),0),\"-\")","v":"-"},{"$f":"IF(ISNUMBER(VLOOKUP(-1,AU32:$BO$96,68-COLUMN(),0)),VLOOKUP(-1,AU32:$BO$96,68-COLUMN(),0),\"-\")","v":"-"},{"$f":"IF(ISNUMBER(VLOOKUP(-1,AV32:$BO$96,68-COLUMN(),0)),VLOOKUP(-1,AV32:$BO$96,68-COLUMN(),0),\"-\")","v":"-"},{"$f":"IF(ISNUMBER(VLOOKUP(-1,AW32:$BO$96,68-COLUMN(),0)),VLOOKUP(-1,AW32:$BO$96,68-COLUMN(),0),\"-\")","v":"-"},{"$f":"IF(ISNUMBER(VLOOKUP(-1,AX32:$BO$96,68-COLUMN(),0)),VLOOKUP(-1,AX32:$BO$96,68-COLUMN(),0),\"-\")","v":"-"},{"$f":"IF(ISNUMBER(VLOOKUP(-1,AY32:$BO$96,68-COLUMN(),0)),VLOOKUP(-1,AY32:$BO$96,68-COLUMN(),0),\"-\")","v":"-"},{"$f":"IF(ISNUMBER(VLOOKUP(-1,AZ32:$BO$96,68-COLUMN(),0)),VLOOKUP(-1,AZ32:$BO$96,68-COLUMN(),0),\"-\")","v":"-"},{"$f":"IF(ISNUMBER(VLOOKUP(-1,BA32:$BO$96,68-COLUMN(),0)),VLOOKUP(-1,BA32:$BO$96,68-COLUMN(),0),\"-\")","v":"-"},{"$f":"IF(ISNUMBER(VLOOKUP(-1,BB32:$BO$96,68-COLUMN(),0)),VLOOKUP(-1,BB32:$BO$96,68-COLUMN(),0),\"-\")","v":"-"},{"$f":"IF(ISNUMBER(VLOOKUP(-1,BC32:$BO$96,68-COLUMN(),0)),VLOOKUP(-1,BC32:$BO$96,68-COLUMN(),0),\"-\")","v":"-"},{"$f":"IF(ISNUMBER(VLOOKUP(-1,BD32:$BO$96,68-COLUMN(),0)),VLOOKUP(-1,BD32:$BO$96,68-COLUMN(),0),\"-\")","v":"-"},{"$f":"IF(ISNUMBER(VLOOKUP(-1,BE32:$BO$96,68-COLUMN(),0)),VLOOKUP(-1,BE32:$BO$96,68-COLUMN(),0),\"-\")","v":"-"},{"$f":"IF(ISNUMBER(VLOOKUP(-1,BF32:$BO$96,68-COLUMN(),0)),VLOOKUP(-1,BF32:$BO$96,68-COLUMN(),0),\"-\")","v":"-"},{"$f":"IF(ISNUMBER(VLOOKUP(-1,BG32:$BO$96,68-COLUMN(),0)),VLOOKUP(-1,BG32:$BO$96,68-COLUMN(),0),\"-\")","v":"-"},{"$f":"IF(ISNUMBER(VLOOKUP(-1,BH32:$BO$96,68-COLUMN(),0)),VLOOKUP(-1,BH32:$BO$96,68-COLUMN(),0),\"-\")","v":"-"},{"$f":"IF(ISNUMBER(VLOOKUP(-1,BI32:$BO$96,68-COLUMN(),0)),VLOOKUP(-1,BI32:$BO$96,68-COLUMN(),0),\"-\")","v":"-"},{"$f":"IF(ISNUMBER(VLOOKUP(-1,BJ32:$BO$96,68-COLUMN(),0)),VLOOKUP(-1,BJ32:$BO$96,68-COLUMN(),0),\"-\")","v":"-"},{"$f":"IF(ISNUMBER(VLOOKUP(-1,BK32:$BO$96,68-COLUMN(),0)),VLOOKUP(-1,BK32:$BO$96,68-COLUMN(),0),\"-\")","v":"-"},{"$f":"IF(ISNUMBER(VLOOKUP(-1,BL32:$BO$96,68-COLUMN(),0)),VLOOKUP(-1,BL32:$BO$96,68-COLUMN(),0),\"-\")","v":"-"},{"$f":"IF(ISNUMBER(VLOOKUP(-1,BM32:$BO$96,68-COLUMN(),0)),VLOOKUP(-1,BM32:$BO$96,68-COLUMN(),0),\"-\")","v":"-"},{"$f":"IF(ISNUMBER(VLOOKUP(-1,BN32:$BO$96,68-COLUMN(),0)),VLOOKUP(-1,BN32:$BO$96,68-COLUMN(),0),\"-\")","v":"-"},97,98,99,100,101,102,103,104,105,106,107,108]
[null,null,{"$f":"IF(ISNUMBER(C100),C97,\"-\")","v":"-"},{"$f":"IF(ISNUMBER(D100),D97,\"-\")","v":"-"},"-","-","-","-",1,"-","-","-",2,"-","-","-","-","-","-","-","-","-","-","-","-","-","-","-","-","-","-","-","-","-","-","-","-","-","-","-","-","-","-","-","-","-","-","-","-","-","-","-","-","-","-","-","-","-","-","-","-","-","-","-","-","-",0,0,0,0,0,0,0,0,0,0,0,0]
[null,null,{"$f":"IF(ISNUMBER(C100),C98,\"-\")","v":"-"},{"$f":"IF(ISNUMBER(D100),D98,\"-\")","v":"-"},"-","-","-","-",2,"-","-","-",2,"-","-","-","-","-","-","-","-","-","-","-","-","-","-","-","-","-","-","-","-","-","-","-","-","-","-","-","-","-","-","-","-","-","-","-","-","-","-","-","-","-","-","-","-","-","-","-","-","-","-","-","-","-",0,0,0,0,0,0,0,0,0,0,0,0]
[]
[null,null,"NDIV","IDF","ODF"]
[{"$f":"IF(C105=C104,A104+MATCH(C105,INDEX($C$100:$BN$100,1,A104+1):$BN$100,0),MATCH(C105,$C$100:$BN$100,0))","v":7},null,{"$f":"SMALL(IF(ISNUMBER($C$100:$BN$100),$C$100:$BN$100,\"\"),ROWS($C$105:C105))","v":60},{"$f":"INDEX($C$101:$BN$101,1,A105)","v":1},{"$f":"INDEX($C$102:$BN$102,1,A105)","v":2}]
[{"$f":"IF(C106=C105,A105+MATCH(C106,INDEX($C$100:$BN$100,1,A105+1):$BN$100,0),MATCH(C106,$C$100:$BN$100,0))","v":11},null,{"$f":"SMALL(IF(ISNUMBER($C$100:$BN$100),$C$100:$BN$100,\"\"),ROWS($C$105:C106))","v":90},2,2]
[{"$f":"IF(C107=C106,A106+MATCH(C107,INDEX($C$100:$BN$100,1,A106+1):$BN$100,0),MATCH(C107,$C$100:$BN$100,0))","v":{"$error":"#NUM!"}},null,{"$f":"SMALL(IF(ISNUMBER($C$100:$BN$100),$C$100:$BN$100,\"\"),ROWS($C$105:C107))","v":{"$error":"#NUM!"}},{"$error":"#NUM!"},{"$error":"#NUM!"}]
[{"$f":"IF(C108=C107,A107+MATCH(C108,INDEX($C$100:$BN$100,1,A107+1):$BN$100,0),MATCH(C108,$C$100:$BN$100,0))","v":{"$error":"#NUM!"}},null,{"$f":"SMALL(IF(ISNUMBER($C$100:$BN$100),$C$100:$BN$100,\"\"),ROWS($C$105:C108))","v":{"$error":"#NUM!"}},{"$error":"#NUM!"},{"$error":"#NUM!"}]
[{"$f":"IF(C109=C108,A108+MATCH(C109,INDEX($C$100:$BN$100,1,A108+1):$BN$100,0),MATCH(C109,$C$100:$BN$100,0))","v":{"$error":"#NUM!"}},null,{"$f":"SMALL(IF(ISNUMBER($C$100:$BN$100),$C$100:$BN$100,\"\"),ROWS($C$105:C109))","v":{"$error":"#NUM!"}},{"$error":"#NUM!"},{"$error":"#NUM!"}]
[{"$f":"IF(C110=C109,A109+MATCH(C110,INDEX($C$100:$BN$100,1,A109+1):$BN$100,0),MATCH(C110,$C$100:$BN$100,0))","v":{"$error":"#NUM!"}},null,{"$f":"SMALL(IF(ISNUMBER($C$100:$BN$100),$C$100:$BN$100,\"\"),ROWS($C$105:C110))","v":{"$error":"#NUM!"}},{"$error":"#NUM!"},{"$error":"#NUM!"}]
[{"$f":"IF(C111=C110,A110+MATCH(C111,INDEX($C$100:$BN$100,1,A110+1):$BN$100,0),MATCH(C111,$C$100:$BN$100,0))","v":{"$error":"#NUM!"}},null,{"$f":"SMALL(IF(ISNUMBER($C$100:$BN$100),$C$100:$BN$100,\"\"),ROWS($C$105:C111))","v":{"$error":"#NUM!"}},{"$error":"#NUM!"},{"$error":"#NUM!"}]
[{"$f":"IF(C112=C111,A111+MATCH(C112,INDEX($C$100:$BN$100,1,A111+1):$BN$100,0),MATCH(C112,$C$100:$BN$100,0))","v":{"$error":"#NUM!"}},null,{"$f":"SMALL(IF(ISNUMBER($C$100:$BN$100),$C$100:$BN$100,\"\"),ROWS($C$105:C112))","v":{"$error":"#NUM!"}},{"$error":"#NUM!"},{"$error":"#NUM!"}]
[{"$f":"IF(C113=C112,A112+MATCH(C113,INDEX($C$100:$BN$100,1,A112+1):$BN$100,0),MATCH(C113,$C$100:$BN$100,0))","v":{"$error":"#NUM!"}},null,{"$f":"SMALL(IF(ISNUMBER($C$100:$BN$100),$C$100:$BN$100,\"\"),ROWS($C$105:C113))","v":{"$error":"#NUM!"}},{"$error":"#NUM!"},{"$error":"#NUM!"}]
[{"$f":"IF(C114=C113,A113+MATCH(C114,INDEX($C$100:$BN$100,1,A113+1):$BN$100,0),MATCH(C114,$C$100:$BN$100,0))","v":{"$error":"#NUM!"}},null,{"$f":"SMALL(IF(ISNUMBER($C$100:$BN$100),$C$100:$BN$100,\"\"),ROWS($C$105:C114))","v":{"$error":"#NUM!"}},{"$error":"#NUM!"},{"$error":"#NUM!"}]
[{"$f":"IF(C115=C114,A114+MATCH(C115,INDEX($C$100:$BN$100,1,A114+1):$BN$100,0),MATCH(C115,$C$100:$BN$100,0))","v":{"$error":"#NUM!"}},null,{"$f":"SMALL(IF(ISNUMBER($C$100:$BN$100),$C$100:$BN$100,\"\"),ROWS($C$105:C115))","v":{"$error":"#NUM!"}},{"$error":"#NUM!"},{"$error":"#NUM!"}]
[{"$f":"IF(C116=C115,A115+MATCH(C116,INDEX($C$100:$BN$100,1,A115+1):$BN$100,0),MATCH(C116,$C$100:$BN$100,0))","v":{"$error":"#NUM!"}},null,{"$f":"SMALL(IF(ISNUMBER($C$100:$BN$100),$C$100:$BN$100,\"\"),ROWS($C$105:C116))","v":{"$error":"#NUM!"}},{"$error":"#NUM!"},{"$error":"#NUM!"}]
[{"$f":"IF(C117=C116,A116+MATCH(C117,INDEX($C$100:$BN$100,1,A116+1):$BN$100,0),MATCH(C117,$C$100:$BN$100,0))","v":{"$error":"#NUM!"}},null,{"$f":"SMALL(IF(ISNUMBER($C$100:$BN$100),$C$100:$BN$100,\"\"),ROWS($C$105:C117))","v":{"$error":"#NUM!"}},{"$f":"INDEX($C$101:$BN$101,1,A117)","v":{"$error":"#NUM!"}},{"$f":"INDEX($C$102:$BN$102,1,A117)","v":{"$error":"#NUM!"}}]
[{"$f":"IF(C118=C117,A117+MATCH(C118,INDEX($C$100:$BN$100,1,A117+1):$BN$100,0),MATCH(C118,$C$100:$BN$100,0))","v":{"$error":"#NUM!"}},null,{"$f":"SMALL(IF(ISNUMBER($C$100:$BN$100),$C$100:$BN$100,\"\"),ROWS($C$105:C118))","v":{"$error":"#NUM!"}},{"$error":"#NUM!"},{"$error":"#NUM!"}]
[{"$f":"IF(C119=C118,A118+MATCH(C119,INDEX($C$100:$BN$100,1,A118+1):$BN$100,0),MATCH(C119,$C$100:$BN$100,0))","v":{"$error":"#NUM!"}},null,{"$f":"SMALL(IF(ISNUMBER($C$100:$BN$100),$C$100:$BN$100,\"\"),ROWS($C$105:C119))","v":{"$error":"#NUM!"}},{"$error":"#NUM!"},{"$error":"#NUM!"}]
[{"$f":"IF(C120=C119,A119+MATCH(C120,INDEX($C$100:$BN$100,1,A119+1):$BN$100,0),MATCH(C120,$C$100:$BN$100,0))","v":{"$error":"#NUM!"}},null,{"$f":"SMALL(IF(ISNUMBER($C$100:$BN$100),$C$100:$BN$100,\"\"),ROWS($C$105:C120))","v":{"$error":"#NUM!"}},{"$error":"#NUM!"},{"$error":"#NUM!"}]
[]
[]
[null,"selected variant",null,{"$f":"PLL!C10","v":1}]
[]
[]
[null,{"$f":"\"/* Enter RUN0 with PLL as sys clk (\"&$C$3&\" MHz) with \"&$C$2&\" MHz crystal reference. */\"","v":"/* Enter RUN0 with PLL as sys clk (60 MHz) with 16 MHz crystal reference. */"},null,null,null,null,null,null,null,{"$f":"\"/* Enter RUN0 with PLL as sys clk (\"&$C$3&\" MHz) with \"&$C$2&\" MHz crystal reference. */\"","v":"/* Enter RUN0 with PLL as sys clk (60 MHz) with 16 MHz crystal reference. */"},null,null,null,null,null,null,null,{"$f":"\"/* Enter RUN0 with PLL as sys clk (\"&$C$3/2&\" MHz) with \"&$C$2&\" MHz crystal reference. */\"","v":"/* Enter RUN0 with PLL as sys clk (30 MHz) with 16 MHz crystal reference. */"},null,null,null,null,null,null,{"$f":"\"/* Enter RUN0 with PLL as sys clk (\"&$C$3&\" MHz) with \"&$C$2&\" MHz crystal reference. */\"","v":"/* Enter RUN0 with PLL as sys clk (60 MHz) with 16 MHz crystal reference. */"}]
[null,{"$f":"\"void InitModesAndClks(void) {\"","v":"void InitModesAndClks(void) {"},null,null,null,null,null,null,null,{"$f":"\"void InitModesAndClks(void) {\"","v":"void InitModesAndClks(void) {"},null,null,null,null,null,null,null,{"$f":"\"void InitModesAndClks(void) {\"","v":"void InitModesAndClks(void) {"},null,null,null,null,null,null,{"$f":"\"void InitModesAndClks(void) {\"","v":"void InitModesAndClks(void) {"}]
[null,{"$f":"\"ME.MER.R = 0x0000001D;\"&CHAR(9)&CHAR(9)&\"/* Enable DRUN, RUN0, SAFE, RESET modes */\"","v":"ME.MER.R = 0x0000001D;\t\t/* Enable DRUN, RUN0, SAFE, RESET modes */"},null,null,null,null,null,null,null,{"$f":"\"ME.MER.R = 0x0000001D;\"&CHAR(9)&CHAR(9)&\"/* Enable DRUN, RUN0, SAFE, RESET modes */\"","v":"ME.MER.R = 0x0000001D;\t\t/* Enable DRUN, RUN0, SAFE, RESET modes */"},null,null,null,null,null,null,null,{"$f":"\"ME.MER.R = 0x0000001D;\"&CHAR(9)&CHAR(9)&\"/* Enable DRUN, RUN0, SAFE, RESET modes */\"","v":"ME.MER.R = 0x0000001D;\t\t/* Enable DRUN, RUN0, SAFE, RESET modes */"},null,null,null,null,null,null,{"$f":"\"ME.MER.R = 0x0000001D;\"&CHAR(9)&CHAR(9)&\"/* Enable DRUN, RUN0, SAFE, RESET modes */\"","v":"ME.MER.R = 0x0000001D;\t\t/* Enable DRUN, RUN0, SAFE, RESET modes */"}]
[null,{"$f":"\"CGM.FMPLL_CR.R = \"&INDEX($J$7:$J$18,$D$123,1)&\";\"&CHAR(9)&\"/* \"&$C$2&\"MHz xtal: Set PLL0 to \"&$C$3&\" MHz */\"","v":"CGM.FMPLL_CR.R = 0x063C0100;\t/* 16MHz xtal: Set PLL0 to 60 MHz */"},null,null,null,null,null,null,null,{"$f":"\"CGM.AC3SC.R = 0x01000000;\"&CHAR(9)&CHAR(9)&\"/* Select Xosc as PLL0 source clock */\"","v":"CGM.AC3SC.R = 0x01000000;\t\t/* Select Xosc as PLL0 source clock */"},null,null,null,null,null,null,null,{"$f":"\"CGM.FMPLL_CR.R = \"&INDEX($J$7:$J$18,$D$123,1)&\";\"&CHAR(9)&\"/* \"&$C$2&\"MHz xtal: Set PLL0 to \"&$C$3&\" MHz, fsys=PLL/2 */\"","v":"CGM.FMPLL_CR.R = 0x063C0100;\t/* 16MHz xtal: Set PLL0 to 60 MHz, fsys=PLL/2 */"},null,null,null,null,null,null,{"$f":"\"CGM.AC3SC.R = 0x01000000;\"&CHAR(9)&CHAR(9)&\"/* Select Xosc as PLL0 source clock */\"","v":"CGM.AC3SC.R = 0x01000000;\t\t/* Select Xosc as PLL0 source clock */"}]
[null,{"$f":"\"ME.RUNPC[0].R = 0x000000FE;\"&CHAR(9)&CHAR(9)&\"/* enable peripherals run in all modes */\"","v":"ME.RUNPC[0].R = 0x000000FE;\t\t/* enable peripherals run in all modes */"},null,null,null,null,null,null,null,{"$f":"\"CGM.FMPLL_CR.R = \"&INDEX($J$7:$J$18,$D$123,1)&\";\"&CHAR(9)&\"/* \"&$C$2&\"MHz xtal: Set PLL0 to \"&$C$3&\" MHz */\"","v":"CGM.FMPLL_CR.R = 0x063C0100;\t/* 16MHz xtal: Set PLL0 to 60 MHz */"},null,null,null,null,null,null,null,{"$f":"\"ME.RUNPC[0].R = 0x000000FE;\"&CHAR(9)&CHAR(9)&\"/* enable peripherals run in all modes */\"","v":"ME.RUNPC[0].R = 0x000000FE;\t\t/* enable peripherals run in all modes */"},null,null,null,null,null,null,{"$f":"\"CGM.FMPLL_CR.R = \"&INDEX($J$7:$J$18,$D$123,1)&\";\"&CHAR(9)&\"/* \"&$C$2&\"MHz xtal: Set PLL0 to \"&$C$3&\" MHz */\"","v":"CGM.FMPLL_CR.R = 0x063C0100;\t/* 16MHz xtal: Set PLL0 to 60 MHz */"}]
[null,{"$f":"\"ME.RUN[0].R = 0x001F0074;\"&CHAR(9)&CHAR(9)&\"/* RUN0 cfg: IRCON,OSC0ON,PLL0ON,syclk=PLL */\"","v":"ME.RUN[0].R = 0x001F0074;\t\t/* RUN0 cfg: IRCON,OSC0ON,PLL0ON,syclk=PLL */"},null,null,null,null,null,null,null,{"$f":"\"ME.RUNPC[0].R = 0x000000FE;\"&CHAR(9)&CHAR(9)&\"/* enable peripherals run in all modes */\"","v":"ME.RUNPC[0].R = 0x000000FE;\t\t/* enable peripherals run in all modes */"},null,null,null,null,null,null,null,{"$f":"\"ME.RUN[0].R = 0x001F0074;\"&CHAR(9)&CHAR(9)&\"/* RUN0 cfg: IRCON,OSC0ON,PLL0ON,syclk=PLL */\"","v":"ME.RUN[0].R = 0x001F0074;\t\t/* RUN0 cfg: IRCON,OSC0ON,PLL0ON,syclk=PLL */"},null,null,null,null,null,null,{"$f":"\"ME.RUNPC[0].R = 0x000000FE;\"&CHAR(9)&CHAR(9)&\"/* enable peripherals run in all modes */\"","v":"ME.RUNPC[0].R = 0x000000FE;\t\t/* enable peripherals run in all modes */"}]
[null,{"$f":"\"/* Mode Transition to enter RUN0 mode: */\"","v":"/* Mode Transition to enter RUN0 mode: */"},null,null,null,null,null,null,null,{"$f":"\"ME.RUN[0].R = 0x001F0074;\"&CHAR(9)&CHAR(9)&\"/* RUN0 cfg: IRCON,OSC0ON,PLL0ON,syclk=PLL */\"","v":"ME.RUN[0].R = 0x001F0074;\t\t/* RUN0 cfg: IRCON,OSC0ON,PLL0ON,syclk=PLL */"},null,null,null,null,null,null,null,{"$f":"\"/* Mode Transition to enter RUN0 mode: */\"","v":"/* Mode Transition to enter RUN0 mode: */"},null,null,null,null,null,null,{"$f":"\"ME.RUN[0].R = 0x001F0074;\"&CHAR(9)&CHAR(9)&\"/* RUN0 cfg: IRCON,OSC0ON,PLL0ON,syclk=PLL */\"","v":"ME.RUN[0].R = 0x001F0074;\t\t/* RUN0 cfg: IRCON,OSC0ON,PLL0ON,syclk=PLL */"}]
[null,{"$f":"\"ME.MCTL.R = 0x40005AF0;\"&CHAR(9)&CHAR(9)&\"/* Enter RUN0 Mode & Key */\"","v":"ME.MCTL.R = 0x40005AF0;\t\t/* Enter RUN0 Mode & Key */"},null,null,null,null,null,null,null,{"$f":"\"/* Mode Transition to enter RUN0 mode: */\"","v":"/* Mode Transition to enter RUN0 mode: */"},null,null,null,null,null,null,null,{"$f":"\"ME.MCTL.R = 0x40005AF0;\"&CHAR(9)&CHAR(9)&\"/* Enter RUN0 Mode & Key */\"","v":"ME.MCTL.R = 0x40005AF0;\t\t/* Enter RUN0 Mode & Key */"},null,null,null,null,null,null,{"$f":"\"CGM.SC_DC0.R = 0x80810000;\"&CHAR(9)&CHAR(9)&\"/* peri set 0 divide by 1, per set1 divide by 2 */\"","v":"CGM.SC_DC0.R = 0x80810000;\t\t/* peri set 0 divide by 1, per set1 divide by 2 */"}]
[null,{"$f":"\"ME.MCTL.R = 0x4000A50F;\"&CHAR(9)&CHAR(9)&\"/* Enter RUN0 Mode & Inverted Key */\"","v":"ME.MCTL.R = 0x4000A50F;\t\t/* Enter RUN0 Mode & Inverted Key */"},null,null,null,null,null,null,null,{"$f":"\"ME.MCTL.R = 0x40005AF0;\"&CHAR(9)&CHAR(9)&\"/* Enter RUN0 Mode & Key */\"","v":"ME.MCTL.R = 0x40005AF0;\t\t/* Enter RUN0 Mode & Key */"},null,null,null,null,null,null,null,{"$f":"\"ME.MCTL.R = 0x4000A50F;\"&CHAR(9)&CHAR(9)&\"/* Enter RUN0 Mode & Inverted Key */\"","v":"ME.MCTL.R = 0x4000A50F;\t\t/* Enter RUN0 Mode & Inverted Key */"},null,null,null,null,null,null,{"$f":"\"/* Mode Transition to enter RUN0 mode: */\"","v":"/* Mode Transition to enter RUN0 mode: */"}]
[null,{"$f":"\"while (ME.GS.B.S_MTRANS) {};\"&CHAR(9)&CHAR(9)&\"/* Wait for mode transition to complete */\"","v":"while (ME.GS.B.S_MTRANS) {};\t\t/* Wait for mode transition to complete */"},null,null,null,null,null,null,null,{"$f":"\"ME.MCTL.R = 0x4000A50F;\"&CHAR(9)&CHAR(9)&\"/* Enter RUN0 Mode & Inverted Key */\"","v":"ME.MCTL.R = 0x4000A50F;\t\t/* Enter RUN0 Mode & Inverted Key */"},null,null,null,null,null,null,null,{"$f":"\"while (ME.GS.B.S_MTRANS) {};\"&CHAR(9)&CHAR(9)&\"/* Wait for mode transition to complete */\"","v":"while (ME.GS.B.S_MTRANS) {};\t\t/* Wait for mode transition to complete */"},null,null,null,null,null,null,{"$f":"\"ME.MCTL.R = 0x40005AF0;\"&CHAR(9)&CHAR(9)&\"/* Enter RUN0 Mode & Key */\"","v":"ME.MCTL.R = 0x40005AF0;\t\t/* Enter RUN0 Mode & Key */"}]
[null,{"$f":"\"while(ME.GS.B.S_CURRENTMODE != 4) {};\"&CHAR(9)&\"/* Verify RUN0 is the current mode */\"","v":"while(ME.GS.B.S_CURRENTMODE != 4) {};\t/* Verify RUN0 is the current mode */"},null,null,null,null,null,null,null,{"$f":"\"while (ME.GS.B.S_MTRANS) {};\"&CHAR(9)&CHAR(9)&\"/* Wait for mode transition to complete */\"","v":"while (ME.GS.B.S_MTRANS) {};\t\t/* Wait for mode transition to complete */"},null,null,null,null,null,null,null,{"$f":"\"while(ME.GS.B.S_CURRENTMODE != 4) {};\"&CHAR(9)&\"/* Verify RUN0 is the current mode */\"","v":"while(ME.GS.B.S_CURRENTMODE != 4) {};\t/* Verify RUN0 is the current mode */"},null,null,null,null,null,null,{"$f":"\"ME.MCTL.R = 0x4000A50F;\"&CHAR(9)&CHAR(9)&\"/* Enter RUN0 Mode & Inverted Key */\"","v":"ME.MCTL.R = 0x4000A50F;\t\t/* Enter RUN0 Mode & Inverted Key */"}]
[null,{"$f":"\"}\"","v":"}"},null,null,null,null,null,null,null,{"$f":"\"while(ME.GS.B.S_CURRENTMODE != 4) {};\"&CHAR(9)&\"/* Verify RUN0 is the current mode */\"","v":"while(ME.GS.B.S_CURRENTMODE != 4) {};\t/* Verify RUN0 is the current mode */"},null,null,null,null,null,null,null,{"$f":"\"}\"","v":"}"},null,null,null,null,null,null,{"$f":"\"while (ME.GS.B.S_MTRANS) {};\"&CHAR(9)&CHAR(9)&\"/* Wait for mode transition to complete */\"","v":"while (ME.GS.B.S_MTRANS) {};\t\t/* Wait for mode transition to complete */"}]
[null,{"$f":"\"\"","v":""},null,null,null,null,null,null,null,{"$f":"\"}\"","v":"}"},null,null,null,null,null,null,null,{"$f":"\"\"","v":""},null,null,null,null,null,null,{"$f":"\"while(ME.GS.B.S_CURRENTMODE != 4) {};\"&CHAR(9)&\"/* Verify RUN0 is the current mode */\"","v":"while(ME.GS.B.S_CURRENTMODE != 4) {};\t/* Verify RUN0 is the current mode */"}]
[null,{"$f":"\"\"","v":""},null,null,null,null,null,null,null,{"$f":"\"\"","v":""},null,null,null,null,null,null,null,{"$f":"\"\"","v":""},null,null,null,null,null,null,{"$f":"\"}\"","v":"}"}]
[null,{"$f":"\"\"","v":""},null,null,null,null,null,null,null,{"$f":"\"\"","v":""},null,null,null,null,null,null,null,{"$f":"\"\"","v":""},null,null,null,null,null,null,{"$f":"\"\"","v":""}]
[null,{"$f":"\"\"","v":""},null,null,null,null,null,null,null,{"$f":"\"\"","v":""},null,null,null,null,null,null,null,{"$f":"\"\"","v":""},null,null,null,null,null,null,{"$f":"\"\"","v":""}]
[null,{"$f":"\"\"","v":""},null,null,null,null,null,null,null,{"$f":"\"\"","v":""},null,null,null,null,null,null,null,{"$f":"\"\"","v":""},null,null,null,null,null,null,{"$f":"\"\"","v":""}]
[null,{"$f":"\"\"","v":""},null,null,null,null,null,null,null,{"$f":"\"\"","v":""},null,null,null,null,null,null,null,{"$f":"\"\"","v":""},null,null,null,null,null,null,{"$f":"\"\"","v":""}]
[null,{"$f":"\"\"","v":""},null,null,null,null,null,null,null,{"$f":"\"\"","v":""},null,null,null,null,null,null,null,{"$f":"\"\"","v":""},null,null,null,null,null,null,{"$f":"\"\"","v":""}]
[null,{"$f":"\"\"","v":""},null,null,null,null,null,null,null,{"$f":"\"\"","v":""},null,null,null,null,null,null,null,{"$f":"\"\"","v":""},null,null,null,null,null,null,{"$f":"\"\"","v":""}]
[null,{"$f":"\"\"","v":""},null,null,null,null,null,null,null,{"$f":"\"\"","v":""},null,null,null,null,null,null,null,{"$f":"\"\"","v":""},null,null,null,null,null,null,{"$f":"\"\"","v":""}]

{"sheet":"PLL_4","index":6,"n_rows":188,"n_cols":267,"rows_kept":188,"cut":false,"hidden":true,"merged":[[1,11,1,12],[2,21,3,21],[3,16,3,17],[1,4,1,5],[1,6,1,7],[1,8,1,9],[2,14,3,15],[2,16,2,17],[2,19,3,20]]}
[]
[null,"Fin",{"$f":"PLL!C5","v":16},null,"f_osc/xtal",null,"f_pll_in",null,"f_VCO/ICO",null,null,"code variant"]
[null,"Fsys",{"$f":"PLL!C6","v":60},null,"min","max","min","max","min","max",null,"col","row",null,"fsys = fin *",null,"EMFD + 16",null,null,"fvco = fsys *",null,"(ERFD+1)"]
[null,"Fmax",{"$f":"Devices!C7","v":80},null,{"$f":"Devices!G4","v":4},{"$f":"Devices!H4","v":20},{"$f":"Devices!I4","v":4},{"$f":"Devices!J4","v":16},{"$f":"Devices!K4","v":256},{"$f":"Devices!L4","v":512},null,{"$f":"INDEX(Devices!$R$14:$R$44,Devices!$C$1,1)","v":0},168,null,null,null,"(EPREDIV+1) * (ERFD+1)"]
[]
[" ","EMFD","EPREDIV","ERFD"," ","fPLLin","fVCO","fsys"," ","ESYNCR1","ESYNCR2"]
[{"$f":"IF(ISNUMBER(B7),1,\"\")","v":1},{"$f":"IF(ISNUMBER(C141),C141,\"\")","v":44},{"$f":"IF(ISNUMBER(C141),D141,\"\")","v":1},{"$f":"IF(ISNUMBER(C141),E141,\"\")","v":7}," ",{"$f":"IF(ISNUMBER(B7),$C$2/(C7+1),\"\")","v":8},{"$f":"IF(ISNUMBER(B7),$C$2/(C7+1)*(B7+16),\"\")","v":480},{"$f":"IF(ISNUMBER(B7),$C$2/(C7+1)*(B7+16)/(D7+1),\"\")","v":60}," ",{"$f":"IF(ISNUMBER(B7),\"0x\"&DEC2HEX(7*2^28+C7*2^16+B7,8),\"\")","v":"0x7001002C"},{"$f":"IF(ISNUMBER(B7),\"0x\"&DEC2HEX(D7,8),\"\")","v":"0x00000007"}]
[{"$f":"IF(ISNUMBER(B8),A7+1,\"\")","v":2},{"$f":"IF(ISNUMBER(C142),C142,\"\")","v":74},{"$f":"IF(ISNUMBER(C142),D142,\"\")","v":2},{"$f":"IF(ISNUMBER(C142),E142,\"\")","v":7}," ",{"$f":"IF(ISNUMBER(B8),$C$2/(C8+1),\"\")","v":5.333333333333333},{"$f":"IF(ISNUMBER(B8),$C$2/(C8+1)*(B8+16),\"\")","v":480},{"$f":"IF(ISNUMBER(B8),$C$2/(C8+1)*(B8+16)/(D8+1),\"\")","v":60}," ",{"$f":"IF(ISNUMBER(B8),\"0x\"&DEC2HEX(7*2^28+C8*2^16+B8,8),\"\")","v":"0x7002004A"},{"$f":"IF(ISNUMBER(B8),\"0x\"&DEC2HEX(D8,8),\"\")","v":"0x00000007"}]
[{"$f":"IF(ISNUMBER(B9),A8+1,\"\")","v":3},{"$f":"IF(ISNUMBER(C143),C143,\"\")","v":74},{"$f":"IF(ISNUMBER(C143),D143,\"\")","v":3},{"$f":"IF(ISNUMBER(C143),E143,\"\")","v":5}," ",{"$f":"IF(ISNUMBER(B9),$C$2/(C9+1),\"\")","v":4},{"$f":"IF(ISNUMBER(B9),$C$2/(C9+1)*(B9+16),\"\")","v":360},{"$f":"IF(ISNUMBER(B9),$C$2/(C9+1)*(B9+16)/(D9+1),\"\")","v":60}," ",{"$f":"IF(ISNUMBER(B9),\"0x\"&DEC2HEX(7*2^28+C9*2^16+B9,8),\"\")","v":"0x7003004A"},{"$f":"IF(ISNUMBER(B9),\"0x\"&DEC2HEX(D9,8),\"\")","v":"0x00000005"}]
[4,104,3,7," ",4,480,60," ","0x70030068","0x00000007"]
["","","",""," ","","",""," ","",""]
["","","",""," ","","",""," ","",""]
["","","",""," ","","",""," ","",""]
["","","",""," ","","",""," ","",""]
["","","",""," ","","",""," ","",""]
["","","",""," ","","",""," ","",""]
["","","",""," ","","",""," ","",""]
["","","",""," ","","",""," ","",""]
["","","",""," ","","",""," ","",""]
["","","",""," ","","",""," ","",""]
["","","",""," ","","",""," ","",""]
[{"$f":"IF(ISNUMBER(B22),A21+1,\"\")","v":""},{"$f":"IF(ISNUMBER(C156),C156,\"\")","v":""},{"$f":"IF(ISNUMBER(C156),D156,\"\")","v":""},{"$f":"IF(ISNUMBER(C156),E156,\"\")","v":""}," ",{"$f":"IF(ISNUMBER(B22),$C$2/(C22+1),\"\")","v":""},{"$f":"IF(ISNUMBER(B22),$C$2/(C22+1)*(B22+16),\"\")","v":""},{"$f":"IF(ISNUMBER(B22),$C$2/(C22+1)*(B22+16)/(D22+1),\"\")","v":""}," ",{"$f":"IF(ISNUMBER(B22),\"0x\"&DEC2HEX(7*2^28+C22*2^16+B22,8),\"\")","v":""},{"$f":"IF(ISNUMBER(B22),\"0x\"&DEC2HEX(D22,8),\"\")","v":""}]
["","","",""," ","","",""," ","",""]
["","","",""," ","","",""," ","",""]
["","","",""," ","","",""," ","",""]
[]
[]
[]
[]
[null,"EPREDIF",0,0,0,0,0,0,0,0,0,0,0,0,0,0,0,0,0,0,0,0,0,0,0,0,0,0,0,0,0,0,0,0,0,1,1,1,1,1,1,1,1,1,1,1,1,1,1,1,1,1,1,1,1,1,1,1,1,1,1,1,1,1,1,1,1,1,2,2,2,2,2,2,2,2,2,2,2,2,2,2,2,2,2,2,2,2,2,2,2,2,2,2,2,2,2,2,2,2,2,3,3,3,3,3,3,3,3,3,3,3,3,3,3,3,3,3,3,3,3,3,3,3,3,3,3,3,3,3,3,3,3,3,4,4,4,4,4,4,4,4,4,4,4,4,4,4,4,4,4,4,4,4,4,4,4,4,4,4,4,4,4,4,4,4,4,5,5,5,5,5,5,5,5,5,5,5,5,5,5,5,5,5,5,5,5,5,5,5,5,5,5,5,5,5,5,5,5,5,7,7,7,7,7,7,7,7,7,7,7,7,7,7,7,7,7,7,7,7,7,7,7,7,7,7,7,7,7,7,7,7,7,9,9,9,9,9,9,9,9,9,9,9,9,9,9,9,9,9,9,9,9,9,9,9,9,9,9,9,9,9,9,9,9,9]
[null,"ERFD",0,1,3,5,7,9,11,13,15,17,19,21,23,25,27,29,31,33,35,37,39,41,43,45,47,49,51,53,55,57,59,61,63,0,1,3,5,7,9,11,13,15,17,19,21,23,25,27,29,31,33,35,37,39,41,43,45,47,49,51,53,55,57,59,61,63,0,1,3,5,7,9,11,13,15,17,19,21,23,25,27,29,31,33,35,37,39,41,43,45,47,49,51,53,55,57,59,61,63,0,1,3,5,7,9,11,13,15,17,19,21,23,25,27,29,31,33,35,37,39,41,43,45,47,49,51,53,55,57,59,61,63,0,1,3,5,7,9,11,13,15,17,19,21,23,25,27,29,31,33,35,37,39,41,43,45,47,49,51,53,55,57,59,61,63,0,1,3,5,7,9,11,13,15,17,19,21,23,25,27,29,31,33,35,37,39,41,43,45,47,49,51,53,55,57,59,61,63,0,1,3,5,7,9,11,13,15,17,19,21,23,25,27,29,31,33,35,37,39,41,43,45,47,49,51,53,55,57,59,61,63,0,1,3,5,7,9,11,13,15,17,19,21,23,25,27,29,31,33,35,37,39,41,43,45,47,49,51,53,55,57,59,61,63]
["EMFD",32,{"$f":"IF(AND(($C$2/(C$30+1))>=$G$4,($C$2/(C$30+1))<=$H$4,($C$2/(C$30+1)*($B32+16))>=$I$4,($C$2/(C$30+1)*($B32+16))<=$J$4,($C$2/(C$30+1)*($B32+16)/(C$31+1))=$C$3,($C$2/(C$30+1)*($B32+16)/(C$31+1))<=$C$4),-1,0)","v":0},{"$f":"IF(AND(($C$2/(D$30+1))>=$G$4,($C$2/(D$30+1))<=$H$4,($C$2/(D$30+1)*($B32+16))>=$I$4,($C$2/(D$30+1)*($B32+16))<=$J$4,($C$2/(D$30+1)*($B32+16)/(D$31+1))=$C$3,($C$2/(D$30+1)*($B32+16)/(D$31+1))<=$C$4),-1,0)","v":0},0,0,0,0,0,0,0,0,0,0,0,0,0,0,0,0,0,0,0,0,0,0,0,0,0,0,0,0,0,0,0,0,0,0,0,0,0,0,0,0,0,0,0,0,0,0,0,0,0,0,0,0,0,0,0,0,0,0,0,0,0,0,0,{"$f":"IF(AND(($C$2/(BP$30+1))>=$G$4,($C$2/(BP$30+1))<=$H$4,($C$2/(BP$30+1)*($B32+16))>=$I$4,($C$2/(BP$30+1)*($B32+16))<=$J$4,($C$2/(BP$30+1)*($B32+16)/(BP$31+1))=$C$3,($C$2/(BP$30+1)*($B32+16)/(BP$31+1))<=$C$4),-1,0)","v":0},0,0,0,0,0,0,0,0,0,0,0,0,0,0,0,0,0,0,0,0,0,0,0,0,0,0,0,0,0,0,0,0,0,0,0,0,0,0,0,0,0,0,0,0,0,0,0,0,0,0,0,0,0,0,0,0,0,0,0,0,0,0,0,{"$f":"IF(AND(($C$2/(EB$30+1))>=$G$4,($C$2/(EB$30+1))<=$H$4,($C$2/(EB$30+1)*($B32+16))>=$I$4,($C$2/(EB$30+1)*($B32+16))<=$J$4,($C$2/(EB$30+1)*($B32+16)/(EB$31+1))=$C$3,($C$2/(EB$30+1)*($B32+16)/(EB$31+1))<=$C$4),-1,0)","v":0},0,0,0,0,0,0,0,0,0,0,0,0,0,0,0,0,0,0,0,0,0,0,0,0,0,0,0,0,0,0,0,0,0,0,0,0,0,0,0,0,0,0,0,0,0,0,0,0,0,0,0,0,0,0,0,0,0,0,0,0,0,0,0,{"$f":"IF(AND(($C$2/(GN$30+1))>=$G$4,($C$2/(GN$30+1))<=$H$4,($C$2/(GN$30+1)*($B32+16))>=$I$4,($C$2/(GN$30+1)*($B32+16))<=$J$4,($C$2/(GN$30+1)*($B32+16)/(GN$31+1))=$C$3,($C$2/(GN$30+1)*($B32+16)/(GN$31+1))<=$C$4),-1,0)","v":0},0,0,0,0,0,0,0,0,0,0,0,0,0,0,0,0,0,0,0,0,0,0,0,0,0,0,0,0,0,0,0,0,0,0,0,0,0,0,0,0,0,0,0,0,0,0,0,0,0,0,0,0,0,0,0,0,0,0,0,0,0,0,0,{"$f":"IF(AND(($C$2/(IZ$30+1))>=$G$4,($C$2/(IZ$30+1))<=$H$4,($C$2/(IZ$30+1)*($B32+16))>=$I$4,($C$2/(IZ$30+1)*($B32+16))<=$J$4,($C$2/(IZ$30+1)*($B32+16)/(IZ$31+1))=$C$3,($C$2/(IZ$30+1)*($B32+16)/(IZ$31+1))<=$C$4),-1,0)","v":0},0,0,0,0,0,0,32]
[null,33,{"$f":"IF(AND(($C$2/(C$30+1))>=$G$4,($C$2/(C$30+1))<=$H$4,($C$2/(C$30+1)*($B33+16))>=$I$4,($C$2/(C$30+1)*($B33+16))<=$J$4,($C$2/(C$30+1)*($B33+16)/(C$31+1))=$C$3,($C$2/(C$30+1)*($B33+16)/(C$31+1))<=$C$4),-1,0)","v":0},0,0,0,0,0,0,0,0,0,0,0,0,0,0,0,0,0,0,0,0,0,0,0,0,0,0,0,0,0,0,0,0,0,0,0,0,0,0,0,0,0,0,0,0,0,0,0,0,0,0,0,0,0,0,0,0,0,0,0,0,0,0,0,0,0,0,0,0,0,0,0,0,0,0,0,0,0,0,0,0,0,0,0,0,0,0,0,0,0,0,0,0,0,0,0,0,0,0,0,0,0,0,0,0,0,0,0,0,0,0,0,0,0,0,0,0,0,0,0,0,0,0,0,0,0,0,0,0,0,0,0,0,0,0,0,0,0,0,0,0,0,0,0,0,0,0,0,0,0,0,0,0,0,0,0,0,0,0,0,0,0,0,0,0,0,0,0,0,0,0,0,0,0,0,0,0,0,0,0,0,0,0,0,0,0,0,0,0,0,0,0,0,0,0,0,0,0,0,0,0,0,0,0,0,0,0,0,0,0,0,0,0,0,0,0,0,0,0,0,0,0,0,0,0,0,0,0,0,0,0,0,0,0,0,0,0,0,0,0,0,0,0,0,0,0,0,0,0,0,0,0,0,0,0,0,0,0,0,0,0,0,0,0,33]
[null,34,0,0,0,0,0,0,0,0,0,0,0,0,0,0,0,0,0,0,0,0,0,0,0,0,0,0,0,0,0,0,0,0,0,0,0,0,0,0,0,0,0,0,0,0,0,0,0,0,0,0,0,0,0,0,0,0,0,0,0,0,0,0,0,0,0,0,0,0,0,0,0,0,0,0,0,0,0,0,0,0,0,0,0,0,0,0,0,0,0,0,0,0,0,0,0,0,0,0,0,0,0,0,0,0,0,0,0,0,0,0,0,0,0,0,0,0,0,0,0,0,0,0,0,0,0,0,0,0,0,0,0,0,0,0,0,0,0,0,0,0,0,0,0,0,0,0,0,0,0,0,0,0,0,0,0,0,0,0,0,0,0,0,0,0,0,0,0,0,0,0,0,0,0,0,0,0,0,0,0,0,0,0,0,0,0,0,0,0,0,0,0,0,0,0,0,0,0,0,0,0,0,0,0,0,0,0,0,0,0,0,0,0,0,0,0,0,0,0,0,0,0,0,0,0,0,0,0,0,0,0,0,0,0,0,0,0,0,0,0,0,0,0,0,0,0,0,0,0,0,0,0,0,0,0,0,0,0,0,0,0,0,0,0,0,34]
[null,35,0,0,0,0,0,0,0,0,0,0,0,0,0,0,0,0,0,0,0,0,0,0,0,0,0,0,0,0,0,0,0,0,0,0,0,0,0,0,0,0,0,0,0,0,0,0,0,0,0,0,0,0,0,0,0,0,0,0,0,0,0,0,0,0,{"$f":"IF(AND(($C$2/(BO$30+1))>=$G$4,($C$2/(BO$30+1))<=$H$4,($C$2/(BO$30+1)*($B35+16))>=$I$4,($C$2/(BO$30+1)*($B35+16))<=$J$4,($C$2/(BO$30+1)*($B35+16)/(BO$31+1))=$C$3,($C$2/(BO$30+1)*($B35+16)/(BO$31+1))<=$C$4),-1,0)","v":0},0,0,0,0,0,0,0,0,0,0,0,0,0,0,0,0,0,0,0,0,0,0,0,0,0,0,0,0,0,0,0,0,0,0,0,0,0,0,0,0,0,0,0,0,0,0,0,0,0,0,0,0,0,0,0,0,0,0,0,0,0,0,0,{"$f":"IF(AND(($C$2/(EA$30+1))>=$G$4,($C$2/(EA$30+1))<=$H$4,($C$2/(EA$30+1)*($B35+16))>=$I$4,($C$2/(EA$30+1)*($B35+16))<=$J$4,($C$2/(EA$30+1)*($B35+16)/(EA$31+1))=$C$3,($C$2/(EA$30+1)*($B35+16)/(EA$31+1))<=$C$4),-1,0)","v":0},0,0,0,0,0,0,0,0,0,0,0,0,0,0,0,0,0,0,0,0,0,0,0,0,0,0,0,0,0,0,0,0,0,0,0,0,0,0,0,0,0,0,0,0,0,0,0,0,0,0,0,0,0,0,0,0,0,0,0,0,0,0,0,{"$f":"IF(AND(($C$2/(GM$30+1))>=$G$4,($C$2/(GM$30+1))<=$H$4,($C$2/(GM$30+1)*($B35+16))>=$I$4,($C$2/(GM$30+1)*($B35+16))<=$J$4,($C$2/(GM$30+1)*($B35+16)/(GM$31+1))=$C$3,($C$2/(GM$30+1)*($B35+16)/(GM$31+1))<=$C$4),-1,0)","v":0},0,0,0,0,0,0,0,0,0,0,0,0,0,0,0,0,0,0,0,0,0,0,0,0,0,0,0,0,0,0,0,0,0,0,0,0,0,0,0,0,0,0,0,0,0,0,0,0,0,0,0,0,0,0,0,0,0,0,0,0,0,0,0,{"$f":"IF(AND(($C$2/(IY$30+1))>=$G$4,($C$2/(IY$30+1))<=$H$4,($C$2/(IY$30+1)*($B35+16))>=$I$4,($C$2/(IY$30+1)*($B35+16))<=$J$4,($C$2/(IY$30+1)*($B35+16)/(IY$31+1))=$C$3,($C$2/(IY$30+1)*($B35+16)/(IY$31+1))<=$C$4),-1,0)","v":0},0,0,0,0,0,0,0,35]
[null,36,0,0,0,0,0,0,0,0,0,0,0,0,0,0,0,0,0,0,0,0,0,0,0,0,0,0,0,0,0,0,0,0,0,0,0,0,0,0,0,0,0,0,0,0,0,0,0,0,0,0,0,0,0,0,0,0,0,0,0,0,0,0,0,0,0,0,0,0,0,0,0,0,0,0,0,0,0,0,0,0,0,0,0,0,0,0,0,0,0,0,0,0,0,0,0,0,0,0,0,0,0,0,0,0,0,0,0,0,0,0,0,0,0,0,0,0,0,0,0,0,0,0,0,0,0,0,0,0,0,0,0,0,0,0,0,0,0,0,0,0,0,0,0,0,0,0,0,0,0,0,0,0,0,0,0,0,0,0,0,0,0,0,0,0,0,0,0,0,0,0,0,0,0,0,0,0,0,0,0,0,0,0,0,0,0,0,0,0,0,0,0,0,0,0,0,0,0,0,0,0,0,0,0,0,0,0,0,0,0,0,0,0,0,0,0,0,0,0,0,0,0,0,0,0,0,0,0,0,0,0,0,0,0,0,0,0,0,0,0,0,0,0,0,0,0,0,0,0,0,0,0,0,0,0,0,0,0,0,0,0,0,0,0,0,36]
[null,37,0,0,0,0,0,0,0,0,0,0,0,0,0,0,0,0,0,0,0,0,0,0,0,0,0,0,0,0,0,0,0,0,0,0,0,0,0,0,0,0,0,0,0,0,0,0,0,0,0,0,0,0,0,0,0,0,0,0,0,0,0,0,0,0,0,0,0,0,0,0,0,0,0,0,0,0,0,0,0,0,0,0,0,0,0,0,0,0,0,0,0,0,0,0,0,0,0,0,0,0,0,0,0,0,0,0,0,0,0,0,0,0,0,0,0,0,0,0,0,0,0,0,0,0,0,0,0,0,0,0,0,0,0,0,0,0,0,0,0,0,0,0,0,0,0,0,0,0,0,0,0,0,0,0,0,0,0,0,0,0,0,0,0,0,0,0,0,0,0,0,0,0,0,0,0,0,0,0,0,0,0,0,0,0,0,0,0,0,0,0,0,0,0,0,0,0,0,0,0,0,0,0,0,0,0,0,0,0,0,0,0,0,0,0,0,0,0,0,0,0,0,0,0,0,0,0,0,0,0,0,0,0,0,0,0,0,0,0,0,0,0,0,0,0,0,0,0,0,0,0,0,0,0,0,0,0,0,0,0,0,0,0,0,0,37]
[null,38,0,0,0,0,0,0,0,0,0,0,0,0,0,0,0,0,0,0,0,0,0,0,0,0,0,0,0,0,0,0,0,0,0,0,0,0,0,0,0,0,0,0,0,0,0,0,0,0,0,0,0,0,0,0,0,0,0,0,0,0,0,0,0,0,0,0,0,0,0,0,0,0,0,0,0,0,0,0,0,0,0,0,0,0,0,0,0,0,0,0,0,0,0,0,0,0,0,0,0,0,0,0,0,0,0,0,0,0,0,0,0,0,0,0,0,0,0,0,0,0,0,0,0,0,0,0,0,0,0,0,0,0,0,0,0,0,0,0,0,0,0,0,0,0,0,0,0,0,0,0,0,0,0,0,0,0,0,0,0,0,0,0,0,0,0,0,0,0,0,0,0,0,0,0,0,0,0,0,0,0,0,0,0,0,0,0,0,0,0,0,0,0,0,0,0,0,0,0,0,0,0,0,0,0,0,0,0,0,0,0,0,0,0,0,0,0,0,0,0,0,0,0,0,0,0,0,0,0,0,0,0,0,0,0,0,0,0,0,0,0,0,0,0,0,0,0,0,0,0,0,0,0,0,0,0,0,0,0,0,0,0,0,0,0,38]
[null,39,0,0,0,0,0,0,0,0,0,0,0,0,0,0,0,0,0,0,0,0,0,0,0,0,0,0,0,0,0,0,0,0,0,0,0,0,0,0,0,0,0,0,0,0,0,0,0,0,0,0,0,0,0,0,0,0,0,0,0,0,0,0,0,{"$f":"IF(AND(($C$2/(BN$30+1))>=$G$4,($C$2/(BN$30+1))<=$H$4,($C$2/(BN$30+1)*($B39+16))>=$I$4,($C$2/(BN$30+1)*($B39+16))<=$J$4,($C$2/(BN$30+1)*($B39+16)/(BN$31+1))=$C$3,($C$2/(BN$30+1)*($B39+16)/(BN$31+1))<=$C$4),-1,0)","v":0},0,0,0,0,0,0,0,0,0,0,0,0,0,0,0,0,0,0,0,0,0,0,0,0,0,0,0,0,0,0,0,0,0,0,0,0,0,0,0,0,0,0,0,0,0,0,0,0,0,0,0,0,0,0,0,0,0,0,0,0,0,0,0,{"$f":"IF(AND(($C$2/(DZ$30+1))>=$G$4,($C$2/(DZ$30+1))<=$H$4,($C$2/(DZ$30+1)*($B39+16))>=$I$4,($C$2/(DZ$30+1)*($B39+16))<=$J$4,($C$2/(DZ$30+1)*($B39+16)/(DZ$31+1))=$C$3,($C$2/(DZ$30+1)*($B39+16)/(DZ$31+1))<=$C$4),-1,0)","v":0},0,0,0,0,0,0,0,0,0,0,0,0,0,0,0,0,0,0,0,0,0,0,0,0,0,0,0,0,0,0,0,0,0,0,0,0,0,0,0,0,0,0,0,0,0,0,0,0,0,0,0,0,0,0,0,0,0,0,0,0,0,0,0,{"$f":"IF(AND(($C$2/(GL$30+1))>=$G$4,($C$2/(GL$30+1))<=$H$4,($C$2/(GL$30+1)*($B39+16))>=$I$4,($C$2/(GL$30+1)*($B39+16))<=$J$4,($C$2/(GL$30+1)*($B39+16)/(GL$31+1))=$C$3,($C$2/(GL$30+1)*($B39+16)/(GL$31+1))<=$C$4),-1,0)","v":0},0,0,0,0,0,0,0,0,0,0,0,0,0,0,0,0,0,0,0,0,0,0,0,0,0,0,0,0,0,0,0,0,0,0,0,0,0,0,0,0,0,0,0,0,0,0,0,0,0,0,0,0,0,0,0,0,0,0,0,0,0,0,0,{"$f":"IF(AND(($C$2/(IX$30+1))>=$G$4,($C$2/(IX$30+1))<=$H$4,($C$2/(IX$30+1)*($B39+16))>=$I$4,($C$2/(IX$30+1)*($B39+16))<=$J$4,($C$2/(IX$30+1)*($B39+16)/(IX$31+1))=$C$3,($C$2/(IX$30+1)*($B39+16)/(IX$31+1))<=$C$4),-1,0)","v":0},0,0,0,0,0,0,0,0,39]
[null,40,0,0,0,0,0,0,0,0,0,0,0,0,0,0,0,0,{"$f":"IF(AND(($C$2/(S$30+1))>=$G$4,($C$2/(S$30+1))<=$H$4,($C$2/(S$30+1)*($B40+16))>=$I$4,($C$2/(S$30+1)*($B40+16))<=$J$4,($C$2/(S$30+1)*($B40+16)/(S$31+1))=$C$3,($C$2/(S$30+1)*($B40+16)/(S$31+1))<=$C$4),-1,0)","v":0},0,0,0,0,0,0,0,0,0,0,0,0,0,0,0,{"$f":"IF(AND(($C$2/(AI$30+1))>=$G$4,($C$2/(AI$30+1))<=$H$4,($C$2/(AI$30+1)*($B40+16))>=$I$4,($C$2/(AI$30+1)*($B40+16))<=$J$4,($C$2/(AI$30+1)*($B40+16)/(AI$31+1))=$C$3,($C$2/(AI$30+1)*($B40+16)/(AI$31+1))<=$C$4),-1,0)","v":0},0,0,0,0,0,0,0,0,0,0,0,0,0,0,0,{"$f":"IF(AND(($C$2/(AY$30+1))>=$G$4,($C$2/(AY$30+1))<=$H$4,($C$2/(AY$30+1)*($B40+16))>=$I$4,($C$2/(AY$30+1)*($B40+16))<=$J$4,($C$2/(AY$30+1)*($B40+16)/(AY$31+1))=$C$3,($C$2/(AY$30+1)*($B40+16)/(AY$31+1))<=$C$4),-1,0)","v":0},0,0,0,0,0,0,0,0,0,0,0,0,0,0,0,0,0,0,0,0,0,0,0,0,0,0,0,0,0,0,{"$f":"IF(AND(($C$2/(CD$30+1))>=$G$4,($C$2/(CD$30+1))<=$H$4,($C$2/(CD$30+1)*($B40+16))>=$I$4,($C$2/(CD$30+1)*($B40+16))<=$J$4,($C$2/(CD$30+1)*($B40+16)/(CD$31+1))=$C$3,($C$2/(CD$30+1)*($B40+16)/(CD$31+1))<=$C$4),-1,0)","v":0},0,0,0,0,0,0,0,0,0,0,0,0,0,0,0,{"$f":"IF(AND(($C$2/(CT$30+1))>=$G$4,($C$2/(CT$30+1))<=$H$4,($C$2/(CT$30+1)*($B40+16))>=$I$4,($C$2/(CT$30+1)*($B40+16))<=$J$4,($C$2/(CT$30+1)*($B40+16)/(CT$31+1))=$C$3,($C$2/(CT$30+1)*($B40+16)/(CT$31+1))<=$C$4),-1,0)","v":0},0,0,0,0,0,0,0,0,0,0,0,0,0,0,0,{"$f":"IF(AND(($C$2/(DJ$30+1))>=$G$4,($C$2/(DJ$30+1))<=$H$4,($C$2/(DJ$30+1)*($B40+16))>=$I$4,($C$2/(DJ$30+1)*($B40+16))<=$J$4,($C$2/(DJ$30+1)*($B40+16)/(DJ$31+1))=$C$3,($C$2/(DJ$30+1)*($B40+16)/(DJ$31+1))<=$C$4),-1,0)","v":0},0,0,0,0,0,0,0,0,0,0,0,0,0,0,0,0,0,0,0,0,0,0,0,0,0,0,0,0,0,0,0,{"$f":"IF(AND(($C$2/(EP$30+1))>=$G$4,($C$2/(EP$30+1))<=$H$4,($C$2/(EP$30+1)*($B40+16))>=$I$4,($C$2/(EP$30+1)*($B40+16))<=$J$4,($C$2/(EP$30+1)*($B40+16)/(EP$31+1))=$C$3,($C$2/(EP$30+1)*($B40+16)/(EP$31+1))<=$C$4),-1,0)","v":0},0,0,0,0,0,0,0,0,0,0,0,0,0,0,0,{"$f":"IF(AND(($C$2/(FF$30+1))>=$G$4,($C$2/(FF$30+1))<=$H$4,($C$2/(FF$30+1)*($B40+16))>=$I$4,($C$2/(FF$30+1)*($B40+16))<=$J$4,($C$2/(FF$30+1)*($B40+16)/(FF$31+1))=$C$3,($C$2/(FF$30+1)*($B40+16)/(FF$31+1))<=$C$4),-1,0)","v":0},0,0,0,0,0,0,0,0,0,0,0,0,0,0,0,{"$f":"IF(AND(($C$2/(FV$30+1))>=$G$4,($C$2/(FV$30+1))<=$H$4,($C$2/(FV$30+1)*($B40+16))>=$I$4,($C$2/(FV$30+1)*($B40+16))<=$J$4,($C$2/(FV$30+1)*($B40+16)/(FV$31+1))=$C$3,($C$2/(FV$30+1)*($B40+16)/(FV$31+1))<=$C$4),-1,0)","v":0},0,0,0,0,0,0,0,0,0,0,0,0,0,0,0,0,0,0,0,0,0,0,0,0,0,0,0,0,0,0,0,{"$f":"IF(AND(($C$2/(HB$30+1))>=$G$4,($C$2/(HB$30+1))<=$H$4,($C$2/(HB$30+1)*($B40+16))>=$I$4,($C$2/(HB$30+1)*($B40+16))<=$J$4,($C$2/(HB$30+1)*($B40+16)/(HB$31+1))=$C$3,($C$2/(HB$30+1)*($B40+16)/(HB$31+1))<=$C$4),-1,0)","v":0},0,0,0,0,0,0,0,0,0,0,0,0,0,0,0,{"$f":"IF(AND(($C$2/(HR$30+1))>=$G$4,($C$2/(HR$30+1))<=$H$4,($C$2/(HR$30+1)*($B40+16))>=$I$4,($C$2/(HR$30+1)*($B40+16))<=$J$4,($C$2/(HR$30+1)*($B40+16)/(HR$31+1))=$C$3,($C$2/(HR$30+1)*($B40+16)/(HR$31+1))<=$C$4),-1,0)","v":0},0,0,0,0,0,0,0,0,0,0,0,0,0,0,0,{"$f":"IF(AND(($C$2/(IH$30+1))>=$G$4,($C$2/(IH$30+1))<=$H$4,($C$2/(IH$30+1)*($B40+16))>=$I$4,($C$2/(IH$30+1)*($B40+16))<=$J$4,($C$2/(IH$30+1)*($B40+16)/(IH$31+1))=$C$3,($C$2/(IH$30+1)*($B40+16)/(IH$31+1))<=$C$4),-1,0)","v":0},0,0,0,0,0,0,0,0,0,0,0,0,0,0,0,0,0,0,0,0,0,0,0,0,40]
[null,41,0,0,0,0,0,0,0,0,0,0,0,0,0,0,0,0,0,0,0,0,0,0,0,0,0,0,0,0,0,0,0,0,0,0,0,0,0,0,0,0,0,0,0,0,0,0,0,0,0,0,0,0,0,0,0,0,0,0,0,0,0,0,0,0,0,0,0,0,0,0,0,0,0,0,0,0,0,0,0,0,0,0,0,0,0,0,0,0,0,0,0,0,0,0,0,0,0,0,0,0,0,0,0,0,0,0,0,0,0,0,0,0,0,0,0,0,0,0,0,0,0,0,0,0,0,0,0,0,0,0,0,0,0,0,0,0,0,0,0,0,0,0,0,0,0,0,0,0,0,0,0,0,0,0,0,0,0,0,0,0,0,0,0,0,0,0,0,0,0,0,0,0,0,0,0,0,0,0,0,0,0,0,0,0,0,0,0,0,0,0,0,0,0,0,0,0,0,0,0,0,0,0,0,0,0,0,0,0,0,0,0,0,0,0,0,0,0,0,0,0,0,0,0,0,0,0,0,0,0,0,0,0,0,0,0,0,0,0,0,0,0,0,0,0,0,0,0,0,0,0,0,0,0,0,0,0,0,0,0,0,0,0,0,0,41]
[null,42,0,0,0,0,0,0,0,0,0,0,0,0,0,0,0,0,0,0,0,0,0,0,0,0,0,0,0,0,0,0,0,0,0,0,0,0,0,0,0,0,0,0,0,0,0,0,0,0,0,0,0,0,0,0,0,0,0,0,0,0,0,0,0,0,0,0,0,0,0,0,0,0,0,0,0,0,0,0,0,0,0,0,0,0,0,0,0,0,0,0,0,0,0,0,0,0,0,0,0,0,0,0,0,0,0,0,0,0,0,0,0,0,0,0,0,0,0,0,0,0,0,0,0,0,0,0,0,0,0,0,0,0,0,0,0,0,0,0,0,0,0,0,0,0,0,0,0,0,0,0,0,0,0,0,0,0,0,0,0,0,0,0,0,0,0,0,0,0,0,0,0,0,0,0,0,0,0,0,0,0,0,0,0,0,0,0,0,0,0,0,0,0,0,0,0,0,0,0,0,0,0,0,0,0,0,0,0,0,0,0,0,0,0,0,0,0,0,0,0,0,0,0,0,0,0,0,0,0,0,0,0,0,0,0,0,0,0,0,0,0,0,0,0,0,0,0,0,0,0,0,0,0,0,0,0,0,0,0,0,0,0,0,0,0,42]
[null,43,0,0,0,0,0,0,0,0,0,0,0,0,0,0,0,0,0,0,0,0,0,0,0,0,0,0,0,0,0,0,0,0,0,0,0,0,0,0,0,0,0,0,0,0,0,0,0,0,0,0,0,0,0,0,0,0,0,0,0,0,0,0,0,0,0,0,0,0,0,0,0,0,0,0,0,0,0,0,0,0,0,0,0,0,0,0,0,0,0,0,0,0,0,0,0,0,0,0,0,0,0,0,0,0,0,0,0,0,0,0,0,0,0,0,0,0,0,0,0,0,0,0,0,0,0,0,0,0,0,0,0,0,0,0,0,0,0,0,0,0,0,0,0,0,0,0,0,0,0,0,0,0,0,0,0,0,0,0,0,0,0,0,0,0,0,0,0,0,0,0,0,0,0,0,0,0,0,0,0,0,0,0,0,0,0,0,0,0,0,0,0,0,0,0,0,0,0,0,0,0,0,0,0,0,0,0,0,0,0,0,0,0,0,0,0,0,0,0,0,0,0,0,0,0,0,0,0,0,0,0,0,0,0,0,0,0,0,0,0,0,0,0,0,0,0,0,0,0,0,0,0,0,0,0,0,0,0,0,0,0,0,0,0,0,43]
[null,44,0,0,0,0,0,0,0,0,0,0,0,0,0,0,0,0,0,0,0,0,0,0,0,0,0,0,0,0,0,0,0,0,0,0,0,0,0,-1,0,0,0,0,0,0,0,0,0,0,0,0,0,0,0,0,0,0,0,0,0,0,0,0,0,0,0,0,0,0,0,0,0,0,0,0,0,0,0,0,0,0,0,0,0,0,0,0,0,0,0,0,0,0,0,0,0,0,0,0,0,0,0,0,0,0,0,0,0,0,0,0,0,0,0,0,0,0,0,0,0,0,0,0,0,0,0,0,0,0,0,0,0,0,0,0,0,0,0,0,0,0,0,0,0,0,0,0,0,0,0,0,0,0,0,0,0,0,0,0,0,0,0,0,0,0,0,0,0,0,0,0,0,0,0,0,0,0,0,0,0,0,0,0,0,0,0,0,0,0,0,0,0,0,0,0,0,0,0,0,0,0,0,0,0,0,0,0,0,0,0,0,0,0,0,0,0,0,0,0,0,0,0,0,0,0,0,0,0,0,0,0,0,0,0,0,0,0,0,0,0,0,0,0,0,0,0,0,0,0,0,0,0,0,0,0,0,0,0,0,0,0,0,0,0,0,44]
[null,45,0,0,0,0,0,0,0,0,0,0,0,0,0,0,0,0,0,0,0,0,0,0,0,0,0,0,0,0,0,0,0,0,0,0,0,0,0,0,0,0,0,0,0,0,0,0,0,0,0,0,0,0,0,0,0,0,0,0,0,0,0,0,0,0,0,0,0,0,0,0,0,0,0,0,0,0,0,0,0,0,0,0,0,0,0,0,0,0,0,0,0,0,0,0,0,0,0,0,0,0,0,0,0,0,0,0,0,0,0,0,0,0,0,0,0,0,0,0,0,0,0,0,0,0,0,0,0,0,0,0,0,0,0,0,0,0,0,0,0,0,0,0,0,0,0,0,0,0,0,0,0,0,0,0,0,0,0,0,0,0,0,0,0,0,0,0,0,0,0,0,0,0,0,0,0,0,0,0,0,0,0,0,0,0,0,0,0,0,0,0,0,0,0,0,0,0,0,0,0,0,0,0,0,0,0,0,0,0,0,0,0,0,0,0,0,0,0,0,0,0,0,0,0,0,0,0,0,0,0,0,0,0,0,0,0,0,0,0,0,0,0,0,0,0,0,0,0,0,0,0,0,0,0,0,0,0,0,0,0,0,0,0,0,0,45]
[null,46,0,0,0,0,0,0,0,0,0,0,0,0,0,0,0,0,0,0,0,0,0,0,0,0,0,0,0,0,0,0,0,0,0,0,0,0,0,0,0,0,0,0,0,0,0,0,0,0,0,0,0,0,0,0,0,0,0,0,0,0,0,0,0,0,0,0,0,0,0,0,0,0,0,0,0,0,0,0,0,0,0,0,0,0,0,0,0,0,0,0,0,0,0,0,0,0,0,0,0,0,0,0,0,0,0,0,0,0,0,0,0,0,0,0,0,0,0,0,0,0,0,0,0,0,0,0,0,0,0,0,0,0,0,0,0,0,0,0,0,0,0,0,0,0,0,0,0,0,0,0,0,0,0,0,0,0,0,0,0,0,0,0,0,0,0,0,0,0,0,0,0,0,0,0,0,0,0,0,0,0,0,0,0,0,0,0,0,0,0,0,0,0,0,0,0,0,0,0,0,0,0,0,0,0,0,0,0,0,0,0,0,0,0,0,0,0,0,0,0,0,0,0,0,0,0,0,0,0,0,0,0,0,0,0,0,0,0,0,0,0,0,0,0,0,0,0,0,0,0,0,0,0,0,0,0,0,0,0,0,0,0,0,0,0,46]
[null,47,0,0,0,0,0,0,0,0,0,0,0,0,0,0,0,0,0,0,0,0,0,0,0,0,0,0,0,0,0,0,0,0,0,0,0,0,0,0,0,0,0,0,0,0,0,0,0,0,0,0,0,0,0,0,0,0,0,0,0,0,0,0,0,0,0,0,0,0,0,0,0,0,0,0,0,0,0,0,0,0,0,0,0,0,0,0,0,0,0,0,0,0,0,0,0,0,0,0,0,0,0,0,0,0,0,0,0,0,0,0,0,0,0,0,0,0,0,0,0,0,0,0,0,0,0,0,0,0,0,0,0,0,0,0,0,0,0,0,0,0,0,0,0,0,0,0,0,0,0,0,0,0,0,0,0,0,0,0,0,0,0,0,0,0,0,0,0,0,0,0,0,0,0,0,0,0,0,0,0,0,0,0,0,0,0,0,0,0,0,0,0,0,0,0,0,0,0,0,0,0,0,0,0,0,0,0,0,0,0,0,0,0,0,0,0,0,0,0,0,0,0,0,0,0,0,0,0,0,0,0,0,0,0,0,0,0,0,0,0,0,0,0,0,0,0,0,0,0,0,0,0,0,0,0,0,0,0,0,0,0,0,0,0,0,47]
[null,48,0,0,0,0,0,0,0,0,0,0,0,0,0,0,0,0,0,0,0,0,0,0,0,0,0,0,0,0,0,0,0,0,0,0,0,0,0,0,0,0,0,0,0,0,0,0,0,0,0,0,0,0,0,0,0,0,0,0,0,0,0,0,0,0,0,0,0,0,0,0,0,0,0,0,0,0,0,0,0,0,0,0,0,0,0,0,0,0,0,0,0,0,0,0,0,0,0,0,0,0,0,0,0,0,0,0,0,0,0,0,0,0,0,0,0,0,0,0,0,0,0,0,0,0,0,0,0,0,0,0,0,0,0,0,0,0,0,0,0,0,0,0,0,0,0,0,0,0,0,0,0,0,0,0,0,0,0,0,0,0,0,0,0,0,0,0,0,0,0,0,0,0,0,0,0,0,0,0,0,0,0,0,0,0,0,0,0,0,0,0,0,0,0,0,0,0,0,0,0,0,0,0,0,0,0,0,0,0,0,0,0,0,0,0,0,0,0,0,0,0,0,0,0,0,0,0,0,0,0,0,0,0,0,0,0,0,0,0,0,0,0,0,0,0,0,0,0,0,0,0,0,0,0,0,0,0,0,0,0,0,0,0,0,0,48]
[null,49,0,0,0,0,0,0,0,0,0,0,0,0,0,0,0,0,0,0,0,0,0,0,0,0,0,0,0,0,0,0,0,0,0,0,0,0,0,0,0,0,0,0,0,0,0,0,0,0,0,0,0,0,0,0,0,0,0,0,0,0,0,0,0,0,0,0,0,0,0,0,0,0,0,0,0,0,0,0,0,0,0,0,0,0,0,0,0,0,0,0,0,0,0,0,0,0,0,0,0,0,0,0,0,0,0,0,0,0,0,0,0,0,0,0,0,0,0,0,0,0,0,0,0,0,0,0,0,0,0,0,0,0,0,0,0,0,0,0,0,0,0,0,0,0,0,0,0,0,0,0,0,0,0,0,0,0,0,0,0,0,0,0,0,0,0,0,0,0,0,0,0,0,0,0,0,0,0,0,0,0,0,0,0,0,0,0,0,0,0,0,0,0,0,0,0,0,0,0,0,0,0,0,0,0,0,0,0,0,0,0,0,0,0,0,0,0,0,0,0,0,0,0,0,0,0,0,0,0,0,0,0,0,0,0,0,0,0,0,0,0,0,0,0,0,0,0,0,0,0,0,0,0,0,0,0,0,0,0,0,0,0,0,0,0,49]
[null,50,0,0,0,0,0,0,0,0,0,0,0,0,0,0,0,0,0,0,0,0,0,0,0,0,0,0,0,0,0,0,0,0,0,0,0,0,0,0,0,0,0,0,0,0,0,0,0,0,0,0,0,0,0,0,0,0,0,0,0,0,0,0,0,0,0,0,0,0,0,0,0,0,0,0,0,0,0,0,0,0,0,0,0,0,0,0,0,0,0,0,0,0,0,0,0,0,0,0,0,0,0,0,0,0,0,0,0,0,0,0,0,0,0,0,0,0,0,0,0,0,0,0,0,0,0,0,0,0,0,0,0,0,0,0,0,0,0,0,0,0,0,0,0,0,0,0,0,0,0,0,0,0,0,0,0,0,0,0,0,0,0,0,0,0,0,0,0,0,0,0,0,0,0,0,0,0,0,0,0,0,0,0,0,0,0,0,0,0,0,0,0,0,0,0,0,0,0,0,0,0,0,0,0,0,0,0,0,0,0,0,0,0,0,0,0,0,0,0,0,0,0,0,0,0,0,0,0,0,0,0,0,0,0,0,0,0,0,0,0,0,0,0,0,0,0,0,0,0,0,0,0,0,0,0,0,0,0,0,0,0,0,0,0,0,50]
[null,51,0,0,0,0,0,0,0,0,0,0,0,0,0,0,0,0,0,0,0,0,0,0,0,0,0,0,0,0,0,0,0,0,0,0,0,0,0,0,0,0,0,0,0,0,0,0,0,0,0,0,0,0,0,0,0,0,0,0,0,0,0,0,0,0,0,0,0,0,0,0,0,0,0,0,0,0,0,0,0,0,0,0,0,0,0,0,0,0,0,0,0,0,0,0,0,0,0,0,0,0,0,0,0,0,0,0,0,0,0,0,0,0,0,0,0,0,0,0,0,0,0,0,0,0,0,0,0,0,0,0,0,0,0,0,0,0,0,0,0,0,0,0,0,0,0,0,0,0,0,0,0,0,0,0,0,0,0,0,0,0,0,0,0,0,0,0,0,0,0,0,0,0,0,0,0,0,0,0,0,0,0,0,0,0,0,0,0,0,0,0,0,0,0,0,0,0,0,0,0,0,0,0,0,0,0,0,0,0,0,0,0,0,0,0,0,0,0,0,0,0,0,0,0,0,0,0,0,0,0,0,0,0,0,0,0,0,0,0,0,0,0,0,0,0,0,0,0,0,0,0,0,0,0,0,0,0,0,0,0,0,0,0,0,0,51]
[null,52,0,0,0,0,0,0,0,0,0,0,0,0,0,0,0,0,0,0,0,0,0,0,0,0,0,0,0,0,0,0,0,0,0,0,0,0,0,0,0,0,0,0,0,0,0,0,0,0,0,0,0,0,0,0,0,0,0,0,0,0,0,0,0,0,0,0,0,0,0,0,0,0,0,0,0,0,0,0,0,0,0,0,0,0,0,0,0,0,0,0,0,0,0,0,0,0,0,0,0,0,0,0,0,0,0,0,0,0,0,0,0,0,0,0,0,0,0,0,0,0,0,0,0,0,0,0,0,0,0,0,0,0,0,0,0,0,0,0,0,0,0,0,0,0,0,0,0,0,0,0,0,0,0,0,0,0,0,0,0,0,0,0,0,0,0,0,0,0,0,0,0,0,0,0,0,0,0,0,0,0,0,0,0,0,0,0,0,0,0,0,0,0,0,0,0,0,0,0,0,0,0,0,0,0,0,0,0,0,0,0,0,0,0,0,0,0,0,0,0,0,0,0,0,0,0,0,0,0,0,0,0,0,0,0,0,0,0,0,0,0,0,0,0,0,0,0,0,0,0,0,0,0,0,0,0,0,0,0,0,0,0,0,0,0,52]
[null,53,0,0,0,0,0,0,0,0,0,0,0,0,0,0,0,0,0,0,0,0,0,0,0,0,0,0,0,0,0,0,0,0,0,0,0,0,0,0,0,0,0,0,0,0,0,0,0,0,0,0,0,0,0,0,0,0,0,0,0,0,0,0,0,0,0,0,0,0,0,0,0,0,0,0,0,0,0,0,0,0,0,0,0,0,0,0,0,0,0,0,0,0,0,0,0,0,0,0,0,0,0,0,0,0,0,0,0,0,0,0,0,0,0,0,0,0,0,0,0,0,0,0,0,0,0,0,0,0,0,0,0,0,0,0,0,0,0,0,0,0,0,0,0,0,0,0,0,0,0,0,0,0,0,0,0,0,0,0,0,0,0,0,0,0,0,0,0,0,0,0,0,0,0,0,0,0,0,0,0,0,0,0,0,0,0,0,0,0,0,0,0,0,0,0,0,0,0,0,0,0,0,0,0,0,0,0,0,0,0,0,0,0,0,0,0,0,0,0,0,0,0,0,0,0,0,0,0,0,0,0,0,0,0,0,0,0,0,0,0,0,0,0,0,0,0,0,0,0,0,0,0,0,0,0,0,0,0,0,0,0,0,0,0,0,53]
[null,54,0,0,0,0,0,0,0,0,0,0,0,0,0,0,0,0,0,0,0,0,0,0,0,0,0,0,0,0,0,0,0,0,0,0,0,0,0,0,0,0,0,0,0,0,0,0,0,0,0,0,0,0,0,0,0,0,0,0,0,0,0,0,0,0,0,0,0,0,0,0,0,0,0,0,0,0,0,0,0,0,0,0,0,0,0,0,0,0,0,0,0,0,0,0,0,0,0,0,0,0,0,0,0,0,0,0,0,0,0,0,0,0,0,0,0,0,0,0,0,0,0,0,0,0,0,0,0,0,0,0,0,0,0,0,0,0,0,0,0,0,0,0,0,0,0,0,0,0,0,0,0,0,0,0,0,0,0,0,0,0,0,0,0,0,0,0,0,0,0,0,0,0,0,0,0,0,0,0,0,0,0,0,0,0,0,0,0,0,0,0,0,0,0,0,0,0,0,0,0,0,0,0,0,0,0,0,0,0,0,0,0,0,0,0,0,0,0,0,0,0,0,0,0,0,0,0,0,0,0,0,0,0,0,0,0,0,0,0,0,0,0,0,0,0,0,0,0,0,0,0,0,0,0,0,0,0,0,0,0,0,0,0,0,0,54]
[null,55,0,0,0,0,0,0,0,0,{"$f":"IF(AND(($C$2/(K$30+1))>=$G$4,($C$2/(K$30+1))<=$H$4,($C$2/(K$30+1)*($B55+16))>=$I$4,($C$2/(K$30+1)*($B55+16))<=$J$4,($C$2/(K$30+1)*($B55+16)/(K$31+1))=$C$3,($C$2/(K$30+1)*($B55+16)/(K$31+1))<=$C$4),-1,0)","v":0},0,0,0,0,0,0,0,0,0,0,0,0,0,0,0,0,0,0,0,0,0,0,0,0,0,0,0,0,0,0,0,0,0,0,0,0,0,0,{"$f":"IF(AND(($C$2/(AX$30+1))>=$G$4,($C$2/(AX$30+1))<=$H$4,($C$2/(AX$30+1)*($B55+16))>=$I$4,($C$2/(AX$30+1)*($B55+16))<=$J$4,($C$2/(AX$30+1)*($B55+16)/(AX$31+1))=$C$3,($C$2/(AX$30+1)*($B55+16)/(AX$31+1))<=$C$4),-1,0)","v":0},0,0,0,0,0,0,0,0,0,0,0,0,0,0,0,0,0,0,0,0,0,0,0,0,0,0,0,0,0,0,0,0,0,0,0,0,0,0,0,0,0,0,0,0,0,0,{"$f":"IF(AND(($C$2/(CS$30+1))>=$G$4,($C$2/(CS$30+1))<=$H$4,($C$2/(CS$30+1)*($B55+16))>=$I$4,($C$2/(CS$30+1)*($B55+16))<=$J$4,($C$2/(CS$30+1)*($B55+16)/(CS$31+1))=$C$3,($C$2/(CS$30+1)*($B55+16)/(CS$31+1))<=$C$4),-1,0)","v":0},0,0,0,0,0,0,0,0,0,0,0,0,0,0,0,0,0,0,0,0,0,0,0,0,0,0,0,0,0,0,0,{"$f":"IF(AND(($C$2/(DY$30+1))>=$G$4,($C$2/(DY$30+1))<=$H$4,($C$2/(DY$30+1)*($B55+16))>=$I$4,($C$2/(DY$30+1)*($B55+16))<=$J$4,($C$2/(DY$30+1)*($B55+16)/(DY$31+1))=$C$3,($C$2/(DY$30+1)*($B55+16)/(DY$31+1))<=$C$4),-1,0)","v":0},0,0,0,0,0,0,0,0,0,0,0,0,0,0,0,{"$f":"IF(AND(($C$2/(EO$30+1))>=$G$4,($C$2/(EO$30+1))<=$H$4,($C$2/(EO$30+1)*($B55+16))>=$I$4,($C$2/(EO$30+1)*($B55+16))<=$J$4,($C$2/(EO$30+1)*($B55+16)/(EO$31+1))=$C$3,($C$2/(EO$30+1)*($B55+16)/(EO$31+1))<=$C$4),-1,0)","v":0},0,0,0,0,0,0,0,0,0,0,0,0,0,0,0,0,0,0,0,0,0,0,0,0,0,0,0,0,0,0,0,{"$f":"IF(AND(($C$2/(FU$30+1))>=$G$4,($C$2/(FU$30+1))<=$H$4,($C$2/(FU$30+1)*($B55+16))>=$I$4,($C$2/(FU$30+1)*($B55+16))<=$J$4,($C$2/(FU$30+1)*($B55+16)/(FU$31+1))=$C$3,($C$2/(FU$30+1)*($B55+16)/(FU$31+1))<=$C$4),-1,0)","v":0},0,0,0,0,0,0,0,0,0,0,0,0,0,0,0,0,0,0,0,0,0,0,0,0,0,0,0,0,0,{"$f":"IF(AND(($C$2/(GY$30+1))>=$G$4,($C$2/(GY$30+1))<=$H$4,($C$2/(GY$30+1)*($B55+16))>=$I$4,($C$2/(GY$30+1)*($B55+16))<=$J$4,($C$2/(GY$30+1)*($B55+16)/(GY$31+1))=$C$3,($C$2/(GY$30+1)*($B55+16)/(GY$31+1))<=$C$4),-1,0)","v":0},0,0,0,0,0,0,0,0,0,0,0,0,0,0,0,0,0,0,0,0,0,0,0,0,0,0,0,0,0,0,0,0,0,{"$f":"IF(AND(($C$2/(IG$30+1))>=$G$4,($C$2/(IG$30+1))<=$H$4,($C$2/(IG$30+1)*($B55+16))>=$I$4,($C$2/(IG$30+1)*($B55+16))<=$J$4,($C$2/(IG$30+1)*($B55+16)/(IG$31+1))=$C$3,($C$2/(IG$30+1)*($B55+16)/(IG$31+1))<=$C$4),-1,0)","v":0},0,0,0,0,0,0,0,0,0,0,0,0,0,0,0,0,0,0,0,0,0,0,0,0,0,55]
[null,56,{"$f":"IF(AND(($C$2/(C$30+1))>=$G$4,($C$2/(C$30+1))<=$H$4,($C$2/(C$30+1)*($B56+16))>=$I$4,($C$2/(C$30+1)*($B56+16))<=$J$4,($C$2/(C$30+1)*($B56+16)/(C$31+1))=$C$3,($C$2/(C$30+1)*($B56+16)/(C$31+1))<=$C$4),-1,0)","v":0},0,0,0,0,0,0,0,0,0,0,0,0,0,0,0,0,0,0,0,0,0,0,0,0,0,0,0,0,0,0,{"$f":"IF(AND(($C$2/(AH$30+1))>=$G$4,($C$2/(AH$30+1))<=$H$4,($C$2/(AH$30+1)*($B56+16))>=$I$4,($C$2/(AH$30+1)*($B56+16))<=$J$4,($C$2/(AH$30+1)*($B56+16)/(AH$31+1))=$C$3,($C$2/(AH$30+1)*($B56+16)/(AH$31+1))<=$C$4),-1,0)","v":0},0,0,0,0,0,0,0,0,0,0,0,0,0,0,0,0,0,0,0,0,0,0,0,0,0,0,0,0,0,0,0,0,0,0,0,0,0,0,0,0,0,0,0,0,0,{"$f":"IF(AND(($C$2/(CB$30+1))>=$G$4,($C$2/(CB$30+1))<=$H$4,($C$2/(CB$30+1)*($B56+16))>=$I$4,($C$2/(CB$30+1)*($B56+16))<=$J$4,($C$2/(CB$30+1)*($B56+16)/(CB$31+1))=$C$3,($C$2/(CB$30+1)*($B56+16)/(CB$31+1))<=$C$4),-1,0)","v":0},0,0,0,0,0,0,0,0,0,0,0,0,0,0,0,{"$f":"IF(AND(($C$2/(CR$30+1))>=$G$4,($C$2/(CR$30+1))<=$H$4,($C$2/(CR$30+1)*($B56+16))>=$I$4,($C$2/(CR$30+1)*($B56+16))<=$J$4,($C$2/(CR$30+1)*($B56+16)/(CR$31+1))=$C$3,($C$2/(CR$30+1)*($B56+16)/(CR$31+1))<=$C$4),-1,0)","v":0},0,0,0,0,0,0,0,0,0,0,0,0,0,0,0,0,0,{"$f":"IF(AND(($C$2/(DJ$30+1))>=$G$4,($C$2/(DJ$30+1))<=$H$4,($C$2/(DJ$30+1)*($B56+16))>=$I$4,($C$2/(DJ$30+1)*($B56+16))<=$J$4,($C$2/(DJ$30+1)*($B56+16)/(DJ$31+1))=$C$3,($C$2/(DJ$30+1)*($B56+16)/(DJ$31+1))<=$C$4),-1,0)","v":0},0,0,0,0,0,0,0,0,0,0,0,0,0,0,0,0,0,0,0,0,0,0,0,0,0,0,0,0,0,0,0,0,0,0,0,0,0,0,0,0,0,0,0,0,0,0,0,{"$f":"IF(AND(($C$2/(FF$30+1))>=$G$4,($C$2/(FF$30+1))<=$H$4,($C$2/(FF$30+1)*($B56+16))>=$I$4,($C$2/(FF$30+1)*($B56+16))<=$J$4,($C$2/(FF$30+1)*($B56+16)/(FF$31+1))=$C$3,($C$2/(FF$30+1)*($B56+16)/(FF$31+1))<=$C$4),-1,0)","v":0},0,0,0,0,0,0,0,0,0,0,0,0,0,0,0,0,0,0,0,0,0,0,0,0,0,0,0,0,0,0,0,{"$f":"IF(AND(($C$2/(GL$30+1))>=$G$4,($C$2/(GL$30+1))<=$H$4,($C$2/(GL$30+1)*($B56+16))>=$I$4,($C$2/(GL$30+1)*($B56+16))<=$J$4,($C$2/(GL$30+1)*($B56+16)/(GL$31+1))=$C$3,($C$2/(GL$30+1)*($B56+16)/(GL$31+1))<=$C$4),-1,0)","v":0},0,0,0,0,0,0,0,0,0,0,0,0,0,0,0,0,0,0,0,0,0,0,0,0,0,0,0,0,0,0,0,{"$f":"IF(AND(($C$2/(HR$30+1))>=$G$4,($C$2/(HR$30+1))<=$H$4,($C$2/(HR$30+1)*($B56+16))>=$I$4,($C$2/(HR$30+1)*($B56+16))<=$J$4,($C$2/(HR$30+1)*($B56+16)/(HR$31+1))=$C$3,($C$2/(HR$30+1)*($B56+16)/(HR$31+1))<=$C$4),-1,0)","v":0},0,0,0,0,0,0,0,0,0,0,0,0,0,0,0,0,0,0,0,0,0,0,0,0,0,0,0,0,0,0,0,0,0,0,0,0,0,0,0,0,56]
[null,57,0,0,0,0,0,0,0,0,0,0,0,0,0,0,0,0,0,0,0,0,0,0,0,0,{"$f":"IF(AND(($C$2/(AA$30+1))>=$G$4,($C$2/(AA$30+1))<=$H$4,($C$2/(AA$30+1)*($B57+16))>=$I$4,($C$2/(AA$30+1)*($B57+16))<=$J$4,($C$2/(AA$30+1)*($B57+16)/(AA$31+1))=$C$3,($C$2/(AA$30+1)*($B57+16)/(AA$31+1))<=$C$4),-1,0)","v":0},0,0,0,0,0,0,0,0,0,0,0,0,0,0,0,0,0,0,0,0,0,0,0,0,0,0,0,0,0,0,0,0,0,0,0,0,0,0,0,{"$f":"IF(AND(($C$2/(BO$30+1))>=$G$4,($C$2/(BO$30+1))<=$H$4,($C$2/(BO$30+1)*($B57+16))>=$I$4,($C$2/(BO$30+1)*($B57+16))<=$J$4,($C$2/(BO$30+1)*($B57+16)/(BO$31+1))=$C$3,($C$2/(BO$30+1)*($B57+16)/(BO$31+1))<=$C$4),-1,0)","v":0},0,0,0,0,0,0,0,0,0,0,0,0,0,0,0,0,0,0,0,0,0,0,0,0,0,0,0,0,0,0,0,0,0,0,0,0,0,0,0,0,0,0,0,0,0,0,0,0,0,0,0,0,0,0,0,0,0,0,0,0,0,0,0,0,0,0,0,0,0,0,0,0,0,0,0,0,0,0,0,0,0,0,0,0,0,0,0,0,0,0,0,0,0,0,0,0,0,0,0,0,0,0,0,0,0,0,0,0,0,0,0,0,0,0,0,0,0,0,0,0,0,0,0,0,0,0,0,0,0,0,0,0,0,0,0,0,0,0,0,0,0,0,0,0,0,0,0,0,0,0,0,0,0,0,0,0,0,0,0,0,0,0,0,0,0,0,0,0,0,0,0,0,0,0,0,0,0,0,0,0,0,0,0,0,0,0,0,0,0,0,0,0,0,0,0,0,0,0,0,57]
[null,58,0,0,0,0,0,0,0,0,0,0,0,0,0,0,0,0,0,0,0,0,0,0,0,0,0,0,0,0,0,0,0,0,0,0,0,0,0,0,0,0,0,0,0,0,0,0,0,0,0,0,0,0,0,0,0,0,0,0,0,0,0,0,0,0,0,0,0,0,0,0,0,0,0,0,0,0,0,0,0,0,0,0,0,0,0,0,0,0,0,0,0,0,0,0,0,0,0,0,0,0,0,0,0,0,0,0,0,0,0,0,0,0,0,0,0,0,0,0,0,0,0,0,0,0,0,0,0,0,0,0,0,0,0,0,0,0,0,0,0,0,0,0,0,0,0,0,0,0,0,0,0,0,0,0,0,0,0,0,0,0,0,0,0,0,0,0,0,0,0,0,0,0,0,0,0,0,0,0,0,0,0,0,0,0,0,0,0,0,0,0,0,0,0,0,0,0,0,0,0,0,0,0,0,0,0,0,0,0,0,0,0,0,0,0,0,0,0,0,0,0,0,0,0,0,0,0,0,0,0,0,0,0,0,0,0,0,0,0,0,0,0,0,0,0,0,0,0,0,0,0,0,0,0,0,0,0,0,0,0,0,0,0,0,0,58]
[null,59,0,0,0,0,0,0,0,0,0,0,0,0,0,0,0,0,0,0,0,0,0,0,0,0,0,0,0,0,0,0,0,0,0,0,0,0,0,0,0,0,0,0,0,0,0,0,0,0,0,0,0,0,0,0,0,0,0,0,0,0,0,0,0,0,0,0,0,0,0,0,0,0,0,0,0,0,0,0,0,0,0,0,0,0,0,0,0,0,0,0,0,0,0,0,0,0,0,0,0,0,0,0,0,0,0,0,0,0,0,0,0,0,0,0,0,0,0,0,0,0,0,0,0,0,0,0,0,0,0,0,0,0,0,0,0,0,0,0,0,0,0,0,0,0,0,0,0,0,0,0,0,0,0,0,0,0,0,0,0,0,0,0,0,0,0,0,0,0,0,0,0,0,0,0,0,0,0,0,0,0,0,0,0,0,0,0,0,0,0,0,0,0,0,0,0,0,0,0,0,0,0,0,0,0,0,0,0,0,0,0,0,0,0,0,0,0,0,0,0,0,0,0,0,0,0,0,0,0,0,0,0,0,0,0,0,0,0,0,0,0,0,0,0,0,0,0,0,0,0,0,0,0,0,0,0,0,0,0,0,0,0,0,0,0,59]
[null,60,0,0,0,0,0,0,0,0,0,0,0,0,0,0,0,0,0,0,0,0,0,0,0,0,0,0,0,0,0,0,0,0,0,0,0,0,0,0,0,0,0,0,0,0,0,0,0,0,0,0,0,0,0,0,0,0,0,0,0,0,0,0,0,0,0,0,0,0,0,0,0,0,0,0,0,0,0,0,0,0,0,0,0,0,0,0,0,0,0,0,0,0,0,0,0,0,0,0,0,0,0,0,0,0,0,0,0,0,0,0,0,0,0,0,0,0,0,0,0,0,0,0,0,0,0,0,0,0,0,0,0,0,0,0,0,0,0,0,0,0,0,0,0,0,0,0,0,0,0,0,0,0,0,0,0,0,0,0,0,0,0,0,0,0,0,0,0,0,0,0,0,0,0,0,0,0,0,0,0,0,0,0,0,0,0,0,0,0,0,0,0,0,0,0,0,0,0,0,0,0,0,0,0,0,0,0,0,0,0,0,0,0,0,0,0,0,0,0,0,0,{"$f":"IF(AND(($C$2/(HO$30+1))>=$G$4,($C$2/(HO$30+1))<=$H$4,($C$2/(HO$30+1)*($B60+16))>=$I$4,($C$2/(HO$30+1)*($B60+16))<=$J$4,($C$2/(HO$30+1)*($B60+16)/(HO$31+1))=$C$3,($C$2/(HO$30+1)*($B60+16)/(HO$31+1))<=$C$4),-1,0)","v":0},0,0,0,0,0,0,0,0,0,0,0,0,0,0,0,0,0,0,0,0,0,0,0,0,0,0,0,0,0,0,0,0,0,0,0,0,0,0,0,0,0,0,0,60]
[null,61,0,0,0,0,0,0,0,0,0,0,0,0,0,0,0,0,0,0,0,0,0,0,0,0,0,0,0,0,0,0,0,0,0,0,0,0,0,0,0,0,0,0,0,0,0,0,0,0,0,0,0,0,0,0,0,0,0,0,0,0,0,0,0,0,0,0,0,0,0,0,0,0,0,0,0,0,0,0,0,0,0,0,0,0,0,0,0,0,0,0,0,0,0,0,0,0,0,0,0,0,0,0,0,0,0,0,0,0,0,0,0,0,0,0,0,0,0,0,0,0,0,0,0,0,0,0,0,0,0,0,0,0,0,0,0,0,0,0,0,0,0,0,0,0,0,0,0,0,0,0,0,0,0,0,0,0,0,0,0,0,0,0,0,0,0,0,0,0,0,0,0,0,0,0,0,0,0,0,0,0,0,0,0,0,0,0,0,0,0,0,0,0,0,0,0,0,0,0,0,0,0,0,0,0,0,0,0,0,0,0,0,0,0,0,0,0,0,0,0,0,0,0,0,0,0,0,0,0,0,0,0,0,0,0,0,0,0,0,0,0,0,0,0,0,0,0,0,0,0,0,0,0,0,0,0,0,0,0,0,0,0,0,0,0,61]
[null,62,0,0,0,0,0,0,0,0,0,0,0,0,0,0,0,0,0,0,0,0,0,0,0,0,0,0,0,0,0,0,0,0,0,0,0,0,0,0,0,0,0,0,0,0,0,0,0,0,0,0,0,0,0,0,0,0,0,0,0,0,0,0,0,0,0,0,0,0,0,0,0,0,0,0,0,0,0,0,0,0,0,0,0,0,0,0,0,0,0,0,0,0,0,0,0,0,0,0,0,0,0,0,0,0,0,0,0,0,0,0,0,0,0,0,0,0,0,0,0,0,0,0,0,0,0,0,0,0,0,0,0,0,0,0,0,0,0,0,0,0,0,0,0,0,0,0,0,0,0,0,0,0,0,0,0,0,0,0,0,0,0,0,0,0,0,0,0,0,0,0,0,0,0,0,0,0,0,0,0,0,0,0,0,0,0,0,0,0,0,0,0,0,0,0,0,0,0,0,0,0,0,0,0,0,0,0,0,0,0,0,0,0,0,0,0,0,0,0,0,0,0,0,0,0,0,0,0,0,0,0,0,0,0,0,0,0,0,0,0,0,0,0,0,0,0,0,0,0,0,0,0,0,0,0,0,0,0,0,0,0,0,0,0,0,62]
[null,63,0,0,0,0,0,0,0,0,0,0,0,0,0,0,0,0,0,0,0,0,0,0,0,0,0,0,0,0,0,0,0,0,0,0,0,0,0,0,0,0,0,0,0,0,0,0,0,0,0,0,0,0,0,0,0,0,0,0,0,0,0,0,0,0,0,0,0,0,0,0,0,0,0,0,0,0,0,0,0,0,0,0,0,0,0,0,0,0,0,0,0,0,0,0,0,0,0,0,0,0,0,0,0,0,0,0,0,0,0,0,0,0,0,0,0,0,0,0,0,0,0,0,0,0,0,0,0,0,0,0,0,0,0,0,0,0,0,0,0,0,0,0,0,0,0,0,0,0,0,0,0,0,0,0,0,0,0,0,0,0,0,0,0,0,0,0,0,0,0,0,0,0,0,0,0,0,0,0,0,0,0,0,0,0,0,0,0,0,0,0,0,0,0,0,0,0,0,0,0,0,0,0,0,0,0,0,0,0,0,0,0,0,0,0,0,0,0,0,0,0,0,0,0,0,0,0,0,0,0,0,0,0,0,0,0,0,0,0,0,0,0,0,0,0,0,0,0,0,0,0,0,0,0,0,0,0,0,0,0,0,0,0,0,0,63]
[null,64,0,0,0,0,0,0,0,0,0,0,0,0,0,0,0,0,0,0,0,0,0,0,0,0,0,0,0,0,0,0,0,0,0,0,0,0,0,0,0,0,0,0,0,0,0,0,0,0,0,0,0,0,0,0,0,0,0,0,0,0,0,0,0,0,0,0,0,0,0,0,0,0,0,0,0,0,0,0,0,0,0,0,0,0,0,0,0,0,0,0,0,0,0,0,0,0,0,0,0,0,0,0,0,0,0,0,0,0,0,0,0,0,0,0,0,0,0,0,0,0,0,0,0,0,0,0,0,0,0,0,0,0,0,0,0,0,0,0,0,0,0,0,0,0,0,0,0,0,0,0,0,0,0,0,0,0,0,0,0,0,0,0,0,0,0,0,0,0,0,0,0,0,0,0,0,0,0,0,0,0,0,0,0,0,0,0,0,0,0,0,0,0,0,0,0,0,0,0,0,0,0,0,0,0,0,0,0,0,0,0,0,0,0,0,0,0,0,0,0,0,0,0,0,0,0,0,0,0,0,0,0,0,0,0,0,0,0,0,0,0,0,0,0,0,0,0,0,0,0,0,0,0,0,0,0,0,0,0,0,0,0,0,0,0,64]
[null,65,0,0,0,0,0,0,0,0,0,0,0,0,0,0,0,0,0,0,0,0,0,0,0,0,0,0,0,0,0,0,0,0,0,0,0,0,0,0,0,0,0,0,0,0,0,0,0,0,0,0,0,0,0,0,0,0,0,0,0,0,0,0,0,0,0,0,0,0,0,0,0,0,0,0,0,0,0,0,0,0,0,0,0,0,0,0,0,0,0,0,0,0,0,0,0,0,0,0,0,0,0,0,0,0,0,0,0,0,0,0,0,0,0,0,0,0,0,0,0,0,0,0,0,0,0,0,0,0,0,0,0,0,0,0,0,0,0,0,0,0,0,0,0,0,0,0,0,0,0,0,0,0,0,0,0,0,0,0,0,0,0,0,0,0,0,0,0,0,0,0,0,0,0,0,0,0,0,0,0,0,0,0,0,0,0,0,0,0,0,0,0,0,0,0,0,0,0,0,0,0,0,0,0,0,0,0,0,0,0,0,0,0,0,0,0,0,0,0,0,0,0,0,0,0,0,0,0,0,0,0,0,0,0,0,0,0,0,0,0,0,0,0,0,0,0,0,0,0,0,0,0,0,0,0,0,0,0,0,0,0,0,0,0,0,65]
[null,66,0,0,0,0,0,0,0,0,0,0,0,0,0,0,0,0,0,0,0,0,0,0,0,0,0,0,0,0,0,0,0,0,0,0,0,0,0,0,0,0,0,0,0,0,0,0,0,0,0,0,0,0,0,0,0,0,0,0,0,0,0,0,0,0,0,0,0,0,0,0,0,0,0,0,0,0,0,0,0,0,0,0,0,0,0,0,0,0,0,0,0,0,0,0,0,0,0,0,0,0,0,0,0,0,0,0,0,0,0,0,0,0,0,0,0,0,0,0,0,0,0,0,0,0,0,0,0,0,0,0,0,0,0,0,0,0,0,0,0,0,0,0,0,0,0,0,0,0,0,0,0,0,0,0,0,0,0,0,0,0,0,0,0,0,0,0,0,0,0,0,0,0,0,0,0,0,0,0,0,0,0,0,0,0,0,0,0,0,0,0,0,0,0,0,0,0,0,0,0,0,0,0,0,0,0,0,0,0,0,0,0,0,0,0,0,0,0,0,0,0,0,0,0,0,0,0,0,0,0,0,0,0,0,0,0,0,0,0,0,0,0,0,0,0,0,0,0,0,0,0,0,0,0,0,0,0,0,0,0,0,0,0,0,0,66]
[null,67,0,0,0,0,0,0,0,0,0,0,0,0,0,0,0,0,0,0,0,0,0,0,0,0,0,0,0,0,0,0,0,0,0,0,0,0,0,0,0,0,0,0,0,0,0,0,0,0,0,0,0,0,0,0,0,0,0,0,0,0,0,0,0,0,0,0,0,0,0,0,0,0,0,0,0,0,0,0,0,0,0,0,0,0,0,0,0,0,0,0,0,0,0,0,0,0,0,0,0,0,0,0,0,0,0,0,0,0,0,0,0,0,0,0,0,0,0,0,0,0,0,0,0,0,0,0,0,0,0,0,0,0,0,0,0,0,0,0,0,0,0,0,0,0,0,0,0,0,0,0,0,0,0,0,0,0,0,0,0,0,0,0,0,0,0,0,0,0,0,0,0,0,0,0,0,0,0,0,0,0,0,0,0,0,0,0,0,0,0,0,0,0,0,0,0,0,0,0,0,0,0,0,0,0,0,0,0,0,0,0,0,0,0,0,0,0,0,0,0,0,0,0,0,0,0,0,0,0,0,0,0,0,0,0,0,0,0,0,0,0,0,0,0,0,0,0,0,0,0,0,0,0,0,0,0,0,0,0,0,0,0,0,0,0,67]
[null,68,0,0,0,0,0,0,0,0,0,0,0,0,0,0,0,0,0,0,0,0,0,0,0,0,0,0,0,0,0,0,0,0,0,0,0,0,0,0,0,0,0,0,0,0,0,0,0,0,0,0,0,0,0,0,0,0,0,0,0,0,0,0,0,0,0,0,0,0,0,0,0,0,0,0,0,0,0,0,0,0,0,0,0,0,0,0,0,0,0,0,0,0,0,0,0,0,0,0,0,0,0,0,0,0,0,0,0,0,0,0,0,0,0,0,0,0,0,0,0,0,0,0,0,0,0,0,0,0,0,0,0,0,0,0,0,0,0,0,0,0,0,0,0,0,0,0,0,0,0,0,0,0,0,0,0,0,0,0,0,0,0,0,0,0,0,0,0,0,0,0,0,0,0,0,0,0,0,0,0,0,0,0,0,0,0,0,0,0,0,0,0,0,0,0,0,0,0,0,0,0,0,0,0,0,0,0,0,0,0,0,0,0,0,0,0,0,0,0,0,0,0,0,0,0,0,0,0,0,0,0,0,0,0,0,0,0,0,0,0,0,0,0,0,0,0,0,0,0,0,0,0,0,0,0,0,0,0,0,0,0,0,0,0,0,68]
[null,69,0,0,0,0,0,0,0,0,0,0,0,0,0,0,0,0,0,0,0,0,0,0,0,0,0,0,0,0,0,0,0,0,0,0,0,0,0,0,0,0,0,0,0,0,0,0,0,0,0,0,0,0,0,0,0,0,0,0,0,0,0,0,0,0,0,0,0,0,0,0,0,0,0,0,0,0,0,0,0,0,0,0,0,0,0,0,0,0,0,0,0,0,0,0,0,0,0,0,0,0,0,0,0,0,0,0,0,0,0,0,0,0,0,0,0,0,0,0,0,0,0,0,0,0,0,0,0,0,0,0,0,0,0,0,0,0,0,0,0,0,0,0,0,0,0,0,0,0,0,0,0,0,0,0,0,0,0,0,0,0,0,0,0,0,0,0,0,0,0,0,0,0,0,0,0,0,0,0,0,0,0,0,0,0,0,0,0,0,0,0,0,0,0,0,0,0,0,0,0,0,0,0,0,0,0,0,0,0,0,0,0,0,0,0,0,0,0,0,0,0,0,0,0,0,0,0,0,0,0,0,0,0,0,0,0,0,0,0,0,0,0,0,0,0,0,0,0,0,0,0,0,0,0,0,0,0,0,0,0,0,0,0,0,0,69]
[null,70,0,0,0,0,0,0,0,0,0,0,0,0,0,0,0,0,0,0,0,0,0,0,0,0,0,0,0,0,0,0,0,0,0,0,0,0,0,0,0,0,0,0,0,0,0,0,0,0,0,0,0,0,0,0,0,0,0,0,0,0,0,0,{"$f":"IF(AND(($C$2/(BM$30+1))>=$G$4,($C$2/(BM$30+1))<=$H$4,($C$2/(BM$30+1)*($B70+16))>=$I$4,($C$2/(BM$30+1)*($B70+16))<=$J$4,($C$2/(BM$30+1)*($B70+16)/(BM$31+1))=$C$3,($C$2/(BM$30+1)*($B70+16)/(BM$31+1))<=$C$4),-1,0)","v":0},0,0,0,0,0,0,0,0,0,0,0,0,0,0,0,0,0,0,0,0,0,0,0,0,0,0,0,0,0,0,0,0,0,0,0,0,0,0,0,0,0,0,0,0,0,0,0,{"$f":"IF(AND(($C$2/(DI$30+1))>=$G$4,($C$2/(DI$30+1))<=$H$4,($C$2/(DI$30+1)*($B70+16))>=$I$4,($C$2/(DI$30+1)*($B70+16))<=$J$4,($C$2/(DI$30+1)*($B70+16)/(DI$31+1))=$C$3,($C$2/(DI$30+1)*($B70+16)/(DI$31+1))<=$C$4),-1,0)","v":0},0,0,0,0,0,0,0,0,0,0,0,0,0,0,0,0,0,0,0,0,0,0,0,0,0,0,0,0,0,0,0,0,0,0,0,0,0,0,0,0,0,0,0,0,0,0,{"$f":"IF(AND(($C$2/(FD$30+1))>=$G$4,($C$2/(FD$30+1))<=$H$4,($C$2/(FD$30+1)*($B70+16))>=$I$4,($C$2/(FD$30+1)*($B70+16))<=$J$4,($C$2/(FD$30+1)*($B70+16)/(FD$31+1))=$C$3,($C$2/(FD$30+1)*($B70+16)/(FD$31+1))<=$C$4),-1,0)","v":0},0,0,0,0,0,0,0,0,0,0,0,0,0,0,0,0,0,0,0,0,0,0,0,0,0,0,0,0,0,0,0,0,{"$f":"IF(AND(($C$2/(GK$30+1))>=$G$4,($C$2/(GK$30+1))<=$H$4,($C$2/(GK$30+1)*($B70+16))>=$I$4,($C$2/(GK$30+1)*($B70+16))<=$J$4,($C$2/(GK$30+1)*($B70+16)/(GK$31+1))=$C$3,($C$2/(GK$30+1)*($B70+16)/(GK$31+1))<=$C$4),-1,0)","v":0},0,0,0,0,0,0,0,0,0,0,0,0,0,0,0,0,0,0,0,0,0,0,0,0,0,0,0,0,0,0,0,0,0,0,0,0,0,0,0,0,0,0,0,0,0,0,0,0,0,0,0,0,0,0,0,0,0,0,0,0,0,0,0,{"$f":"IF(AND(($C$2/(IW$30+1))>=$G$4,($C$2/(IW$30+1))<=$H$4,($C$2/(IW$30+1)*($B70+16))>=$I$4,($C$2/(IW$30+1)*($B70+16))<=$J$4,($C$2/(IW$30+1)*($B70+16)/(IW$31+1))=$C$3,($C$2/(IW$30+1)*($B70+16)/(IW$31+1))<=$C$4),-1,0)","v":0},0,0,0,0,0,0,0,0,0,70]
[null,71,0,0,0,0,0,0,0,0,0,0,0,0,0,0,0,{"$f":"IF(AND(($C$2/(R$30+1))>=$G$4,($C$2/(R$30+1))<=$H$4,($C$2/(R$30+1)*($B71+16))>=$I$4,($C$2/(R$30+1)*($B71+16))<=$J$4,($C$2/(R$30+1)*($B71+16)/(R$31+1))=$C$3,($C$2/(R$30+1)*($B71+16)/(R$31+1))<=$C$4),-1,0)","v":0},0,0,0,0,0,0,0,0,0,0,0,0,0,0,0,0,0,0,0,0,0,0,0,0,0,0,0,0,0,0,0,{"$f":"IF(AND(($C$2/(AX$30+1))>=$G$4,($C$2/(AX$30+1))<=$H$4,($C$2/(AX$30+1)*($B71+16))>=$I$4,($C$2/(AX$30+1)*($B71+16))<=$J$4,($C$2/(AX$30+1)*($B71+16)/(AX$31+1))=$C$3,($C$2/(AX$30+1)*($B71+16)/(AX$31+1))<=$C$4),-1,0)","v":0},0,0,0,0,0,0,0,0,0,0,0,0,0,0,0,0,0,0,0,0,0,0,0,0,0,0,0,0,0,0,0,0,0,0,0,0,0,0,0,0,0,0,0,0,0,0,0,0,0,0,0,0,0,0,0,0,0,0,0,0,{"$f":"IF(AND(($C$2/(DG$30+1))>=$G$4,($C$2/(DG$30+1))<=$H$4,($C$2/(DG$30+1)*($B71+16))>=$I$4,($C$2/(DG$30+1)*($B71+16))<=$J$4,($C$2/(DG$30+1)*($B71+16)/(DG$31+1))=$C$3,($C$2/(DG$30+1)*($B71+16)/(DG$31+1))<=$C$4),-1,0)","v":0},0,0,0,0,0,0,0,0,0,0,0,0,0,0,0,0,0,0,0,0,0,0,0,0,0,0,0,0,0,0,0,0,0,{"$f":"IF(AND(($C$2/(EO$30+1))>=$G$4,($C$2/(EO$30+1))<=$H$4,($C$2/(EO$30+1)*($B71+16))>=$I$4,($C$2/(EO$30+1)*($B71+16))<=$J$4,($C$2/(EO$30+1)*($B71+16)/(EO$31+1))=$C$3,($C$2/(EO$30+1)*($B71+16)/(EO$31+1))<=$C$4),-1,0)","v":0},0,0,0,0,0,0,0,0,0,0,0,0,0,0,0,0,0,0,0,0,0,0,0,0,0,0,0,0,0,0,0,0,0,0,0,0,0,0,0,0,0,0,0,0,0,0,{"$f":"IF(AND(($C$2/(GJ$30+1))>=$G$4,($C$2/(GJ$30+1))<=$H$4,($C$2/(GJ$30+1)*($B71+16))>=$I$4,($C$2/(GJ$30+1)*($B71+16))<=$J$4,($C$2/(GJ$30+1)*($B71+16)/(GJ$31+1))=$C$3,($C$2/(GJ$30+1)*($B71+16)/(GJ$31+1))<=$C$4),-1,0)","v":0},0,0,0,0,0,0,0,0,0,0,0,0,0,0,0,0,0,0,0,0,0,0,0,0,0,0,0,0,0,0,0,0,0,0,0,0,0,0,0,0,0,0,0,0,0,0,0,0,0,0,0,0,0,0,0,0,0,0,0,0,0,0,0,{"$f":"IF(AND(($C$2/(IV$30+1))>=$G$4,($C$2/(IV$30+1))<=$H$4,($C$2/(IV$30+1)*($B71+16))>=$I$4,($C$2/(IV$30+1)*($B71+16))<=$J$4,($C$2/(IV$30+1)*($B71+16)/(IV$31+1))=$C$3,($C$2/(IV$30+1)*($B71+16)/(IV$31+1))<=$C$4),-1,0)","v":0},0,0,0,0,0,0,0,0,0,0,71]
[null,72,{"$f":"IF(AND(($C$2/(C$30+1))>=$G$4,($C$2/(C$30+1))<=$H$4,($C$2/(C$30+1)*($B72+16))>=$I$4,($C$2/(C$30+1)*($B72+16))<=$J$4,($C$2/(C$30+1)*($B72+16)/(C$31+1))=$C$3,($C$2/(C$30+1)*($B72+16)/(C$31+1))<=$C$4),-1,0)","v":0},0,0,0,0,0,0,0,0,0,0,0,0,0,0,0,0,0,0,0,0,0,0,0,0,0,0,0,0,0,0,0,0,0,0,0,0,0,0,0,0,0,0,0,0,0,0,0,0,0,0,0,0,0,0,0,0,0,0,0,0,0,0,0,0,0,0,0,0,0,0,0,0,0,0,0,0,0,0,0,0,0,0,0,0,0,0,0,0,0,0,0,0,{"$f":"IF(AND(($C$2/(CR$30+1))>=$G$4,($C$2/(CR$30+1))<=$H$4,($C$2/(CR$30+1)*($B72+16))>=$I$4,($C$2/(CR$30+1)*($B72+16))<=$J$4,($C$2/(CR$30+1)*($B72+16)/(CR$31+1))=$C$3,($C$2/(CR$30+1)*($B72+16)/(CR$31+1))<=$C$4),-1,0)","v":0},0,0,0,0,0,0,0,0,0,0,0,0,0,0,0,0,0,0,0,0,0,0,0,0,0,0,0,0,0,0,0,0,0,0,0,0,0,0,0,0,0,0,0,0,0,{"$f":"IF(AND(($C$2/(EL$30+1))>=$G$4,($C$2/(EL$30+1))<=$H$4,($C$2/(EL$30+1)*($B72+16))>=$I$4,($C$2/(EL$30+1)*($B72+16))<=$J$4,($C$2/(EL$30+1)*($B72+16)/(EL$31+1))=$C$3,($C$2/(EL$30+1)*($B72+16)/(EL$31+1))<=$C$4),-1,0)","v":0},0,0,0,0,0,0,0,0,0,0,0,0,0,0,0,0,0,0,0,0,0,0,0,0,0,0,0,0,0,0,0,0,0,0,0,{"$f":"IF(AND(($C$2/(FV$30+1))>=$G$4,($C$2/(FV$30+1))<=$H$4,($C$2/(FV$30+1)*($B72+16))>=$I$4,($C$2/(FV$30+1)*($B72+16))<=$J$4,($C$2/(FV$30+1)*($B72+16)/(FV$31+1))=$C$3,($C$2/(FV$30+1)*($B72+16)/(FV$31+1))<=$C$4),-1,0)","v":0},0,0,0,0,0,0,0,0,0,0,0,0,0,0,0,0,0,0,0,0,{"$f":"IF(AND(($C$2/(GQ$30+1))>=$G$4,($C$2/(GQ$30+1))<=$H$4,($C$2/(GQ$30+1)*($B72+16))>=$I$4,($C$2/(GQ$30+1)*($B72+16))<=$J$4,($C$2/(GQ$30+1)*($B72+16)/(GQ$31+1))=$C$3,($C$2/(GQ$30+1)*($B72+16)/(GQ$31+1))<=$C$4),-1,0)","v":0},0,0,0,0,0,0,0,0,0,0,0,0,0,0,0,0,0,0,0,0,0,0,0,0,0,0,0,0,0,0,0,0,0,0,0,0,0,0,0,0,0,0,{"$f":"IF(AND(($C$2/(IH$30+1))>=$G$4,($C$2/(IH$30+1))<=$H$4,($C$2/(IH$30+1)*($B72+16))>=$I$4,($C$2/(IH$30+1)*($B72+16))<=$J$4,($C$2/(IH$30+1)*($B72+16)/(IH$31+1))=$C$3,($C$2/(IH$30+1)*($B72+16)/(IH$31+1))<=$C$4),-1,0)","v":0},0,0,0,0,0,0,0,0,0,0,0,0,0,0,0,0,0,0,0,0,0,0,0,0,72]
[null,73,0,0,0,0,0,0,0,0,0,0,0,0,0,0,0,0,0,0,0,0,0,0,0,0,0,0,0,0,0,0,0,0,0,0,0,0,0,0,0,0,0,0,0,0,0,0,0,0,0,0,0,0,0,0,0,0,0,0,0,0,0,0,0,0,0,0,0,{"$f":"IF(AND(($C$2/(BR$30+1))>=$G$4,($C$2/(BR$30+1))<=$H$4,($C$2/(BR$30+1)*($B73+16))>=$I$4,($C$2/(BR$30+1)*($B73+16))<=$J$4,($C$2/(BR$30+1)*($B73+16)/(BR$31+1))=$C$3,($C$2/(BR$30+1)*($B73+16)/(BR$31+1))<=$C$4),-1,0)","v":0},0,0,0,0,0,0,0,0,0,0,0,0,0,0,0,0,0,0,0,0,0,0,0,0,0,0,0,0,0,0,0,0,0,0,0,0,0,0,0,0,0,0,0,0,0,0,0,0,0,0,0,0,0,0,0,0,0,0,0,{"$f":"IF(AND(($C$2/(DZ$30+1))>=$G$4,($C$2/(DZ$30+1))<=$H$4,($C$2/(DZ$30+1)*($B73+16))>=$I$4,($C$2/(DZ$30+1)*($B73+16))<=$J$4,($C$2/(DZ$30+1)*($B73+16)/(DZ$31+1))=$C$3,($C$2/(DZ$30+1)*($B73+16)/(DZ$31+1))<=$C$4),-1,0)","v":0},0,0,0,0,0,0,0,0,0,0,0,0,0,0,0,0,0,0,0,0,0,0,0,0,0,0,0,0,0,0,0,0,0,0,0,0,0,0,0,0,0,0,0,0,0,0,0,0,0,0,0,0,0,0,0,0,0,0,0,0,0,0,0,0,0,0,0,0,0,0,0,0,0,0,0,0,0,0,0,0,0,0,0,0,0,0,0,0,0,0,0,0,0,0,0,0,0,0,0,0,0,0,0,0,0,0,0,0,0,0,0,0,0,0,0,0,0,0,0,0,0,0,0,0,0,0,0,0,0,0,0,0,0,0,0,0,73]
[null,74,0,0,0,0,0,0,0,0,0,0,0,0,0,0,0,0,0,0,0,0,0,0,0,0,0,0,0,0,0,0,0,0,0,0,0,{"$f":"IF(AND(($C$2/(AL$30+1))>=$G$4,($C$2/(AL$30+1))<=$H$4,($C$2/(AL$30+1)*($B74+16))>=$I$4,($C$2/(AL$30+1)*($B74+16))<=$J$4,($C$2/(AL$30+1)*($B74+16)/(AL$31+1))=$C$3,($C$2/(AL$30+1)*($B74+16)/(AL$31+1))<=$C$4),-1,0)","v":0},0,0,0,0,0,0,0,0,0,0,0,0,0,0,0,0,0,0,0,0,0,0,0,0,0,0,0,0,0,0,0,0,0,0,-1,0,0,0,0,0,0,0,0,0,0,0,0,0,0,0,0,0,0,0,0,0,0,0,0,0,0,0,0,0,0,0,-1,0,0,0,0,0,0,0,0,0,0,0,0,0,0,0,0,0,0,0,0,0,0,0,0,0,0,0,0,0,0,0,0,0,0,0,0,0,0,0,0,0,0,0,0,0,0,0,0,0,0,0,0,0,0,0,0,0,0,0,0,0,0,0,0,0,0,0,0,0,0,0,0,0,0,0,0,0,0,0,0,0,0,0,0,0,0,0,0,0,0,0,0,0,0,0,0,0,0,0,0,0,0,0,0,0,0,0,0,0,0,0,0,0,0,0,0,0,0,0,0,0,0,0,0,0,0,0,0,0,0,0,0,0,0,0,0,0,0,0,0,0,0,0,0,0,0,0,0,0,0,0,0,0,0,0,0,0,0,0,0,0,74]
[null,75,0,0,0,0,0,0,0,0,0,0,0,0,0,0,0,0,0,0,0,0,0,0,0,0,0,0,0,0,0,0,0,{"$f":"IF(AND(($C$2/(AH$30+1))>=$G$4,($C$2/(AH$30+1))<=$H$4,($C$2/(AH$30+1)*($B75+16))>=$I$4,($C$2/(AH$30+1)*($B75+16))<=$J$4,($C$2/(AH$30+1)*($B75+16)/(AH$31+1))=$C$3,($C$2/(AH$30+1)*($B75+16)/(AH$31+1))<=$C$4),-1,0)","v":0},0,0,0,0,0,0,0,0,0,0,0,0,0,0,0,0,0,0,0,0,0,0,0,0,0,0,0,0,0,0,0,0,0,0,0,0,0,0,0,0,0,0,0,0,0,0,0,0,0,0,0,0,0,0,0,0,0,0,0,0,0,0,0,0,0,0,0,0,0,0,0,0,0,0,0,0,0,0,0,0,0,0,0,0,0,0,0,0,0,0,0,0,0,0,0,0,0,0,0,0,0,0,0,0,0,0,0,0,0,0,0,0,0,0,0,0,0,0,0,0,0,0,0,0,0,0,0,0,0,0,0,0,0,0,0,0,0,0,0,0,0,0,0,0,0,0,0,0,0,0,0,0,0,0,0,0,0,0,0,0,0,0,0,0,0,0,0,0,0,0,0,0,0,0,0,0,0,0,0,0,0,0,0,0,0,0,0,{"$f":"IF(AND(($C$2/(HN$30+1))>=$G$4,($C$2/(HN$30+1))<=$H$4,($C$2/(HN$30+1)*($B75+16))>=$I$4,($C$2/(HN$30+1)*($B75+16))<=$J$4,($C$2/(HN$30+1)*($B75+16)/(HN$31+1))=$C$3,($C$2/(HN$30+1)*($B75+16)/(HN$31+1))<=$C$4),-1,0)","v":0},0,0,0,0,0,0,0,0,0,0,0,0,0,0,0,0,0,0,0,0,0,0,0,0,0,0,0,0,0,0,0,0,0,0,0,0,0,0,0,0,0,{"$f":"IF(AND(($C$2/(JD$30+1))>=$G$4,($C$2/(JD$30+1))<=$H$4,($C$2/(JD$30+1)*($B75+16))>=$I$4,($C$2/(JD$30+1)*($B75+16))<=$J$4,($C$2/(JD$30+1)*($B75+16)/(JD$31+1))=$C$3,($C$2/(JD$30+1)*($B75+16)/(JD$31+1))<=$C$4),-1,0)","v":0},0,0,75]
[null,76,0,0,0,0,0,0,0,0,0,0,0,0,0,0,0,0,0,0,0,0,0,0,0,0,0,0,0,0,0,0,0,0,0,0,0,0,0,0,0,0,0,0,0,0,0,0,0,0,0,0,0,0,0,0,0,0,0,0,0,0,0,0,0,0,0,0,0,0,0,0,0,0,0,0,0,0,0,0,0,0,0,0,0,0,{"$f":"IF(AND(($C$2/(CI$30+1))>=$G$4,($C$2/(CI$30+1))<=$H$4,($C$2/(CI$30+1)*($B76+16))>=$I$4,($C$2/(CI$30+1)*($B76+16))<=$J$4,($C$2/(CI$30+1)*($B76+16)/(CI$31+1))=$C$3,($C$2/(CI$30+1)*($B76+16)/(CI$31+1))<=$C$4),-1,0)","v":0},0,0,0,0,0,0,0,0,0,0,0,0,0,0,0,0,0,0,0,0,0,0,0,0,0,0,0,0,0,0,0,0,0,0,0,0,0,0,0,0,0,0,0,0,0,0,0,0,0,0,0,0,0,0,0,0,0,0,0,0,0,0,0,0,0,0,0,0,0,0,0,0,0,0,0,0,0,0,0,0,0,0,0,0,0,0,0,0,0,0,0,0,0,0,0,0,0,0,0,0,0,0,0,0,0,0,0,0,0,0,0,0,0,0,0,0,0,0,0,0,0,0,0,0,0,0,0,{"$f":"IF(AND(($C$2/(HG$30+1))>=$G$4,($C$2/(HG$30+1))<=$H$4,($C$2/(HG$30+1)*($B76+16))>=$I$4,($C$2/(HG$30+1)*($B76+16))<=$J$4,($C$2/(HG$30+1)*($B76+16)/(HG$31+1))=$C$3,($C$2/(HG$30+1)*($B76+16)/(HG$31+1))<=$C$4),-1,0)","v":0},0,0,0,0,0,0,0,0,0,0,0,0,0,0,0,0,0,0,0,0,0,0,0,0,0,0,0,0,0,0,0,0,0,0,0,0,0,0,0,0,0,0,0,0,0,0,0,0,0,0,0,76]
[null,77,0,0,0,0,0,0,0,0,0,0,0,0,0,0,0,0,0,0,0,0,0,0,0,0,0,0,0,0,0,0,0,0,0,0,0,0,0,0,0,0,0,0,0,0,0,0,0,0,0,0,0,0,0,0,0,0,0,0,0,0,0,0,0,0,0,0,0,0,0,0,0,0,0,0,0,0,0,0,0,0,0,0,0,{"$f":"IF(AND(($C$2/(CH$30+1))>=$G$4,($C$2/(CH$30+1))<=$H$4,($C$2/(CH$30+1)*($B77+16))>=$I$4,($C$2/(CH$30+1)*($B77+16))<=$J$4,($C$2/(CH$30+1)*($B77+16)/(CH$31+1))=$C$3,($C$2/(CH$30+1)*($B77+16)/(CH$31+1))<=$C$4),-1,0)","v":0},0,0,0,0,0,0,0,0,0,0,0,0,0,0,0,0,0,0,0,0,0,0,0,0,0,0,0,0,0,0,0,0,0,0,0,0,0,0,0,0,0,0,0,0,0,0,0,0,0,0,0,0,0,0,0,0,0,0,0,0,0,0,0,0,0,0,0,0,0,0,0,0,0,0,0,0,0,0,0,0,0,0,0,0,0,0,0,0,0,0,0,0,0,0,0,0,0,0,0,0,0,0,0,0,0,0,0,0,0,0,0,0,0,0,0,0,0,0,0,0,0,0,0,0,0,0,0,0,0,0,0,0,0,0,0,0,0,0,0,0,0,0,0,0,0,0,0,0,0,0,0,0,0,0,0,0,0,0,0,0,0,0,0,0,0,0,0,0,0,0,0,0,0,0,0,0,0,0,0,0,77]
[null,78,0,0,0,0,0,0,0,0,0,0,0,0,0,0,0,0,0,0,0,0,0,0,0,0,0,0,0,0,0,0,0,0,0,0,0,0,0,0,0,0,0,0,0,0,0,0,0,0,0,0,0,0,0,0,0,0,0,0,0,0,0,0,0,0,0,0,0,0,0,0,0,0,0,0,0,0,0,0,0,0,0,0,0,0,0,0,0,0,0,0,0,0,0,0,0,0,0,0,0,0,0,0,0,0,0,0,0,0,0,0,0,0,0,0,0,0,0,0,0,0,0,0,0,0,0,0,0,0,0,0,0,0,0,0,0,0,0,0,0,0,0,0,0,0,0,0,0,0,0,0,0,0,0,0,0,0,0,0,0,0,0,0,0,0,0,0,0,0,0,0,0,0,0,0,0,0,0,0,0,0,0,0,0,0,0,0,0,0,0,0,0,0,0,0,0,0,0,0,0,0,0,0,0,0,0,0,0,0,0,0,0,0,0,0,0,0,0,0,0,0,0,0,0,0,0,0,0,0,0,0,0,0,0,0,0,0,0,0,0,0,0,0,0,0,0,0,0,0,0,0,0,0,0,0,0,0,0,0,0,0,0,0,0,0,78]
[null,79,0,0,0,0,0,0,0,0,0,0,0,0,0,0,0,0,0,0,0,0,0,0,0,0,0,0,0,0,0,0,0,0,0,0,0,0,0,0,0,0,0,0,0,0,0,0,0,0,0,0,0,0,0,0,0,0,0,0,0,0,0,0,0,0,0,0,0,0,0,0,0,0,0,0,0,0,0,0,0,0,0,0,0,0,0,0,0,0,0,0,0,0,0,0,0,0,0,0,0,0,0,0,0,0,0,0,0,0,0,0,0,0,0,0,0,0,0,0,0,0,0,0,0,0,0,0,0,0,0,0,0,0,0,0,0,0,0,0,0,0,0,0,0,0,0,0,0,0,0,0,0,0,0,0,0,0,0,0,0,0,0,0,0,0,0,0,0,0,0,0,0,0,0,0,0,0,0,0,0,0,0,0,0,0,0,0,0,0,0,0,0,0,0,0,0,0,0,0,0,0,0,0,0,0,0,0,0,0,0,0,0,0,0,0,0,0,0,0,0,0,0,0,0,0,0,0,0,0,0,0,0,0,0,0,0,0,0,0,0,0,0,0,0,0,0,0,0,0,0,0,0,0,0,0,0,0,0,0,0,0,0,0,0,0,79]
[null,80,0,0,0,0,0,0,0,0,0,0,0,0,0,0,0,0,0,0,0,0,0,0,0,0,0,0,0,0,0,0,0,0,0,0,0,0,0,0,0,0,0,0,0,0,0,0,0,0,0,0,0,0,0,0,0,0,0,0,0,0,0,0,0,0,0,0,0,0,0,0,0,0,0,0,0,0,0,0,0,0,0,0,0,0,0,0,0,0,0,0,0,0,0,0,0,0,0,0,0,0,0,0,0,0,0,0,0,0,0,0,0,0,0,0,0,0,0,0,0,0,0,0,0,0,0,0,0,0,0,0,0,0,0,0,0,0,0,0,0,0,0,0,0,0,0,0,0,0,0,0,0,0,0,0,0,0,0,0,0,0,0,0,0,0,0,0,0,0,0,0,0,0,0,0,0,0,0,0,0,0,0,0,0,0,0,0,0,0,0,0,0,0,0,0,0,0,0,0,0,0,0,0,0,0,0,0,0,0,0,0,0,0,0,0,0,0,0,0,0,0,0,0,0,0,0,0,0,0,0,0,0,0,0,0,0,0,0,0,0,0,0,0,0,0,0,0,0,0,0,0,0,0,0,0,0,0,0,0,0,0,0,0,0,0,80]
[null,81,0,0,0,0,0,0,0,0,0,0,0,0,0,0,0,0,0,0,0,0,0,0,0,0,0,0,0,0,0,0,0,0,0,0,0,0,0,0,0,0,0,0,0,0,0,0,0,0,0,0,0,0,0,0,0,0,0,0,0,0,0,0,0,0,0,0,0,0,0,0,0,0,0,0,0,0,0,0,0,0,0,0,0,0,0,0,0,0,0,0,0,0,0,0,0,0,0,0,0,0,0,0,0,0,0,0,0,0,0,0,0,0,0,0,0,0,0,0,0,0,0,0,0,0,0,0,0,0,0,0,0,0,0,0,0,0,0,0,0,0,0,0,0,0,0,0,0,0,0,0,0,0,0,0,0,0,0,0,0,0,0,0,0,0,0,0,0,0,0,0,0,0,0,0,0,0,0,0,0,0,0,0,0,0,0,0,0,0,0,0,0,0,0,0,0,0,0,0,0,0,0,0,0,0,0,0,0,0,0,0,0,0,0,0,0,0,0,0,0,0,0,0,0,0,0,0,0,0,0,0,0,0,0,0,0,0,0,0,0,0,0,0,0,0,0,0,0,0,0,0,0,0,0,0,0,0,0,0,0,0,0,0,0,0,81]
[null,82,0,0,0,0,0,0,0,0,0,0,0,0,0,0,0,0,0,0,0,0,0,0,0,0,0,0,0,0,0,0,0,0,0,0,0,0,0,0,0,0,0,0,0,0,0,0,0,0,0,0,0,0,0,0,0,0,0,0,0,0,0,0,0,0,0,0,0,0,0,0,0,0,0,0,0,0,0,0,0,0,0,0,0,0,0,0,0,0,0,0,0,0,0,0,0,0,0,0,0,0,0,0,0,0,0,0,0,0,0,0,0,0,0,0,0,0,0,0,0,0,0,0,0,0,0,0,0,0,0,0,0,0,0,0,0,0,0,0,0,0,0,0,0,0,0,0,0,0,0,0,0,0,0,0,0,0,0,0,0,0,0,0,0,0,0,0,0,0,0,0,0,0,0,0,0,0,0,0,0,0,0,0,0,0,0,0,0,0,0,0,0,0,0,0,0,0,0,0,0,0,0,0,0,0,0,0,0,0,0,0,0,0,0,0,0,0,0,0,0,0,0,0,0,0,0,0,0,0,0,0,0,0,0,0,0,0,0,0,0,0,0,0,0,0,0,0,0,0,0,0,0,0,0,0,0,0,0,0,0,0,0,0,0,0,82]
[null,83,0,0,0,0,0,0,0,0,0,0,0,0,0,0,0,0,0,0,0,0,0,0,0,0,0,0,0,0,0,0,0,0,0,0,0,0,0,0,0,0,0,0,0,0,0,0,0,0,0,0,0,0,0,0,0,0,0,0,0,0,0,0,0,0,0,0,0,0,0,0,0,0,0,0,0,0,0,0,0,0,0,0,0,0,0,0,0,0,0,0,0,0,0,0,0,0,0,0,0,0,0,0,0,0,0,0,0,0,0,0,0,0,0,0,0,0,0,0,0,0,0,0,0,0,0,0,0,0,0,0,0,0,0,0,0,0,0,0,0,0,0,0,0,0,0,0,0,0,0,0,0,0,0,0,0,0,0,0,0,0,0,0,0,0,0,0,0,0,0,0,0,0,0,0,0,0,0,0,0,0,0,0,0,0,0,0,0,0,0,0,0,0,0,0,0,0,0,0,0,0,0,0,0,0,0,0,0,0,0,0,0,0,0,0,0,0,0,0,0,0,0,0,0,0,0,0,0,0,0,0,0,0,0,0,0,0,0,0,0,0,0,0,0,0,0,0,0,0,0,0,0,0,0,0,0,0,0,0,0,0,0,0,0,0,83]
[null,84,0,0,0,0,0,0,0,0,0,0,0,0,0,0,0,0,0,0,0,0,0,0,0,0,0,0,0,0,0,0,0,0,0,0,0,0,0,0,0,0,0,0,0,0,0,0,0,0,0,0,0,0,0,0,0,0,0,0,0,0,0,0,0,0,0,0,0,0,0,0,0,0,0,0,0,0,0,0,0,0,0,0,0,0,0,0,0,0,0,0,0,0,0,0,0,0,0,0,0,0,0,0,0,0,0,0,0,0,0,0,0,0,0,0,0,0,0,0,0,0,0,0,0,0,0,0,0,0,0,0,0,0,0,0,0,0,0,0,0,0,0,0,0,0,0,0,0,0,0,0,0,0,0,0,0,0,0,0,0,0,0,0,0,0,0,0,0,0,0,0,0,0,0,0,0,0,0,0,0,0,0,0,0,0,0,0,0,0,0,0,0,0,0,0,0,0,0,0,0,0,0,0,0,0,0,0,0,0,0,0,0,0,0,0,0,0,0,0,0,0,0,0,0,0,0,0,0,0,0,0,0,0,0,0,0,0,0,0,0,0,0,0,0,0,0,0,0,0,0,0,0,0,0,0,0,0,0,0,0,0,0,0,0,0,84]
[null,85,0,0,0,0,0,0,0,0,0,0,0,0,0,0,0,0,0,0,0,0,0,0,0,0,0,0,0,0,0,0,0,0,0,0,0,0,0,0,0,0,0,0,0,0,0,0,0,0,0,0,0,0,0,0,0,0,0,0,0,0,0,0,0,0,0,0,0,0,0,0,0,0,0,0,0,0,0,0,0,0,0,0,0,0,0,0,0,0,0,0,0,0,0,0,0,0,0,0,0,0,0,0,0,0,0,0,0,0,0,0,0,0,0,0,0,0,0,0,0,0,0,0,0,0,0,0,0,0,0,0,0,0,0,0,0,0,0,0,0,0,0,0,0,0,0,0,0,0,0,0,0,0,0,0,0,0,0,0,0,0,0,0,0,0,0,0,0,0,0,0,0,0,0,0,{"$f":"IF(AND(($C$2/(FU$30+1))>=$G$4,($C$2/(FU$30+1))<=$H$4,($C$2/(FU$30+1)*($B85+16))>=$I$4,($C$2/(FU$30+1)*($B85+16))<=$J$4,($C$2/(FU$30+1)*($B85+16)/(FU$31+1))=$C$3,($C$2/(FU$30+1)*($B85+16)/(FU$31+1))<=$C$4),-1,0)","v":0},0,0,0,0,0,0,0,0,0,0,0,0,0,0,0,0,0,0,0,0,0,0,0,0,0,0,0,0,0,0,0,0,0,0,0,0,0,0,0,0,0,0,0,0,0,0,0,0,0,0,0,0,0,0,0,0,0,0,0,0,0,0,0,0,0,0,0,0,0,0,0,0,0,0,0,0,0,0,0,0,0,0,0,0,0,0,0,0,0,85]
[null,86,0,0,0,0,0,0,0,0,0,0,0,0,0,0,0,0,0,0,0,0,0,0,0,0,0,0,0,0,0,0,0,0,0,0,0,0,0,0,0,0,0,0,0,0,0,0,0,0,0,0,0,0,0,0,0,0,0,0,0,0,0,0,0,0,0,0,0,0,0,0,0,0,0,0,0,0,0,0,0,0,0,0,0,0,0,0,0,0,0,0,0,0,0,0,0,0,0,0,0,0,0,0,0,0,0,0,0,0,0,0,0,0,0,0,0,0,0,0,0,0,0,0,0,0,0,0,0,0,0,0,0,0,0,0,0,0,0,0,0,0,0,0,0,0,0,0,0,0,0,0,0,0,0,0,0,0,0,0,0,0,0,0,0,0,0,0,0,0,0,0,0,0,{"$f":"IF(AND(($C$2/(FS$30+1))>=$G$4,($C$2/(FS$30+1))<=$H$4,($C$2/(FS$30+1)*($B86+16))>=$I$4,($C$2/(FS$30+1)*($B86+16))<=$J$4,($C$2/(FS$30+1)*($B86+16)/(FS$31+1))=$C$3,($C$2/(FS$30+1)*($B86+16)/(FS$31+1))<=$C$4),-1,0)","v":0},0,0,0,0,0,0,0,0,0,0,0,0,0,0,0,0,0,0,0,0,0,0,0,0,0,0,0,0,0,0,0,0,0,0,0,0,0,0,0,0,0,0,0,0,0,0,0,0,0,0,0,0,0,0,0,0,0,0,0,0,0,0,0,0,0,0,0,0,0,0,0,0,0,0,0,0,0,0,0,0,0,0,0,0,0,0,0,0,0,0,0,86]
[null,87,0,0,0,0,0,0,0,0,0,0,0,0,0,0,0,{"$f":"IF(AND(($C$2/(R$30+1))>=$G$4,($C$2/(R$30+1))<=$H$4,($C$2/(R$30+1)*($B87+16))>=$I$4,($C$2/(R$30+1)*($B87+16))<=$J$4,($C$2/(R$30+1)*($B87+16)/(R$31+1))=$C$3,($C$2/(R$30+1)*($B87+16)/(R$31+1))<=$C$4),-1,0)","v":0},0,0,0,0,0,0,0,0,0,0,0,0,0,0,0,0,0,0,0,0,0,0,0,0,0,0,0,0,0,0,0,0,0,0,0,0,0,0,0,0,0,0,0,0,0,0,0,0,0,0,0,0,0,0,0,0,0,0,0,0,0,0,0,0,0,0,0,0,0,0,0,0,0,0,0,0,0,0,0,0,0,0,0,0,0,0,0,0,0,0,0,0,0,0,0,0,0,0,0,0,0,0,0,0,0,0,0,{"$f":"IF(AND(($C$2/(DV$30+1))>=$G$4,($C$2/(DV$30+1))<=$H$4,($C$2/(DV$30+1)*($B87+16))>=$I$4,($C$2/(DV$30+1)*($B87+16))<=$J$4,($C$2/(DV$30+1)*($B87+16)/(DV$31+1))=$C$3,($C$2/(DV$30+1)*($B87+16)/(DV$31+1))<=$C$4),-1,0)","v":0},0,0,0,0,0,0,0,0,0,0,0,0,0,0,0,0,0,0,0,0,0,0,0,0,0,0,0,0,0,0,0,0,0,0,{"$f":"IF(AND(($C$2/(FE$30+1))>=$G$4,($C$2/(FE$30+1))<=$H$4,($C$2/(FE$30+1)*($B87+16))>=$I$4,($C$2/(FE$30+1)*($B87+16))<=$J$4,($C$2/(FE$30+1)*($B87+16)/(FE$31+1))=$C$3,($C$2/(FE$30+1)*($B87+16)/(FE$31+1))<=$C$4),-1,0)","v":0},0,0,0,0,0,0,0,0,0,0,0,0,0,0,0,0,0,0,0,0,0,0,0,0,0,0,0,0,0,0,0,0,0,0,0,0,0,0,0,0,0,0,0,0,0,0,0,0,0,0,0,0,0,0,0,0,0,0,0,0,0,0,0,0,0,0,0,0,0,0,0,0,0,0,0,0,0,0,0,0,0,0,0,0,0,0,0,0,0,0,0,0,0,0,0,{"$f":"IF(AND(($C$2/(IW$30+1))>=$G$4,($C$2/(IW$30+1))<=$H$4,($C$2/(IW$30+1)*($B87+16))>=$I$4,($C$2/(IW$30+1)*($B87+16))<=$J$4,($C$2/(IW$30+1)*($B87+16)/(IW$31+1))=$C$3,($C$2/(IW$30+1)*($B87+16)/(IW$31+1))<=$C$4),-1,0)","v":0},0,0,0,0,0,0,0,0,0,87]
[null,88,{"$f":"IF(AND(($C$2/(C$30+1))>=$G$4,($C$2/(C$30+1))<=$H$4,($C$2/(C$30+1)*($B88+16))>=$I$4,($C$2/(C$30+1)*($B88+16))<=$J$4,($C$2/(C$30+1)*($B88+16)/(C$31+1))=$C$3,($C$2/(C$30+1)*($B88+16)/(C$31+1))<=$C$4),-1,0)","v":0},0,0,0,0,0,0,0,0,0,0,0,0,0,0,0,0,0,0,0,0,0,0,0,0,0,0,0,0,0,0,0,0,0,0,0,0,0,0,0,0,0,0,0,0,0,0,0,0,0,0,0,0,0,0,0,0,0,0,0,0,0,0,0,0,0,0,0,0,0,0,0,0,0,0,0,0,0,0,0,0,0,0,0,0,0,0,0,0,0,0,0,0,0,0,0,0,0,0,0,0,0,0,0,0,0,0,0,0,{"$f":"IF(AND(($C$2/(DH$30+1))>=$G$4,($C$2/(DH$30+1))<=$H$4,($C$2/(DH$30+1)*($B88+16))>=$I$4,($C$2/(DH$30+1)*($B88+16))<=$J$4,($C$2/(DH$30+1)*($B88+16)/(DH$31+1))=$C$3,($C$2/(DH$30+1)*($B88+16)/(DH$31+1))<=$C$4),-1,0)","v":0},0,0,0,0,0,0,0,0,0,0,0,0,0,0,0,0,0,0,0,0,0,0,0,0,0,0,0,0,0,0,0,0,0,0,0,0,0,0,0,0,0,0,0,0,0,0,0,0,0,0,0,0,0,0,0,0,0,0,0,0,0,0,0,0,0,0,0,0,0,0,0,0,0,0,0,0,0,0,0,0,0,0,0,0,0,0,0,0,0,0,0,0,0,0,0,0,0,0,0,0,0,0,0,0,0,0,0,0,0,0,0,0,0,0,0,0,0,0,0,0,0,0,0,0,0,0,0,0,0,{"$f":"IF(AND(($C$2/(IH$30+1))>=$G$4,($C$2/(IH$30+1))<=$H$4,($C$2/(IH$30+1)*($B88+16))>=$I$4,($C$2/(IH$30+1)*($B88+16))<=$J$4,($C$2/(IH$30+1)*($B88+16)/(IH$31+1))=$C$3,($C$2/(IH$30+1)*($B88+16)/(IH$31+1))<=$C$4),-1,0)","v":0},0,0,0,0,0,0,0,0,0,0,0,0,0,0,0,0,0,0,0,0,0,0,0,0,88]
[null,89,0,0,0,0,0,0,0,0,0,0,0,0,0,0,0,0,0,0,0,0,0,0,0,0,0,0,0,0,0,0,0,0,0,0,0,0,0,0,0,0,0,0,0,0,0,0,0,0,0,0,0,0,0,0,0,0,0,0,0,0,0,0,0,0,0,0,0,0,0,0,0,0,0,0,0,0,0,0,0,0,0,0,0,0,0,0,0,0,0,0,0,0,0,0,0,0,0,0,0,0,0,0,0,0,0,0,0,0,0,0,0,0,0,0,0,0,0,0,0,0,0,0,0,0,0,0,0,0,0,0,0,0,{"$f":"IF(AND(($C$2/(EE$30+1))>=$G$4,($C$2/(EE$30+1))<=$H$4,($C$2/(EE$30+1)*($B89+16))>=$I$4,($C$2/(EE$30+1)*($B89+16))<=$J$4,($C$2/(EE$30+1)*($B89+16)/(EE$31+1))=$C$3,($C$2/(EE$30+1)*($B89+16)/(EE$31+1))<=$C$4),-1,0)","v":0},0,0,0,0,0,0,0,0,0,0,0,0,0,0,0,0,0,0,0,0,0,0,0,0,0,0,0,0,0,0,0,0,0,0,0,0,0,0,0,0,0,0,0,0,0,0,0,0,0,0,0,0,0,0,0,0,0,0,0,0,0,0,0,0,0,0,0,0,0,0,0,0,0,0,0,0,0,0,0,0,0,0,0,0,0,0,0,0,0,0,0,0,0,0,0,0,0,0,0,0,0,0,0,0,0,0,0,0,0,0,0,0,0,0,0,0,0,0,0,0,0,0,0,0,0,0,0,0,0,0,0,89]
[null,90,0,0,0,0,0,0,0,0,0,0,0,0,0,0,0,0,0,0,0,0,0,0,0,0,0,0,0,0,0,0,0,0,0,0,0,0,0,0,0,0,0,0,0,0,0,0,{"$f":"IF(AND(($C$2/(AW$30+1))>=$G$4,($C$2/(AW$30+1))<=$H$4,($C$2/(AW$30+1)*($B90+16))>=$I$4,($C$2/(AW$30+1)*($B90+16))<=$J$4,($C$2/(AW$30+1)*($B90+16)/(AW$31+1))=$C$3,($C$2/(AW$30+1)*($B90+16)/(AW$31+1))<=$C$4),-1,0)","v":0},0,0,0,0,0,0,0,0,0,0,0,0,0,0,0,0,0,0,0,0,0,0,{"$f":"IF(AND(($C$2/(BT$30+1))>=$G$4,($C$2/(BT$30+1))<=$H$4,($C$2/(BT$30+1)*($B90+16))>=$I$4,($C$2/(BT$30+1)*($B90+16))<=$J$4,($C$2/(BT$30+1)*($B90+16)/(BT$31+1))=$C$3,($C$2/(BT$30+1)*($B90+16)/(BT$31+1))<=$C$4),-1,0)","v":0},0,0,0,0,0,0,0,0,0,0,0,0,0,0,0,0,0,0,0,0,0,0,0,0,0,0,0,0,0,0,0,0,0,0,0,0,0,0,0,0,0,0,0,0,0,0,0,0,0,0,0,0,0,0,0,0,0,0,0,0,0,0,0,0,0,0,0,0,0,0,0,0,0,0,0,0,0,0,0,0,0,0,0,0,0,0,0,0,0,0,0,0,0,0,0,0,0,0,0,0,0,0,0,0,0,0,0,0,0,0,0,0,0,0,0,0,0,0,0,0,0,0,0,0,0,0,0,0,0,0,0,0,{"$f":"IF(AND(($C$2/(GW$30+1))>=$G$4,($C$2/(GW$30+1))<=$H$4,($C$2/(GW$30+1)*($B90+16))>=$I$4,($C$2/(GW$30+1)*($B90+16))<=$J$4,($C$2/(GW$30+1)*($B90+16)/(GW$31+1))=$C$3,($C$2/(GW$30+1)*($B90+16)/(GW$31+1))<=$C$4),-1,0)","v":0},0,0,0,0,0,0,0,0,0,0,0,0,0,0,0,0,0,0,0,0,0,0,0,0,0,0,0,0,0,0,0,0,{"$f":"IF(AND(($C$2/(ID$30+1))>=$G$4,($C$2/(ID$30+1))<=$H$4,($C$2/(ID$30+1)*($B90+16))>=$I$4,($C$2/(ID$30+1)*($B90+16))<=$J$4,($C$2/(ID$30+1)*($B90+16)/(ID$31+1))=$C$3,($C$2/(ID$30+1)*($B90+16)/(ID$31+1))<=$C$4),-1,0)","v":0},0,0,0,0,0,0,0,0,0,0,0,0,0,0,0,0,0,0,0,0,0,0,0,0,0,0,0,0,90]
[null,91,0,0,0,0,0,0,0,0,0,0,0,0,0,0,0,0,0,0,0,0,0,0,0,0,0,0,0,0,0,0,0,{"$f":"IF(AND(($C$2/(AH$30+1))>=$G$4,($C$2/(AH$30+1))<=$H$4,($C$2/(AH$30+1)*($B91+16))>=$I$4,($C$2/(AH$30+1)*($B91+16))<=$J$4,($C$2/(AH$30+1)*($B91+16)/(AH$31+1))=$C$3,($C$2/(AH$30+1)*($B91+16)/(AH$31+1))<=$C$4),-1,0)","v":0},0,0,0,0,0,0,0,0,0,0,0,0,0,0,0,0,0,0,0,0,0,0,0,0,0,0,0,0,0,0,0,{"$f":"IF(AND(($C$2/(BN$30+1))>=$G$4,($C$2/(BN$30+1))<=$H$4,($C$2/(BN$30+1)*($B91+16))>=$I$4,($C$2/(BN$30+1)*($B91+16))<=$J$4,($C$2/(BN$30+1)*($B91+16)/(BN$31+1))=$C$3,($C$2/(BN$30+1)*($B91+16)/(BN$31+1))<=$C$4),-1,0)","v":0},0,0,0,0,0,0,0,0,0,0,0,0,0,0,0,0,0,0,0,0,0,0,0,0,0,0,0,0,0,0,0,0,0,0,0,0,0,0,0,0,0,0,0,0,0,0,0,0,0,0,0,0,0,0,0,0,0,0,0,0,0,0,0,0,0,0,0,0,0,0,0,0,0,0,0,0,0,0,0,0,0,0,0,0,0,0,0,0,0,0,0,0,0,0,0,0,0,0,0,0,0,0,0,0,0,0,0,0,0,0,0,0,0,0,0,0,0,0,0,0,0,0,0,0,0,0,0,{"$f":"IF(AND(($C$2/(GL$30+1))>=$G$4,($C$2/(GL$30+1))<=$H$4,($C$2/(GL$30+1)*($B91+16))>=$I$4,($C$2/(GL$30+1)*($B91+16))<=$J$4,($C$2/(GL$30+1)*($B91+16)/(GL$31+1))=$C$3,($C$2/(GL$30+1)*($B91+16)/(GL$31+1))<=$C$4),-1,0)","v":0},0,0,0,0,0,0,0,0,0,0,0,0,0,0,0,0,0,0,0,0,0,0,0,0,0,0,0,0,0,0,0,0,0,0,0,0,0,0,0,0,0,0,0,0,0,0,0,0,0,0,0,0,0,0,0,0,0,0,0,0,0,0,0,0,0,0,0,0,0,0,0,0,91]
[null,92,0,0,0,0,0,0,0,0,0,0,0,0,0,0,0,0,0,0,0,0,0,0,0,0,0,0,0,0,0,0,0,0,0,0,0,0,0,0,0,0,0,0,0,0,0,0,0,0,0,0,0,0,0,0,0,0,0,0,0,0,0,0,0,0,0,0,0,0,0,0,0,0,0,0,0,0,0,0,0,0,0,0,0,0,0,0,0,0,0,0,0,0,0,0,0,0,0,0,0,0,0,0,0,0,0,0,0,0,0,0,0,0,0,0,0,0,0,0,0,0,0,0,0,0,0,0,0,0,0,0,0,0,0,0,0,0,0,0,0,0,0,0,0,0,0,0,0,0,0,0,0,0,0,0,0,0,0,0,0,0,0,0,0,0,0,0,0,0,0,0,0,0,0,0,0,0,0,0,0,0,0,0,0,0,0,0,0,0,0,0,0,0,0,0,0,0,0,0,0,0,0,0,0,0,0,0,0,0,0,0,0,0,0,0,0,0,0,0,0,0,0,0,0,0,0,0,0,0,0,0,0,0,0,0,0,0,0,0,0,0,0,0,0,0,0,0,0,0,0,0,0,0,0,0,0,0,0,0,0,0,0,0,0,0,92]
[null,93,0,0,0,0,0,0,0,0,0,0,0,0,0,0,0,0,0,0,0,0,0,0,0,0,0,0,0,0,0,0,0,0,0,0,0,0,0,0,0,0,0,0,0,0,0,0,0,0,0,0,0,0,0,0,0,0,0,0,0,0,0,0,0,0,0,0,0,0,0,0,0,0,0,0,0,0,0,0,0,0,0,0,0,0,0,0,0,0,0,0,{"$f":"IF(AND(($C$2/(CO$30+1))>=$G$4,($C$2/(CO$30+1))<=$H$4,($C$2/(CO$30+1)*($B93+16))>=$I$4,($C$2/(CO$30+1)*($B93+16))<=$J$4,($C$2/(CO$30+1)*($B93+16)/(CO$31+1))=$C$3,($C$2/(CO$30+1)*($B93+16)/(CO$31+1))<=$C$4),-1,0)","v":0},0,0,0,0,0,0,0,0,0,0,0,0,0,0,0,0,0,0,0,0,0,0,0,0,0,0,0,0,0,0,0,0,0,0,0,0,0,0,0,0,0,0,0,0,0,0,0,0,0,0,0,0,0,0,0,0,0,0,0,0,0,0,0,0,0,0,0,0,0,0,0,0,0,0,0,0,0,0,0,0,0,0,0,0,0,0,0,0,0,0,0,0,0,0,0,0,0,0,0,0,0,0,0,0,0,0,0,0,0,0,0,0,0,0,0,0,0,0,0,0,0,0,0,0,0,0,0,0,{"$f":"IF(AND(($C$2/(HN$30+1))>=$G$4,($C$2/(HN$30+1))<=$H$4,($C$2/(HN$30+1)*($B93+16))>=$I$4,($C$2/(HN$30+1)*($B93+16))<=$J$4,($C$2/(HN$30+1)*($B93+16)/(HN$31+1))=$C$3,($C$2/(HN$30+1)*($B93+16)/(HN$31+1))<=$C$4),-1,0)","v":0},0,0,0,0,0,0,0,0,0,0,0,0,0,0,0,0,0,0,0,0,0,0,0,0,0,0,0,0,0,0,0,0,0,0,0,0,0,0,0,0,0,0,0,0,93]
[null,94,0,0,0,0,0,0,0,0,0,0,0,0,0,0,0,0,0,0,0,0,0,0,0,0,0,0,0,0,0,0,0,0,0,0,0,0,0,0,0,0,0,0,0,0,0,0,0,0,0,0,0,0,0,0,0,0,0,0,0,0,0,0,0,0,0,0,0,0,0,0,0,0,0,0,0,0,0,0,0,0,0,0,0,0,0,{"$f":"IF(AND(($C$2/(CJ$30+1))>=$G$4,($C$2/(CJ$30+1))<=$H$4,($C$2/(CJ$30+1)*($B94+16))>=$I$4,($C$2/(CJ$30+1)*($B94+16))<=$J$4,($C$2/(CJ$30+1)*($B94+16)/(CJ$31+1))=$C$3,($C$2/(CJ$30+1)*($B94+16)/(CJ$31+1))<=$C$4),-1,0)","v":0},0,0,0,0,0,0,0,0,0,0,0,0,0,0,0,0,0,0,0,0,0,0,0,0,0,0,0,0,0,0,0,0,0,0,0,0,0,0,0,0,0,0,0,0,0,0,0,0,0,0,0,0,0,0,0,0,0,0,0,0,0,0,0,0,0,0,0,0,0,0,0,0,0,0,0,0,0,0,0,0,0,0,0,0,0,0,0,0,0,0,0,0,0,0,0,0,0,0,0,0,0,0,0,0,0,0,0,0,0,0,0,0,0,0,0,0,0,0,0,0,0,0,0,0,0,0,0,0,0,0,0,0,{"$f":"IF(AND(($C$2/(HM$30+1))>=$G$4,($C$2/(HM$30+1))<=$H$4,($C$2/(HM$30+1)*($B94+16))>=$I$4,($C$2/(HM$30+1)*($B94+16))<=$J$4,($C$2/(HM$30+1)*($B94+16)/(HM$31+1))=$C$3,($C$2/(HM$30+1)*($B94+16)/(HM$31+1))<=$C$4),-1,0)","v":0},0,0,0,0,0,0,0,0,0,0,0,0,0,0,0,0,0,0,0,0,0,0,0,0,0,0,0,0,0,0,0,0,0,0,0,0,0,0,0,0,0,0,0,0,0,94]
[null,95,0,0,0,0,0,0,0,0,0,0,0,0,0,0,0,0,0,0,0,0,0,0,0,0,0,0,0,0,0,0,0,0,0,0,0,0,0,0,0,0,0,0,0,0,0,0,0,0,0,0,0,0,0,0,0,0,0,0,0,0,0,0,0,0,0,0,0,0,0,0,0,0,0,0,0,0,0,0,0,0,0,0,0,0,0,0,0,0,0,0,0,0,0,0,0,0,0,0,0,0,0,0,0,0,0,0,0,0,0,0,0,0,0,0,0,0,0,0,0,0,0,0,0,0,0,0,0,0,0,0,0,0,0,0,0,0,0,0,0,0,0,0,0,0,0,0,0,0,0,0,0,0,0,{"$f":"IF(AND(($C$2/(EZ$30+1))>=$G$4,($C$2/(EZ$30+1))<=$H$4,($C$2/(EZ$30+1)*($B95+16))>=$I$4,($C$2/(EZ$30+1)*($B95+16))<=$J$4,($C$2/(EZ$30+1)*($B95+16)/(EZ$31+1))=$C$3,($C$2/(EZ$30+1)*($B95+16)/(EZ$31+1))<=$C$4),-1,0)","v":0},0,0,0,0,0,0,0,0,0,0,0,0,0,0,0,0,0,0,0,0,0,0,0,0,0,0,0,0,0,0,0,0,0,0,0,0,0,0,0,0,0,0,0,0,0,0,0,0,0,0,0,0,0,0,0,0,0,0,0,0,0,0,0,0,0,0,0,0,0,0,0,0,0,0,0,0,0,0,0,0,0,0,0,0,0,0,0,0,0,0,0,0,0,0,0,0,0,0,0,0,0,0,0,0,0,0,0,0,0,0,95]
[null,96,0,0,0,0,0,0,0,0,0,0,0,0,0,0,0,0,0,0,0,0,0,0,0,0,0,0,0,0,0,0,0,0,0,0,0,0,0,0,0,0,0,0,0,0,0,0,0,0,0,0,0,0,0,0,0,0,0,0,0,0,0,0,0,0,0,0,0,0,0,0,0,0,0,0,0,0,0,0,0,0,0,0,0,0,0,0,0,0,0,0,0,0,0,0,0,0,0,0,0,0,0,0,0,0,0,0,0,0,0,0,0,0,0,0,0,0,0,0,0,0,0,0,0,0,0,0,0,0,0,0,0,0,0,0,0,0,0,0,0,0,0,0,0,0,0,0,0,0,{"$f":"IF(AND(($C$2/(EU$30+1))>=$G$4,($C$2/(EU$30+1))<=$H$4,($C$2/(EU$30+1)*($B96+16))>=$I$4,($C$2/(EU$30+1)*($B96+16))<=$J$4,($C$2/(EU$30+1)*($B96+16)/(EU$31+1))=$C$3,($C$2/(EU$30+1)*($B96+16)/(EU$31+1))<=$C$4),-1,0)","v":0},0,0,0,0,0,0,0,0,0,0,0,0,0,0,0,0,0,0,0,0,0,0,0,0,0,0,0,0,0,0,0,0,0,0,0,0,0,0,0,0,0,0,0,0,0,0,0,0,0,0,0,0,0,0,0,0,0,0,0,0,0,0,0,0,0,0,0,0,0,0,0,0,0,0,0,0,0,0,0,0,0,0,0,0,0,0,0,0,0,0,0,0,0,0,0,0,0,0,0,0,0,0,0,0,0,0,0,0,0,0,0,0,0,0,0,96]
[null,97,0,0,0,0,0,0,0,0,0,0,0,0,0,0,0,0,0,0,0,0,0,0,0,0,0,0,0,0,0,0,0,0,0,0,0,0,0,0,0,0,0,0,0,0,0,0,0,0,0,0,0,0,0,0,0,0,0,0,0,0,0,0,0,0,0,0,0,0,0,0,0,0,0,0,0,0,0,0,0,0,0,0,0,0,0,0,0,0,0,0,0,0,0,0,0,0,0,0,0,0,0,0,0,0,0,0,0,0,0,0,0,0,0,0,0,0,0,0,0,0,0,0,0,0,0,0,0,0,0,0,0,0,0,0,0,0,0,0,0,0,0,0,0,0,0,0,0,0,0,0,0,0,0,0,0,0,0,0,0,0,0,0,0,0,0,0,0,0,0,0,0,0,0,0,0,0,0,0,0,0,0,0,0,0,0,0,0,0,0,0,0,0,0,0,0,0,0,0,0,0,0,0,0,0,0,0,0,0,0,0,0,0,0,0,0,0,0,0,0,0,0,0,0,0,0,0,0,0,0,0,0,0,0,0,0,0,0,0,0,0,0,0,0,0,0,0,0,0,0,0,0,0,0,0,0,0,0,0,0,0,0,0,0,0,97]
[null,98,0,0,0,0,0,0,0,0,0,0,0,0,0,0,0,0,0,0,0,0,0,0,0,0,0,0,0,0,0,0,0,0,0,0,0,0,0,0,0,0,0,0,0,0,0,0,0,0,0,0,0,0,0,0,0,0,0,0,0,0,0,0,0,0,0,0,0,0,0,0,0,0,0,0,0,0,0,0,0,0,0,0,0,0,0,0,0,0,0,0,0,0,0,0,0,0,0,0,0,0,0,0,0,0,0,0,0,0,0,0,0,0,0,0,0,0,0,0,0,0,0,0,0,0,0,0,0,0,0,0,0,0,0,0,0,0,0,0,0,0,0,0,0,0,0,0,0,0,0,0,0,0,0,0,0,0,0,0,0,0,0,0,0,0,0,0,0,0,0,0,0,0,0,0,0,0,0,0,0,0,0,0,0,0,0,0,0,0,0,0,0,0,0,0,0,0,0,0,0,0,0,0,0,0,0,0,0,0,0,0,0,0,0,0,0,0,0,0,0,0,0,0,0,0,0,0,0,0,0,0,0,0,0,0,0,0,0,0,0,0,0,0,0,0,0,0,0,0,0,0,0,0,0,0,0,0,0,0,0,0,0,0,0,0,98]
[null,99,0,0,0,0,0,0,0,0,0,0,0,0,0,0,0,0,0,0,0,0,0,0,0,0,0,0,0,0,0,0,0,0,0,0,0,0,0,0,0,0,0,0,0,0,0,0,0,0,0,0,0,0,0,0,0,0,0,0,0,0,0,0,0,0,0,0,0,0,0,0,0,0,0,0,0,0,0,0,0,0,0,0,0,0,0,0,0,0,0,0,0,0,0,0,0,0,0,0,0,0,0,0,0,0,0,0,0,0,0,0,0,0,0,0,0,0,0,0,0,0,0,0,0,0,0,0,0,0,0,0,0,0,0,0,0,0,0,0,0,0,0,0,0,0,0,0,0,0,0,0,0,0,0,0,0,0,0,0,0,0,0,0,0,0,0,0,0,0,0,0,0,0,0,0,0,0,0,0,0,0,0,0,0,0,0,0,0,0,0,0,0,0,0,0,0,0,0,0,0,0,0,0,0,0,0,0,0,0,0,0,0,0,0,0,0,0,0,0,0,0,0,0,0,0,0,0,0,0,0,0,0,0,0,0,0,0,0,0,0,0,0,0,0,0,0,0,0,0,0,0,0,0,0,0,0,0,0,0,0,0,0,0,0,0,99]
[null,100,0,0,0,0,0,0,0,0,0,0,0,0,0,0,0,0,0,0,0,0,0,0,0,0,0,0,0,0,0,0,0,0,0,0,0,0,0,0,0,0,0,0,0,0,0,0,0,0,0,0,0,0,0,0,0,0,0,0,0,0,0,0,0,0,0,0,0,0,0,0,0,0,0,0,0,0,0,0,0,0,0,0,0,0,0,0,0,0,0,0,0,0,0,0,0,0,0,0,0,0,0,0,0,0,0,0,0,0,0,0,0,0,0,0,0,0,0,0,0,0,0,0,0,0,0,0,0,0,0,0,0,0,0,0,0,0,0,0,0,0,0,0,0,0,0,0,0,0,0,0,0,0,0,0,0,0,0,0,0,0,0,0,0,0,0,0,0,0,0,0,0,0,0,0,0,0,0,0,0,0,0,0,0,0,0,0,0,0,0,0,0,0,0,0,0,0,0,0,0,0,0,0,0,0,0,0,0,0,0,0,0,0,0,0,0,0,0,0,0,0,0,0,0,0,0,0,0,0,0,0,0,0,0,0,0,0,0,0,0,0,0,0,0,0,0,0,0,0,0,0,0,0,0,0,0,0,0,0,0,0,0,0,0,0,100]
[null,101,0,0,0,0,0,0,0,0,0,0,0,0,0,0,0,0,0,0,0,0,0,0,0,0,0,0,0,0,0,0,0,0,0,0,0,0,0,0,0,0,0,0,0,0,0,0,0,0,0,0,0,0,0,0,0,0,0,0,0,0,0,0,0,0,0,0,0,0,0,0,0,0,0,0,0,0,0,0,0,0,0,0,0,0,0,0,0,0,0,0,0,0,0,0,0,0,0,0,0,0,0,0,0,0,0,0,0,0,0,0,0,0,0,0,0,0,0,0,0,0,0,0,0,0,0,0,0,0,0,0,0,0,0,0,0,0,0,0,0,0,0,0,0,0,0,0,0,0,0,0,0,0,0,0,0,0,0,0,0,0,0,0,0,0,0,0,0,0,0,0,0,0,0,0,0,0,0,0,0,0,0,0,0,0,0,0,0,0,0,0,0,0,0,0,0,0,0,0,0,0,0,0,0,0,0,0,0,0,0,0,0,0,0,0,0,0,0,0,0,0,0,0,0,0,0,0,0,0,0,0,0,0,0,0,0,0,0,0,0,0,0,0,0,0,0,0,0,0,0,0,0,0,0,0,0,0,0,0,0,0,0,0,0,0,101]
[null,102,0,0,0,0,0,0,0,0,0,0,0,0,0,0,0,0,0,0,0,0,0,0,0,0,0,0,0,0,0,0,0,0,0,0,0,0,0,0,0,0,0,0,0,0,0,0,0,0,0,0,0,0,0,0,0,0,0,0,0,0,0,0,0,0,0,0,0,0,0,0,0,0,0,0,0,0,0,0,0,0,0,0,0,0,0,0,0,0,0,0,0,0,0,0,0,0,0,0,0,0,0,0,0,0,0,0,0,0,0,0,0,0,0,0,0,0,0,0,0,0,0,0,0,0,0,0,0,0,0,0,0,0,0,0,0,0,0,0,0,0,0,0,0,0,0,0,0,0,0,0,0,0,0,0,0,0,0,0,0,0,0,0,0,0,0,0,0,0,0,0,0,0,0,0,0,0,0,0,0,0,0,0,0,0,0,0,0,0,0,0,0,0,0,0,0,0,0,0,0,0,0,0,0,0,0,0,0,0,0,0,0,0,0,0,0,0,0,0,0,0,0,0,0,0,0,0,0,0,0,0,0,0,0,0,0,0,0,0,0,0,0,0,0,0,0,0,0,0,0,0,0,0,0,0,0,0,0,0,0,0,0,0,0,0,102]
[null,103,0,0,0,0,0,0,0,0,0,0,0,0,0,0,0,{"$f":"IF(AND(($C$2/(R$30+1))>=$G$4,($C$2/(R$30+1))<=$H$4,($C$2/(R$30+1)*($B103+16))>=$I$4,($C$2/(R$30+1)*($B103+16))<=$J$4,($C$2/(R$30+1)*($B103+16)/(R$31+1))=$C$3,($C$2/(R$30+1)*($B103+16)/(R$31+1))<=$C$4),-1,0)","v":0},0,0,0,0,0,0,0,0,0,0,0,0,0,0,0,0,0,0,0,0,0,0,0,0,0,0,0,0,0,0,0,0,0,0,0,0,0,0,0,0,0,0,0,0,0,0,0,0,0,0,0,0,0,0,0,0,0,0,0,0,0,0,0,0,0,0,0,0,0,0,0,0,0,0,0,0,0,0,0,0,0,0,0,0,0,0,0,0,0,0,0,0,0,0,0,0,0,0,0,0,0,0,0,0,0,0,0,0,{"$f":"IF(AND(($C$2/(DW$30+1))>=$G$4,($C$2/(DW$30+1))<=$H$4,($C$2/(DW$30+1)*($B103+16))>=$I$4,($C$2/(DW$30+1)*($B103+16))<=$J$4,($C$2/(DW$30+1)*($B103+16)/(DW$31+1))=$C$3,($C$2/(DW$30+1)*($B103+16)/(DW$31+1))<=$C$4),-1,0)","v":0},0,0,0,0,0,0,0,0,0,0,0,0,0,0,0,0,0,0,0,0,0,0,0,0,0,0,0,0,0,0,0,0,0,0,0,0,0,0,0,0,0,0,0,0,0,0,0,0,0,0,0,0,0,0,0,0,0,0,0,0,0,0,0,0,0,0,0,0,0,0,0,0,0,0,0,0,0,0,0,0,0,0,0,0,0,0,0,0,0,0,0,0,0,0,0,0,0,0,0,0,0,0,0,0,0,0,0,0,0,0,0,0,0,0,0,0,0,0,0,0,0,0,0,0,0,0,0,0,0,0,0,0,0,0,0,0,0,0,0,103]
[null,104,{"$f":"IF(AND(($C$2/(C$30+1))>=$G$4,($C$2/(C$30+1))<=$H$4,($C$2/(C$30+1)*($B104+16))>=$I$4,($C$2/(C$30+1)*($B104+16))<=$J$4,($C$2/(C$30+1)*($B104+16)/(C$31+1))=$C$3,($C$2/(C$30+1)*($B104+16)/(C$31+1))<=$C$4),-1,0)","v":0},0,0,0,0,0,0,0,0,0,0,0,0,0,0,0,0,0,0,0,0,0,0,0,0,0,0,0,0,0,0,0,0,0,0,0,0,0,0,0,0,0,0,0,0,0,0,0,0,0,0,0,0,0,0,0,0,0,0,0,0,0,0,0,0,0,0,0,0,0,0,0,0,0,0,0,0,0,0,0,0,0,0,0,0,0,0,0,0,0,0,0,0,0,0,0,0,0,0,0,0,0,0,-1,0,0,0,0,0,{"$f":"IF(AND(($C$2/(DH$30+1))>=$G$4,($C$2/(DH$30+1))<=$H$4,($C$2/(DH$30+1)*($B104+16))>=$I$4,($C$2/(DH$30+1)*($B104+16))<=$J$4,($C$2/(DH$30+1)*($B104+16)/(DH$31+1))=$C$3,($C$2/(DH$30+1)*($B104+16)/(DH$31+1))<=$C$4),-1,0)","v":0},0,0,0,0,0,0,0,0,0,0,0,0,0,0,0,0,0,0,0,0,0,0,0,0,0,0,0,0,0,0,0,0,0,0,0,0,0,0,0,0,0,0,0,0,0,0,0,0,0,0,0,0,0,0,0,0,0,0,0,0,0,0,0,0,0,{"$f":"IF(AND(($C$2/(FV$30+1))>=$G$4,($C$2/(FV$30+1))<=$H$4,($C$2/(FV$30+1)*($B104+16))>=$I$4,($C$2/(FV$30+1)*($B104+16))<=$J$4,($C$2/(FV$30+1)*($B104+16)/(FV$31+1))=$C$3,($C$2/(FV$30+1)*($B104+16)/(FV$31+1))<=$C$4),-1,0)","v":0},0,0,0,0,0,0,0,0,0,0,0,0,0,0,0,0,0,0,0,0,0,0,0,0,0,0,0,0,0,0,0,0,0,0,0,0,0,0,0,0,0,0,0,0,0,0,0,0,0,0,0,0,0,0,0,0,0,0,0,0,0,0,0,0,0,0,0,0,0,0,0,0,0,0,0,0,0,0,0,0,0,0,0,0,0,0,0,0,104]
[null,105,0,0,0,0,0,0,0,0,0,0,0,0,0,0,0,0,0,0,0,0,0,0,0,0,0,0,0,0,0,0,0,0,0,0,0,0,0,0,0,0,0,0,0,0,0,0,0,0,0,0,0,0,0,0,0,0,0,0,0,0,0,0,{"$f":"IF(AND(($C$2/(BM$30+1))>=$G$4,($C$2/(BM$30+1))<=$H$4,($C$2/(BM$30+1)*($B105+16))>=$I$4,($C$2/(BM$30+1)*($B105+16))<=$J$4,($C$2/(BM$30+1)*($B105+16)/(BM$31+1))=$C$3,($C$2/(BM$30+1)*($B105+16)/(BM$31+1))<=$C$4),-1,0)","v":0},0,0,0,0,0,0,0,0,0,0,0,0,0,0,0,0,0,0,0,0,0,0,0,0,0,0,0,0,0,0,0,0,0,0,0,0,0,0,0,0,0,0,0,0,0,{"$f":"IF(AND(($C$2/(DG$30+1))>=$G$4,($C$2/(DG$30+1))<=$H$4,($C$2/(DG$30+1)*($B105+16))>=$I$4,($C$2/(DG$30+1)*($B105+16))<=$J$4,($C$2/(DG$30+1)*($B105+16)/(DG$31+1))=$C$3,($C$2/(DG$30+1)*($B105+16)/(DG$31+1))<=$C$4),-1,0)","v":0},0,0,0,0,0,0,0,0,0,0,0,0,0,0,0,0,0,0,0,0,0,0,0,0,0,0,0,0,0,0,0,0,0,0,0,0,0,0,0,0,0,0,0,0,0,0,0,0,0,0,0,0,0,0,0,0,0,0,0,0,0,0,0,0,0,{"$f":"IF(AND(($C$2/(FU$30+1))>=$G$4,($C$2/(FU$30+1))<=$H$4,($C$2/(FU$30+1)*($B105+16))>=$I$4,($C$2/(FU$30+1)*($B105+16))<=$J$4,($C$2/(FU$30+1)*($B105+16)/(FU$31+1))=$C$3,($C$2/(FU$30+1)*($B105+16)/(FU$31+1))<=$C$4),-1,0)","v":0},0,0,0,0,0,0,0,0,0,0,0,0,0,0,0,0,0,0,0,0,0,0,0,0,0,0,0,0,0,0,0,0,0,0,0,0,0,0,0,0,0,0,0,0,0,0,0,0,0,0,0,0,0,0,0,0,0,0,0,0,0,0,0,0,0,0,0,0,0,0,0,0,0,0,0,{"$f":"IF(AND(($C$2/(IS$30+1))>=$G$4,($C$2/(IS$30+1))<=$H$4,($C$2/(IS$30+1)*($B105+16))>=$I$4,($C$2/(IS$30+1)*($B105+16))<=$J$4,($C$2/(IS$30+1)*($B105+16)/(IS$31+1))=$C$3,($C$2/(IS$30+1)*($B105+16)/(IS$31+1))<=$C$4),-1,0)","v":0},0,0,0,0,0,0,0,0,0,0,0,0,0,105]
[null,106,0,0,0,0,0,0,0,0,0,0,0,0,0,0,0,0,0,0,0,0,0,0,0,0,0,0,0,0,0,0,0,0,0,0,0,0,0,0,0,0,0,0,0,0,0,0,{"$f":"IF(AND(($C$2/(AW$30+1))>=$G$4,($C$2/(AW$30+1))<=$H$4,($C$2/(AW$30+1)*($B106+16))>=$I$4,($C$2/(AW$30+1)*($B106+16))<=$J$4,($C$2/(AW$30+1)*($B106+16)/(AW$31+1))=$C$3,($C$2/(AW$30+1)*($B106+16)/(AW$31+1))<=$C$4),-1,0)","v":0},0,0,0,0,0,0,0,0,0,0,0,0,0,0,0,0,0,0,0,0,0,0,0,0,0,0,0,0,0,0,0,0,0,0,0,0,0,0,0,0,0,0,0,0,0,0,0,0,0,0,0,0,0,0,0,0,0,0,0,{"$f":"IF(AND(($C$2/(DE$30+1))>=$G$4,($C$2/(DE$30+1))<=$H$4,($C$2/(DE$30+1)*($B106+16))>=$I$4,($C$2/(DE$30+1)*($B106+16))<=$J$4,($C$2/(DE$30+1)*($B106+16)/(DE$31+1))=$C$3,($C$2/(DE$30+1)*($B106+16)/(DE$31+1))<=$C$4),-1,0)","v":0},0,0,0,0,0,0,0,0,0,0,0,0,0,0,0,0,0,0,0,0,0,0,0,0,0,0,0,0,0,0,0,0,0,0,0,0,0,0,0,0,0,0,0,0,0,0,0,0,0,0,0,0,0,0,0,0,0,0,0,0,0,0,0,0,0,0,0,0,0,0,0,0,0,0,0,0,0,0,0,0,0,0,0,0,0,0,0,0,0,0,0,0,0,0,0,0,0,0,0,{"$f":"IF(AND(($C$2/(HA$30+1))>=$G$4,($C$2/(HA$30+1))<=$H$4,($C$2/(HA$30+1)*($B106+16))>=$I$4,($C$2/(HA$30+1)*($B106+16))<=$J$4,($C$2/(HA$30+1)*($B106+16)/(HA$31+1))=$C$3,($C$2/(HA$30+1)*($B106+16)/(HA$31+1))<=$C$4),-1,0)","v":0},0,0,0,0,0,0,0,0,0,0,0,0,0,0,0,0,0,0,0,0,0,0,0,0,0,0,0,0,{"$f":"IF(AND(($C$2/(ID$30+1))>=$G$4,($C$2/(ID$30+1))<=$H$4,($C$2/(ID$30+1)*($B106+16))>=$I$4,($C$2/(ID$30+1)*($B106+16))<=$J$4,($C$2/(ID$30+1)*($B106+16)/(ID$31+1))=$C$3,($C$2/(ID$30+1)*($B106+16)/(ID$31+1))<=$C$4),-1,0)","v":0},0,0,0,0,0,0,0,0,0,0,0,0,0,0,0,0,0,0,0,0,0,0,0,0,0,0,0,0,106]
[null,107,0,0,0,0,0,0,0,0,0,0,0,0,0,0,0,0,0,0,0,0,0,0,0,0,0,0,0,0,0,0,0,{"$f":"IF(AND(($C$2/(AH$30+1))>=$G$4,($C$2/(AH$30+1))<=$H$4,($C$2/(AH$30+1)*($B107+16))>=$I$4,($C$2/(AH$30+1)*($B107+16))<=$J$4,($C$2/(AH$30+1)*($B107+16)/(AH$31+1))=$C$3,($C$2/(AH$30+1)*($B107+16)/(AH$31+1))<=$C$4),-1,0)","v":0},0,0,0,0,0,0,0,0,0,0,0,0,0,0,0,0,0,0,0,0,0,0,0,0,0,0,0,0,0,0,0,0,0,0,0,0,{"$f":"IF(AND(($C$2/(BS$30+1))>=$G$4,($C$2/(BS$30+1))<=$H$4,($C$2/(BS$30+1)*($B107+16))>=$I$4,($C$2/(BS$30+1)*($B107+16))<=$J$4,($C$2/(BS$30+1)*($B107+16)/(BS$31+1))=$C$3,($C$2/(BS$30+1)*($B107+16)/(BS$31+1))<=$C$4),-1,0)","v":0},0,0,0,0,0,0,0,0,0,0,0,0,0,0,0,0,0,0,0,0,0,0,0,0,0,0,0,0,0,0,0,0,0,0,0,0,0,0,0,0,0,0,0,0,0,0,0,0,0,0,0,0,0,0,0,0,0,0,0,0,0,0,0,0,0,0,0,0,0,0,0,0,0,0,0,0,0,0,0,0,0,0,0,0,0,0,0,0,0,0,0,0,0,0,0,0,0,0,0,0,0,0,0,0,0,0,0,0,0,0,0,0,0,0,0,0,0,0,0,0,0,0,{"$f":"IF(AND(($C$2/(GL$30+1))>=$G$4,($C$2/(GL$30+1))<=$H$4,($C$2/(GL$30+1)*($B107+16))>=$I$4,($C$2/(GL$30+1)*($B107+16))<=$J$4,($C$2/(GL$30+1)*($B107+16)/(GL$31+1))=$C$3,($C$2/(GL$30+1)*($B107+16)/(GL$31+1))<=$C$4),-1,0)","v":0},0,0,0,0,0,0,0,0,0,0,0,0,0,0,0,0,0,0,0,0,0,0,0,0,0,0,0,0,0,0,0,0,0,0,0,0,0,0,0,0,0,0,0,0,0,0,0,0,0,0,0,0,0,0,0,0,0,0,0,0,0,0,0,0,0,0,0,0,0,0,0,0,107]
[null,108,0,0,0,0,0,0,0,0,0,0,0,0,0,0,0,0,0,0,0,0,0,0,0,0,0,0,0,0,0,0,0,0,0,0,0,0,0,0,0,0,0,0,0,0,0,0,0,0,0,0,0,0,0,0,0,0,0,0,0,0,0,0,0,0,0,0,0,0,0,0,0,0,0,0,0,0,0,0,0,0,0,0,0,0,0,0,0,0,0,0,0,0,0,0,0,0,0,0,0,0,0,0,0,0,0,0,0,0,0,0,0,0,0,0,0,0,0,0,0,0,0,0,0,0,0,0,0,0,0,0,0,0,0,0,0,0,0,0,{"$f":"IF(AND(($C$2/(EK$30+1))>=$G$4,($C$2/(EK$30+1))<=$H$4,($C$2/(EK$30+1)*($B108+16))>=$I$4,($C$2/(EK$30+1)*($B108+16))<=$J$4,($C$2/(EK$30+1)*($B108+16)/(EK$31+1))=$C$3,($C$2/(EK$30+1)*($B108+16)/(EK$31+1))<=$C$4),-1,0)","v":0},0,0,0,0,0,0,0,0,0,0,0,0,0,0,0,0,0,0,0,0,0,0,0,0,0,0,0,0,0,0,0,0,0,0,0,0,0,0,0,0,0,0,0,0,0,0,0,0,0,0,0,0,0,0,0,0,0,0,0,0,0,0,0,0,0,0,0,0,0,0,0,0,0,0,0,0,0,0,0,0,0,0,0,0,0,0,0,0,0,0,0,0,0,0,0,0,0,0,0,0,0,0,0,0,0,0,0,0,0,0,0,0,0,0,0,0,0,0,0,0,0,0,0,0,0,108]
[null,109,0,0,0,0,0,0,0,0,0,0,0,0,0,0,0,0,0,0,0,0,0,0,0,0,0,0,0,0,0,0,0,0,0,0,0,0,0,0,0,0,0,0,0,0,0,0,0,0,0,0,0,0,0,0,0,0,0,0,0,0,0,0,0,0,0,0,0,0,0,0,0,0,0,0,0,0,0,0,0,0,0,0,0,0,0,0,0,0,0,0,0,0,0,0,0,0,0,0,0,0,{"$f":"IF(AND(($C$2/(CY$30+1))>=$G$4,($C$2/(CY$30+1))<=$H$4,($C$2/(CY$30+1)*($B109+16))>=$I$4,($C$2/(CY$30+1)*($B109+16))<=$J$4,($C$2/(CY$30+1)*($B109+16)/(CY$31+1))=$C$3,($C$2/(CY$30+1)*($B109+16)/(CY$31+1))<=$C$4),-1,0)","v":0},0,0,0,0,0,0,0,0,0,0,0,0,0,0,0,0,0,0,0,0,0,0,0,0,0,0,0,0,0,0,0,0,0,0,0,0,0,0,0,0,0,0,0,0,0,0,0,0,0,0,0,0,0,0,0,0,0,0,0,0,0,0,0,0,0,0,0,0,0,0,0,0,0,0,0,0,0,0,0,0,0,0,0,0,0,0,0,0,0,0,0,0,0,0,0,0,0,0,0,0,0,0,0,0,0,0,0,0,0,0,0,0,0,0,0,0,0,0,0,0,0,0,0,0,0,0,0,0,0,0,0,0,0,0,0,0,0,0,0,0,0,0,0,0,0,0,0,0,0,0,0,0,0,0,0,0,0,0,0,0,0,0,0,109]
[null,110,0,0,0,0,0,0,0,0,0,0,0,0,0,0,0,0,0,0,0,0,0,0,0,0,0,0,0,0,0,0,0,0,0,0,0,0,0,0,0,0,0,0,0,0,0,0,0,0,0,0,0,0,0,0,0,0,0,0,0,0,0,0,0,0,0,0,0,0,0,0,0,0,0,0,0,0,0,0,0,0,0,0,0,0,0,{"$f":"IF(AND(($C$2/(CJ$30+1))>=$G$4,($C$2/(CJ$30+1))<=$H$4,($C$2/(CJ$30+1)*($B110+16))>=$I$4,($C$2/(CJ$30+1)*($B110+16))<=$J$4,($C$2/(CJ$30+1)*($B110+16)/(CJ$31+1))=$C$3,($C$2/(CJ$30+1)*($B110+16)/(CJ$31+1))<=$C$4),-1,0)","v":0},0,0,0,0,0,0,0,0,0,0,0,0,0,0,0,0,0,0,0,0,0,0,0,0,0,0,0,0,0,0,0,0,0,0,0,0,0,0,0,0,0,0,0,0,0,0,0,0,0,0,0,0,0,0,0,0,0,0,0,0,0,0,0,0,0,0,0,0,0,0,0,0,0,0,0,0,0,0,0,0,0,0,0,0,0,0,0,0,0,0,0,0,0,0,0,0,0,0,0,0,0,0,0,0,0,0,0,0,0,0,0,0,0,0,0,0,0,0,0,0,0,0,0,0,0,0,0,0,0,0,0,0,0,0,0,0,0,0,0,0,0,0,0,0,0,0,0,0,0,0,0,0,0,0,0,0,0,0,0,0,0,0,0,0,0,0,0,0,0,0,0,0,0,0,0,0,0,0,110]
[null,111,0,0,0,0,0,0,0,0,0,0,0,0,0,0,0,0,0,0,0,0,0,0,0,0,0,0,0,0,0,0,0,0,0,0,0,0,0,0,0,0,0,0,0,0,0,0,0,0,0,0,0,0,0,0,0,0,0,0,0,0,0,0,0,0,0,0,0,0,0,0,0,0,0,0,0,0,0,0,0,0,0,0,0,0,0,0,0,0,0,0,0,0,0,0,0,0,0,0,0,0,0,0,0,0,0,0,0,0,0,0,0,0,0,0,0,0,0,0,0,0,0,0,0,0,0,0,0,0,0,0,0,0,0,0,0,0,0,0,0,0,0,0,0,0,0,0,0,0,0,0,0,0,0,0,0,0,0,0,0,0,0,0,0,0,0,0,0,0,0,0,0,0,0,0,0,0,0,0,0,0,0,0,0,0,0,0,0,0,0,0,0,0,0,0,0,0,0,0,0,0,0,0,0,0,0,0,0,0,0,0,0,0,0,0,0,0,0,0,0,0,0,0,0,0,0,{"$f":"IF(AND(($C$2/(HT$30+1))>=$G$4,($C$2/(HT$30+1))<=$H$4,($C$2/(HT$30+1)*($B111+16))>=$I$4,($C$2/(HT$30+1)*($B111+16))<=$J$4,($C$2/(HT$30+1)*($B111+16)/(HT$31+1))=$C$3,($C$2/(HT$30+1)*($B111+16)/(HT$31+1))<=$C$4),-1,0)","v":0},0,0,0,0,0,0,0,0,0,0,0,0,0,0,0,0,0,0,0,0,0,0,0,0,0,0,0,0,0,0,0,0,0,0,0,0,0,0,111]
[null,112,0,0,0,0,0,0,0,0,0,0,0,0,0,0,0,0,0,0,0,0,0,0,0,0,0,0,0,0,0,0,0,0,0,0,0,0,0,0,0,0,0,0,0,0,0,0,0,0,0,0,0,0,0,0,0,0,0,0,0,0,0,0,0,0,0,0,0,0,0,0,0,0,0,0,0,0,0,0,0,0,0,0,0,0,0,0,0,0,0,0,0,0,0,0,0,0,0,0,0,0,0,0,0,0,0,0,0,0,0,0,0,0,0,0,0,0,0,0,0,0,0,0,0,0,0,0,0,0,0,0,0,0,0,0,0,0,0,0,0,0,0,0,0,0,0,0,0,0,0,0,0,0,0,0,0,0,0,0,0,0,0,0,0,0,0,0,0,0,0,0,0,0,0,0,0,0,0,0,0,0,0,0,0,0,0,0,0,0,0,0,0,0,0,0,0,0,0,0,0,0,0,0,0,0,0,0,0,0,0,0,0,0,0,0,0,0,0,0,0,0,0,0,{"$f":"IF(AND(($C$2/(HQ$30+1))>=$G$4,($C$2/(HQ$30+1))<=$H$4,($C$2/(HQ$30+1)*($B112+16))>=$I$4,($C$2/(HQ$30+1)*($B112+16))<=$J$4,($C$2/(HQ$30+1)*($B112+16)/(HQ$31+1))=$C$3,($C$2/(HQ$30+1)*($B112+16)/(HQ$31+1))<=$C$4),-1,0)","v":0},0,0,0,0,0,0,0,0,0,0,0,0,0,0,0,0,0,0,0,0,0,0,0,0,0,0,0,0,0,0,0,0,0,0,0,0,0,0,0,0,0,112]
[null,113,0,0,0,0,0,0,0,0,0,0,0,0,0,0,0,0,0,0,0,0,0,0,0,0,0,0,0,0,0,0,0,0,0,0,0,0,0,0,0,0,0,0,0,0,0,0,0,0,0,0,0,0,0,0,0,0,0,0,0,0,0,0,0,0,0,0,0,0,0,0,0,0,0,0,0,0,0,0,0,0,0,0,0,0,0,0,0,0,0,0,0,0,0,0,0,0,0,0,0,0,0,0,0,0,0,0,0,0,0,0,0,0,0,0,0,0,0,0,0,0,0,0,0,0,0,0,0,0,0,0,0,0,0,0,0,0,0,0,0,0,0,0,0,0,0,0,0,0,0,0,0,0,0,0,0,0,0,0,0,0,0,0,0,0,0,0,0,0,0,0,0,0,0,0,0,0,0,0,0,0,0,0,0,0,0,0,0,0,0,0,0,0,0,0,0,0,0,0,0,0,0,0,0,0,0,0,0,0,0,0,0,0,0,0,0,0,0,0,0,0,0,0,0,0,0,0,0,0,0,0,0,0,0,0,0,0,0,0,0,0,0,0,0,0,0,0,0,0,0,0,0,0,0,0,0,0,0,0,0,0,0,0,0,0,113]
[null,114,0,0,0,0,0,0,0,0,0,0,0,0,0,0,0,0,0,0,0,0,0,0,0,0,0,0,0,0,0,0,0,0,0,0,0,0,0,0,0,0,0,0,0,0,0,0,0,0,0,0,0,0,0,0,0,0,0,0,0,0,0,0,0,0,0,0,0,0,0,0,0,0,0,0,0,0,0,0,0,0,0,0,0,0,0,0,0,0,0,0,0,0,0,0,0,0,0,0,0,0,0,0,0,0,0,0,0,0,0,0,0,0,0,0,0,0,0,0,0,0,0,0,0,0,0,0,0,0,0,0,0,0,0,0,0,0,0,0,0,0,0,0,0,0,0,0,0,0,0,0,0,0,0,0,0,0,0,{"$f":"IF(AND(($C$2/(FD$30+1))>=$G$4,($C$2/(FD$30+1))<=$H$4,($C$2/(FD$30+1)*($B114+16))>=$I$4,($C$2/(FD$30+1)*($B114+16))<=$J$4,($C$2/(FD$30+1)*($B114+16)/(FD$31+1))=$C$3,($C$2/(FD$30+1)*($B114+16)/(FD$31+1))<=$C$4),-1,0)","v":0},0,0,0,0,0,0,0,0,0,0,0,0,0,0,0,0,0,0,0,0,0,0,0,0,0,0,0,0,0,0,0,0,0,0,0,0,0,0,0,0,0,0,0,0,0,0,0,0,0,0,0,0,0,0,0,0,0,0,0,0,0,0,0,0,0,0,0,0,0,0,0,0,0,0,0,0,0,0,0,0,0,0,0,0,0,0,0,0,0,0,0,0,0,0,0,0,0,0,0,0,0,0,0,0,0,0,114]
[null,115,0,0,0,0,0,0,0,0,0,0,0,0,0,0,0,0,0,0,0,0,0,0,0,0,0,0,0,0,0,0,0,0,0,0,0,0,0,0,0,0,0,0,0,0,0,0,0,0,0,0,0,0,0,0,0,0,0,0,0,0,0,0,0,0,0,0,0,0,0,0,0,0,0,0,0,0,0,0,0,0,0,0,0,0,0,0,0,0,0,0,0,0,0,0,0,0,0,0,0,0,0,0,0,0,0,0,0,0,0,0,0,0,0,0,0,0,0,0,0,0,0,0,0,0,0,0,0,0,0,0,0,0,0,0,0,0,0,0,0,0,0,0,0,0,0,0,0,0,0,0,0,0,0,0,{"$f":"IF(AND(($C$2/(FA$30+1))>=$G$4,($C$2/(FA$30+1))<=$H$4,($C$2/(FA$30+1)*($B115+16))>=$I$4,($C$2/(FA$30+1)*($B115+16))<=$J$4,($C$2/(FA$30+1)*($B115+16)/(FA$31+1))=$C$3,($C$2/(FA$30+1)*($B115+16)/(FA$31+1))<=$C$4),-1,0)","v":0},0,0,0,0,0,0,0,0,0,0,0,0,0,0,0,0,0,0,0,0,0,0,0,0,0,0,0,0,0,0,0,0,0,0,0,0,0,0,0,0,0,0,0,0,0,0,0,0,0,0,0,0,0,0,0,0,0,0,0,0,0,0,0,0,0,0,0,0,0,0,0,0,0,0,0,0,0,0,0,0,0,0,0,0,0,0,0,0,0,0,0,0,0,0,0,0,0,0,0,0,0,0,0,0,0,0,0,0,0,115]
[null,116,0,0,0,0,0,0,0,0,0,0,0,0,0,0,0,0,0,0,0,0,0,0,0,0,0,0,0,0,0,0,0,0,0,0,0,0,0,0,0,0,0,0,0,0,0,0,0,0,0,0,0,0,0,0,0,0,0,0,0,0,0,0,0,0,0,0,0,0,0,0,0,0,0,0,0,0,0,0,0,0,0,0,0,0,0,0,0,0,0,0,0,0,0,0,0,0,0,0,0,0,0,0,0,0,0,0,0,0,0,0,0,0,0,0,0,0,0,0,0,0,0,0,0,0,0,0,0,0,0,0,0,0,0,0,0,0,0,0,0,0,0,0,0,0,0,0,0,0,0,0,0,0,0,0,0,0,0,0,0,0,0,0,0,0,0,0,0,0,0,0,0,0,0,0,0,0,0,0,0,0,0,0,0,0,0,0,0,0,0,0,0,0,0,0,0,0,0,0,0,0,0,0,0,0,0,0,0,0,0,0,0,0,0,0,0,0,0,0,0,0,0,0,0,0,0,0,0,0,0,0,0,0,0,0,0,0,0,0,0,0,0,0,0,0,0,0,0,0,0,0,0,0,0,0,0,0,0,0,0,0,0,0,0,0,116]
[null,117,0,0,0,0,0,0,0,0,0,0,0,0,0,0,0,0,0,0,0,0,0,0,0,0,0,0,0,0,0,0,0,0,0,0,0,0,0,0,0,0,0,0,0,0,0,0,0,0,0,0,0,0,0,0,0,0,0,0,0,0,0,0,0,0,0,0,0,0,0,0,0,0,0,0,0,0,0,0,0,0,0,0,0,0,0,0,0,0,0,0,0,0,0,0,0,0,0,0,0,0,0,0,0,0,0,0,0,0,0,0,0,0,0,0,0,0,0,0,0,0,0,0,0,0,0,0,0,0,0,0,0,0,0,0,0,0,0,0,0,0,0,0,0,0,0,0,0,0,0,0,0,0,0,0,0,0,0,0,0,0,0,0,0,0,0,0,0,0,0,0,0,0,0,0,0,0,0,0,0,0,0,0,0,0,0,0,0,0,0,0,0,0,0,0,0,0,0,0,0,0,0,0,0,0,0,0,0,0,0,0,0,0,0,0,0,0,0,0,0,0,0,0,0,0,0,0,0,0,0,0,0,0,0,0,0,0,0,0,0,0,0,0,0,0,0,0,0,0,0,0,0,0,0,0,0,0,0,0,0,0,0,0,0,0,117]
[null,118,0,0,0,0,0,0,0,0,0,0,0,0,0,0,0,0,0,0,0,0,0,0,0,0,0,0,0,0,0,0,0,0,0,0,0,0,0,0,0,0,0,0,0,0,0,0,0,0,0,0,0,0,0,0,0,0,0,0,0,0,0,0,0,0,0,0,0,0,0,0,0,0,0,0,0,0,0,0,0,0,0,0,0,0,0,0,0,0,0,0,0,0,0,0,0,0,0,0,0,0,0,0,0,0,0,0,0,0,0,0,0,0,0,0,0,0,0,0,0,0,0,0,0,0,0,0,0,0,0,0,0,0,0,0,0,0,0,0,0,0,0,0,0,0,0,0,0,0,0,0,0,0,0,0,0,0,0,0,0,0,0,0,0,0,0,0,0,0,0,0,0,0,0,0,0,0,0,0,0,0,0,0,0,0,0,0,0,0,0,0,0,0,0,0,0,0,0,0,0,0,0,0,0,0,0,0,0,0,0,0,0,0,0,0,0,0,0,0,0,0,0,0,0,0,0,0,0,0,0,0,0,0,0,0,0,0,0,0,0,0,0,0,0,0,0,0,0,0,0,0,0,0,0,0,0,0,0,0,0,0,0,0,0,0,118]
[null,119,0,0,0,0,0,0,0,0,0,0,0,0,0,0,0,{"$f":"IF(AND(($C$2/(R$30+1))>=$G$4,($C$2/(R$30+1))<=$H$4,($C$2/(R$30+1)*($B119+16))>=$I$4,($C$2/(R$30+1)*($B119+16))<=$J$4,($C$2/(R$30+1)*($B119+16)/(R$31+1))=$C$3,($C$2/(R$30+1)*($B119+16)/(R$31+1))<=$C$4),-1,0)","v":0},0,0,0,0,0,0,0,0,0,0,0,0,0,0,0,0,0,0,0,0,0,0,0,0,0,0,0,0,0,0,0,0,0,0,0,0,0,0,0,0,0,0,0,0,0,0,0,0,0,0,0,0,0,0,0,0,0,0,0,0,0,0,0,0,0,0,0,0,0,0,0,0,0,0,0,0,0,0,0,0,0,0,0,0,0,0,0,0,0,0,0,0,0,0,0,0,0,0,0,0,0,0,0,0,0,0,0,0,0,0,0,0,0,0,0,0,0,0,0,0,0,0,0,0,0,0,0,0,0,0,0,0,0,0,0,0,0,0,0,0,0,0,0,0,0,0,0,0,0,0,0,0,0,0,0,0,0,0,0,0,0,0,0,0,0,0,0,0,0,0,0,0,0,0,0,0,0,0,0,0,0,0,0,0,0,0,0,0,0,0,0,0,0,0,0,0,0,0,0,0,0,0,0,0,0,0,0,0,0,0,0,0,0,0,0,0,0,0,0,0,0,0,0,0,0,0,0,0,0,0,0,0,0,0,0,0,0,0,0,0,0,0,0,0,0,0,0,0,119]
[null,120,{"$f":"IF(AND(($C$2/(C$30+1))>=$G$4,($C$2/(C$30+1))<=$H$4,($C$2/(C$30+1)*($B120+16))>=$I$4,($C$2/(C$30+1)*($B120+16))<=$J$4,($C$2/(C$30+1)*($B120+16)/(C$31+1))=$C$3,($C$2/(C$30+1)*($B120+16)/(C$31+1))<=$C$4),-1,0)","v":0},0,0,0,0,0,0,0,0,0,0,0,0,0,0,0,0,0,0,0,0,0,0,0,0,0,0,0,0,0,0,0,0,0,0,0,0,0,0,0,0,0,0,0,0,0,0,0,0,0,0,0,0,0,0,0,0,0,0,0,0,0,0,0,0,0,0,0,0,0,0,0,0,0,0,0,0,0,0,0,0,0,0,0,0,0,0,0,0,0,0,0,0,0,0,0,0,0,0,0,0,0,0,0,0,0,0,0,0,0,0,0,0,0,0,0,0,0,0,0,0,0,0,0,0,0,0,0,0,0,0,0,0,0,0,0,0,0,0,0,0,0,0,0,0,0,0,0,0,0,0,0,0,0,0,0,0,0,0,0,0,0,0,0,0,0,0,0,0,0,0,0,0,0,0,0,0,0,0,0,0,0,0,0,0,0,0,0,0,{"$f":"IF(AND(($C$2/(GJ$30+1))>=$G$4,($C$2/(GJ$30+1))<=$H$4,($C$2/(GJ$30+1)*($B120+16))>=$I$4,($C$2/(GJ$30+1)*($B120+16))<=$J$4,($C$2/(GJ$30+1)*($B120+16)/(GJ$31+1))=$C$3,($C$2/(GJ$30+1)*($B120+16)/(GJ$31+1))<=$C$4),-1,0)","v":0},0,0,0,0,0,0,0,0,0,0,0,0,0,0,0,0,0,0,0,0,0,0,0,0,0,0,0,0,0,0,0,0,0,0,0,0,0,0,0,0,0,0,0,0,0,0,0,0,0,0,0,0,0,0,0,0,0,0,0,0,0,0,0,0,0,0,0,0,0,0,0,0,0,0,120]
[null,121,0,0,0,0,0,0,0,0,0,0,0,0,0,0,0,0,0,0,0,0,0,0,0,0,0,0,0,0,0,0,0,0,0,0,0,0,0,0,0,0,0,0,0,0,0,0,0,0,0,0,0,0,0,0,0,0,0,0,0,0,0,0,0,0,0,0,0,0,0,0,0,0,0,0,0,0,0,0,0,0,0,0,0,0,0,0,0,0,0,0,0,0,0,0,0,0,0,0,0,0,0,0,0,0,0,0,0,0,0,0,0,0,0,0,0,0,0,0,0,0,0,0,0,0,0,0,0,0,0,0,0,0,0,0,0,0,0,0,0,0,0,0,0,0,0,0,0,0,0,0,0,0,0,0,0,0,0,0,0,0,0,0,0,0,0,0,0,0,0,0,0,0,0,0,{"$f":"IF(AND(($C$2/(FU$30+1))>=$G$4,($C$2/(FU$30+1))<=$H$4,($C$2/(FU$30+1)*($B121+16))>=$I$4,($C$2/(FU$30+1)*($B121+16))<=$J$4,($C$2/(FU$30+1)*($B121+16)/(FU$31+1))=$C$3,($C$2/(FU$30+1)*($B121+16)/(FU$31+1))<=$C$4),-1,0)","v":0},0,0,0,0,0,0,0,0,0,0,0,0,0,0,0,0,0,0,0,0,0,0,0,0,0,0,0,0,0,0,0,0,0,0,0,0,0,0,0,0,0,0,0,0,0,0,0,0,0,0,0,0,0,0,0,0,0,0,0,0,0,0,0,0,0,0,0,0,0,0,0,0,0,0,0,0,0,0,0,0,0,0,0,0,0,0,0,0,0,121]
[null,122,0,0,0,0,0,0,0,0,0,0,0,0,0,0,0,0,0,0,0,0,0,0,0,0,0,0,0,0,0,0,0,0,0,0,0,0,0,0,0,0,0,0,0,0,0,0,{"$f":"IF(AND(($C$2/(AW$30+1))>=$G$4,($C$2/(AW$30+1))<=$H$4,($C$2/(AW$30+1)*($B122+16))>=$I$4,($C$2/(AW$30+1)*($B122+16))<=$J$4,($C$2/(AW$30+1)*($B122+16)/(AW$31+1))=$C$3,($C$2/(AW$30+1)*($B122+16)/(AW$31+1))<=$C$4),-1,0)","v":0},0,0,0,0,0,0,0,0,0,0,0,0,0,0,0,0,0,0,0,0,0,0,0,0,0,0,0,0,0,0,0,0,0,0,0,0,0,0,0,0,0,0,0,0,0,0,0,0,0,0,0,0,0,0,0,0,0,0,0,0,0,0,0,0,0,0,0,0,0,0,0,0,0,0,0,0,0,0,0,0,0,0,0,0,0,0,0,0,0,0,0,0,0,0,0,0,0,0,0,0,0,0,0,0,0,0,0,0,0,0,0,0,0,0,0,0,0,0,0,0,0,0,0,0,0,0,0,0,0,0,0,0,0,0,0,0,0,0,0,0,0,0,0,0,0,0,0,0,0,0,0,0,0,0,0,0,0,0,0,0,0,0,0,0,0,0,0,0,0,0,0,0,0,0,{"$f":"IF(AND(($C$2/(HP$30+1))>=$G$4,($C$2/(HP$30+1))<=$H$4,($C$2/(HP$30+1)*($B122+16))>=$I$4,($C$2/(HP$30+1)*($B122+16))<=$J$4,($C$2/(HP$30+1)*($B122+16)/(HP$31+1))=$C$3,($C$2/(HP$30+1)*($B122+16)/(HP$31+1))<=$C$4),-1,0)","v":0},0,0,0,0,0,0,0,0,0,0,0,0,0,0,0,0,0,0,0,0,0,0,0,0,0,0,0,0,0,0,0,0,0,0,0,0,0,0,0,0,0,0,122]
[null,123,0,0,0,0,0,0,0,0,0,0,0,0,0,0,0,0,0,0,0,0,0,0,0,0,0,0,0,0,0,0,0,{"$f":"IF(AND(($C$2/(AH$30+1))>=$G$4,($C$2/(AH$30+1))<=$H$4,($C$2/(AH$30+1)*($B123+16))>=$I$4,($C$2/(AH$30+1)*($B123+16))<=$J$4,($C$2/(AH$30+1)*($B123+16)/(AH$31+1))=$C$3,($C$2/(AH$30+1)*($B123+16)/(AH$31+1))<=$C$4),-1,0)","v":0},0,0,0,0,0,0,0,0,0,0,0,0,0,0,0,0,0,0,0,0,0,0,0,0,0,0,0,0,0,0,0,0,0,0,0,0,{"$f":"IF(AND(($C$2/(BS$30+1))>=$G$4,($C$2/(BS$30+1))<=$H$4,($C$2/(BS$30+1)*($B123+16))>=$I$4,($C$2/(BS$30+1)*($B123+16))<=$J$4,($C$2/(BS$30+1)*($B123+16)/(BS$31+1))=$C$3,($C$2/(BS$30+1)*($B123+16)/(BS$31+1))<=$C$4),-1,0)","v":0},0,0,0,0,0,0,0,0,0,0,0,0,0,0,0,0,0,0,0,0,0,0,0,0,0,0,0,0,0,0,0,0,0,0,0,0,0,0,0,0,0,0,0,0,0,0,0,0,0,0,0,0,0,0,0,0,0,0,0,0,0,0,0,0,0,0,0,0,0,0,0,0,0,0,0,0,0,0,0,0,0,0,0,0,0,0,0,0,0,0,0,0,0,0,0,0,0,0,0,0,0,0,0,0,0,0,0,0,0,0,0,0,0,0,0,0,0,0,0,0,0,0,0,0,0,0,0,0,0,{"$f":"IF(AND(($C$2/(GS$30+1))>=$G$4,($C$2/(GS$30+1))<=$H$4,($C$2/(GS$30+1)*($B123+16))>=$I$4,($C$2/(GS$30+1)*($B123+16))<=$J$4,($C$2/(GS$30+1)*($B123+16)/(GS$31+1))=$C$3,($C$2/(GS$30+1)*($B123+16)/(GS$31+1))<=$C$4),-1,0)","v":0},0,0,0,0,0,0,0,0,0,0,0,0,0,0,0,{"$f":"IF(AND(($C$2/(HI$30+1))>=$G$4,($C$2/(HI$30+1))<=$H$4,($C$2/(HI$30+1)*($B123+16))>=$I$4,($C$2/(HI$30+1)*($B123+16))<=$J$4,($C$2/(HI$30+1)*($B123+16)/(HI$31+1))=$C$3,($C$2/(HI$30+1)*($B123+16)/(HI$31+1))<=$C$4),-1,0)","v":0},0,0,0,0,0,0,0,0,0,0,0,0,0,0,0,0,0,0,0,0,0,0,0,0,0,0,0,0,0,0,0,0,0,0,0,0,0,0,0,0,0,0,0,0,0,0,0,0,0,123]
[null,124,0,0,0,0,0,0,0,0,0,0,0,0,0,0,0,0,0,0,0,0,0,0,0,0,0,0,0,0,0,0,0,0,0,0,0,0,0,0,0,0,0,0,0,0,0,0,0,0,0,0,0,0,0,0,0,0,0,0,0,0,0,0,{"$f":"IF(AND(($C$2/(BM$30+1))>=$G$4,($C$2/(BM$30+1))<=$H$4,($C$2/(BM$30+1)*($B124+16))>=$I$4,($C$2/(BM$30+1)*($B124+16))<=$J$4,($C$2/(BM$30+1)*($B124+16)/(BM$31+1))=$C$3,($C$2/(BM$30+1)*($B124+16)/(BM$31+1))<=$C$4),-1,0)","v":0},0,0,0,0,0,0,0,0,0,0,0,0,0,0,0,0,0,0,0,0,0,0,0,0,0,0,0,0,0,0,0,0,0,0,0,0,0,0,0,0,0,0,0,0,0,0,0,0,0,0,0,0,0,0,0,0,0,0,0,0,0,0,0,0,0,0,0,{"$f":"IF(AND(($C$2/(EC$30+1))>=$G$4,($C$2/(EC$30+1))<=$H$4,($C$2/(EC$30+1)*($B124+16))>=$I$4,($C$2/(EC$30+1)*($B124+16))<=$J$4,($C$2/(EC$30+1)*($B124+16)/(EC$31+1))=$C$3,($C$2/(EC$30+1)*($B124+16)/(EC$31+1))<=$C$4),-1,0)","v":0},0,0,0,0,0,0,0,0,0,0,0,0,0,0,0,0,0,0,0,0,0,0,0,0,0,0,0,0,0,0,0,0,0,0,0,0,0,0,0,0,0,0,0,0,0,0,0,0,0,0,0,0,0,0,0,0,0,0,0,0,0,0,0,0,0,0,0,0,0,0,0,0,0,0,0,0,0,0,0,0,0,0,0,0,0,0,0,0,0,0,0,0,0,0,0,0,0,0,0,0,0,0,0,0,0,0,0,0,0,0,0,0,0,0,0,0,0,0,0,0,0,0,0,0,0,0,0,0,0,0,0,0,0,124]
[null,125,0,0,0,0,0,0,0,0,0,0,0,0,0,0,0,0,0,0,0,0,0,0,0,0,0,0,0,0,0,0,0,0,0,0,0,0,0,0,0,0,0,0,0,0,0,0,0,0,0,0,0,0,0,0,0,0,0,0,0,0,0,0,0,0,0,0,0,0,0,0,0,0,0,0,0,0,0,0,0,0,0,0,0,0,0,0,0,0,0,0,0,0,0,0,0,0,0,0,0,0,{"$f":"IF(AND(($C$2/(CY$30+1))>=$G$4,($C$2/(CY$30+1))<=$H$4,($C$2/(CY$30+1)*($B125+16))>=$I$4,($C$2/(CY$30+1)*($B125+16))<=$J$4,($C$2/(CY$30+1)*($B125+16)/(CY$31+1))=$C$3,($C$2/(CY$30+1)*($B125+16)/(CY$31+1))<=$C$4),-1,0)","v":0},0,0,0,0,0,0,0,0,0,0,0,0,0,0,0,0,0,0,0,0,0,0,0,0,{"$f":"IF(AND(($C$2/(DX$30+1))>=$G$4,($C$2/(DX$30+1))<=$H$4,($C$2/(DX$30+1)*($B125+16))>=$I$4,($C$2/(DX$30+1)*($B125+16))<=$J$4,($C$2/(DX$30+1)*($B125+16)/(DX$31+1))=$C$3,($C$2/(DX$30+1)*($B125+16)/(DX$31+1))<=$C$4),-1,0)","v":0},0,0,0,0,0,0,0,0,0,0,0,0,0,0,0,0,0,0,0,0,0,0,0,0,0,0,0,0,0,0,0,0,0,0,0,0,0,0,0,0,0,0,0,0,0,0,0,0,0,0,0,0,0,0,0,0,0,0,0,0,0,0,0,0,0,0,0,0,0,0,0,0,0,0,0,0,0,0,0,0,0,0,0,0,0,0,0,0,0,0,0,0,0,0,0,0,0,0,0,0,0,0,0,0,0,0,0,0,0,0,0,0,0,0,0,0,0,0,0,0,0,0,0,0,0,0,0,0,0,0,0,0,0,0,0,0,0,0,125]
[null,126,0,0,0,0,0,0,0,0,0,0,0,0,0,0,0,0,0,0,0,0,0,0,0,0,0,0,0,0,0,0,0,0,0,0,0,0,0,0,0,0,0,0,0,0,0,0,0,0,0,0,0,0,0,0,0,0,0,0,0,0,0,0,0,0,0,0,0,0,0,0,0,0,0,0,0,0,0,0,0,0,0,0,0,0,0,{"$f":"IF(AND(($C$2/(CJ$30+1))>=$G$4,($C$2/(CJ$30+1))<=$H$4,($C$2/(CJ$30+1)*($B126+16))>=$I$4,($C$2/(CJ$30+1)*($B126+16))<=$J$4,($C$2/(CJ$30+1)*($B126+16)/(CJ$31+1))=$C$3,($C$2/(CJ$30+1)*($B126+16)/(CJ$31+1))<=$C$4),-1,0)","v":0},0,0,0,0,0,0,0,0,0,0,0,0,0,0,0,0,0,0,0,0,0,0,0,0,0,0,0,0,0,0,0,0,0,0,0,0,0,0,0,0,0,0,0,0,0,0,0,0,0,0,0,0,0,0,0,0,0,0,0,0,0,0,0,0,0,0,0,0,0,0,0,0,0,0,0,0,0,0,0,0,0,0,0,0,0,0,0,0,0,0,0,0,0,0,0,0,0,0,0,0,0,0,0,0,0,0,0,0,0,0,0,0,0,0,0,0,0,0,0,0,0,0,0,0,0,0,0,0,0,0,0,0,0,0,0,0,0,0,0,0,0,0,0,0,0,0,0,0,0,0,0,0,0,0,0,0,0,0,0,0,0,0,0,0,0,0,0,0,0,0,0,0,0,0,0,0,0,0,126]
[null,127,0,0,0,0,0,0,0,0,0,0,0,0,0,0,0,0,0,0,0,0,0,0,0,0,0,0,0,0,0,0,0,0,0,0,0,0,0,0,0,0,0,0,0,0,0,0,0,0,0,0,0,0,0,0,0,0,0,0,0,0,0,0,0,0,0,0,0,0,0,0,0,0,0,0,0,0,0,0,0,0,0,0,0,0,0,0,0,0,0,0,0,0,0,0,0,0,0,0,0,0,0,0,0,0,0,0,0,0,0,0,0,0,0,0,0,0,0,0,0,0,0,0,0,0,0,0,0,0,0,0,0,0,0,0,0,0,0,0,0,0,0,0,0,0,0,0,0,0,0,0,0,{"$f":"IF(AND(($C$2/(EX$30+1))>=$G$4,($C$2/(EX$30+1))<=$H$4,($C$2/(EX$30+1)*($B127+16))>=$I$4,($C$2/(EX$30+1)*($B127+16))<=$J$4,($C$2/(EX$30+1)*($B127+16)/(EX$31+1))=$C$3,($C$2/(EX$30+1)*($B127+16)/(EX$31+1))<=$C$4),-1,0)","v":0},0,0,0,0,0,0,0,0,0,0,0,0,0,0,0,0,0,0,0,0,0,0,0,0,0,0,0,0,0,0,0,0,0,0,0,0,0,0,0,0,0,0,0,0,0,0,0,0,0,0,0,0,0,0,0,0,0,0,0,0,0,0,0,0,0,0,0,0,0,0,0,0,0,0,0,0,0,0,0,0,0,0,0,0,0,0,0,0,0,0,0,0,0,0,0,0,0,0,0,0,0,0,0,0,0,0,0,0,0,0,0,0,127]
[null,128,0,0,0,0,0,0,0,0,0,0,0,0,0,0,0,0,0,0,0,0,0,0,0,0,0,0,0,0,0,0,0,0,0,0,0,0,0,0,0,0,0,0,0,0,0,0,0,0,0,0,0,0,0,0,0,0,0,0,0,0,0,0,0,0,0,0,0,0,0,0,0,0,0,0,0,0,0,0,0,0,0,0,0,0,0,0,0,0,0,0,0,0,0,0,0,0,0,0,0,0,0,0,0,0,0,0,0,0,0,0,0,0,0,0,0,0,0,0,0,0,0,0,0,0,0,0,0,0,0,0,0,0,0,0,0,0,0,0,0,0,0,0,0,0,0,0,{"$f":"IF(AND(($C$2/(ES$30+1))>=$G$4,($C$2/(ES$30+1))<=$H$4,($C$2/(ES$30+1)*($B128+16))>=$I$4,($C$2/(ES$30+1)*($B128+16))<=$J$4,($C$2/(ES$30+1)*($B128+16)/(ES$31+1))=$C$3,($C$2/(ES$30+1)*($B128+16)/(ES$31+1))<=$C$4),-1,0)","v":0},0,0,0,0,0,0,0,0,0,0,0,0,0,0,0,0,0,0,0,0,0,0,0,0,0,0,0,0,0,0,0,0,0,0,0,0,0,0,0,0,0,0,0,0,0,0,0,0,0,0,0,0,0,0,0,0,0,0,0,0,0,0,0,0,0,0,0,0,0,0,0,0,0,0,0,0,0,0,0,0,0,0,0,0,0,0,0,0,0,0,0,0,0,0,0,0,0,0,0,{"$f":"IF(AND(($C$2/(IO$30+1))>=$G$4,($C$2/(IO$30+1))<=$H$4,($C$2/(IO$30+1)*($B128+16))>=$I$4,($C$2/(IO$30+1)*($B128+16))<=$J$4,($C$2/(IO$30+1)*($B128+16)/(IO$31+1))=$C$3,($C$2/(IO$30+1)*($B128+16)/(IO$31+1))<=$C$4),-1,0)","v":0},0,0,0,0,0,0,0,0,0,0,0,0,0,0,{"$f":"IF(AND(($C$2/(JD$30+1))>=$G$4,($C$2/(JD$30+1))<=$H$4,($C$2/(JD$30+1)*($B128+16))>=$I$4,($C$2/(JD$30+1)*($B128+16))<=$J$4,($C$2/(JD$30+1)*($B128+16)/(JD$31+1))=$C$3,($C$2/(JD$30+1)*($B128+16)/(JD$31+1))<=$C$4),-1,0)","v":0},0,0,128]
[null,129,0,0,0,0,0,0,0,0,0,0,0,0,0,0,0,0,0,0,0,0,0,0,0,0,0,0,0,0,0,0,0,0,0,0,0,0,0,0,0,0,0,0,0,0,0,0,0,0,0,0,0,0,0,0,0,0,0,0,0,0,0,0,0,0,0,0,0,0,0,0,0,0,0,0,0,0,0,0,0,0,0,0,0,0,0,0,0,0,0,0,0,0,0,0,0,0,0,0,0,0,0,0,0,0,0,0,0,0,0,0,0,0,0,0,0,0,0,0,0,0,0,0,0,0,0,0,0,0,0,0,0,0,0,0,0,0,0,0,0,0,0,0,0,0,0,0,0,0,0,0,0,0,0,0,0,0,0,0,0,0,0,0,0,0,0,0,0,0,0,0,0,0,0,0,0,0,0,0,0,0,0,0,0,0,0,0,0,0,0,0,0,0,0,0,0,0,0,0,0,0,0,0,0,0,0,0,0,0,0,0,0,0,0,0,0,0,0,0,0,0,0,0,0,0,0,0,0,0,0,0,0,0,0,0,0,0,0,0,0,0,0,{"$f":"IF(AND(($C$2/(IJ$30+1))>=$G$4,($C$2/(IJ$30+1))<=$H$4,($C$2/(IJ$30+1)*($B129+16))>=$I$4,($C$2/(IJ$30+1)*($B129+16))<=$J$4,($C$2/(IJ$30+1)*($B129+16)/(IJ$31+1))=$C$3,($C$2/(IJ$30+1)*($B129+16)/(IJ$31+1))<=$C$4),-1,0)","v":0},0,0,0,0,0,0,0,0,0,0,0,0,0,0,0,0,0,0,0,0,0,0,129]
[null,130,0,0,0,0,0,0,0,0,0,0,0,0,0,0,0,0,0,0,0,0,0,0,0,0,0,0,0,0,0,0,0,0,0,0,0,0,0,0,0,0,0,0,0,0,0,0,0,0,0,0,0,0,0,0,0,0,0,0,0,0,0,0,0,0,0,0,0,0,0,0,0,0,0,0,0,0,0,0,0,0,0,0,0,0,0,0,0,0,0,0,0,0,0,0,0,0,0,0,0,0,0,0,0,0,0,0,0,0,0,0,0,0,0,0,0,0,0,0,0,0,0,0,0,0,0,0,0,0,0,0,0,0,0,0,0,0,0,0,0,0,0,0,0,0,0,0,0,0,0,0,0,0,0,0,0,0,0,0,0,0,0,0,0,0,0,0,0,0,0,0,0,0,0,0,0,0,0,0,0,0,0,0,0,0,0,0,0,0,0,0,0,0,0,0,0,0,0,0,0,0,0,0,0,0,0,0,0,0,0,0,0,0,0,0,0,0,0,0,0,0,0,0,0,0,0,0,0,0,0,0,0,0,0,0,0,0,0,0,0,0,0,0,0,0,0,0,0,0,0,0,0,0,0,0,0,0,0,0,0,0,0,0,0,0,130]
[null,131,0,0,0,0,0,0,0,0,0,0,0,0,0,0,0,0,0,0,0,0,0,0,0,0,0,0,0,0,0,0,0,0,0,0,0,0,0,0,0,0,0,0,0,0,0,0,0,0,0,0,0,0,0,0,0,0,0,0,0,0,0,0,0,0,0,0,0,0,0,0,0,0,0,0,0,0,0,0,0,0,0,0,0,0,0,0,0,0,0,0,0,0,0,0,0,0,0,0,0,0,0,0,0,0,0,0,0,0,0,0,0,0,0,0,0,0,0,0,0,0,0,0,0,0,0,0,0,0,0,0,0,0,0,0,0,0,0,0,0,0,0,0,0,0,0,0,0,0,0,0,0,0,0,0,0,0,0,0,0,0,0,0,0,0,0,0,0,0,0,0,0,0,0,0,0,0,0,0,0,0,0,0,0,0,0,0,0,0,0,0,0,0,0,0,0,0,0,0,0,0,0,0,0,0,0,0,0,0,0,0,0,0,0,0,0,0,0,0,0,0,0,0,0,0,0,0,0,0,0,0,0,0,0,0,0,0,0,0,0,0,0,0,0,0,0,0,0,0,0,0,0,0,0,0,0,0,0,0,0,0,0,0,0,0,131]
[null,132,0,0,0,0,0,0,0,0,0,0,0,0,0,0,0,0,0,0,0,0,0,0,0,0,0,0,0,0,0,0,0,0,0,0,0,0,0,0,0,0,0,0,0,0,0,0,0,0,0,0,0,0,0,0,0,0,0,0,0,0,0,0,0,0,0,0,0,0,0,0,0,0,0,0,0,0,0,0,0,0,0,0,0,0,0,0,0,0,0,0,0,0,0,0,0,0,0,0,0,0,0,0,0,0,0,0,0,0,0,0,0,0,0,0,0,0,0,0,0,0,0,0,0,0,0,0,0,0,0,0,0,0,0,0,0,0,0,0,0,0,0,0,0,0,0,0,0,0,0,0,0,0,0,0,0,0,0,0,0,0,0,0,0,0,0,0,0,0,0,0,0,0,0,0,0,0,0,0,0,0,0,0,0,0,0,0,0,0,0,0,0,0,0,0,0,0,0,0,0,0,0,0,0,0,0,0,0,0,0,0,0,0,0,0,0,0,0,0,0,0,0,0,0,0,0,0,0,0,0,0,0,0,0,0,0,0,0,0,0,0,0,0,0,0,0,0,0,0,0,0,0,0,0,0,0,0,0,0,0,0,0,0,0,0,132]
[null,"EPREDIF",0,0,0,0,0,0,0,0,0,0,0,0,0,0,0,0,0,0,0,0,0,0,0,0,0,0,0,0,0,0,0,0,0,1,1,1,1,1,1,1,1,1,1,1,1,1,1,1,1,1,1,1,1,1,1,1,1,1,1,1,1,1,1,1,1,1,2,2,2,2,2,2,2,2,2,2,2,2,2,2,2,2,2,2,2,2,2,2,2,2,2,2,2,2,2,2,2,2,2,3,3,3,3,3,3,3,3,3,3,3,3,3,3,3,3,3,3,3,3,3,3,3,3,3,3,3,3,3,3,3,3,3,4,4,4,4,4,4,4,4,4,4,4,4,4,4,4,4,4,4,4,4,4,4,4,4,4,4,4,4,4,4,4,4,4,5,5,5,5,5,5,5,5,5,5,5,5,5,5,5,5,5,5,5,5,5,5,5,5,5,5,5,5,5,5,5,5,5,7,7,7,7,7,7,7,7,7,7,7,7,7,7,7,7,7,7,7,7,7,7,7,7,7,7,7,7,7,7,7,7,7,9,9,9,9,9,9,9,9,9,9,9,9,9,9,9,9,9,9,9,9,9,9,9,9,9,9,9,9,9,9,9,9,9]
[null,"ERFD",0,1,3,5,7,9,11,13,15,17,19,21,23,25,27,29,31,33,35,37,39,41,43,45,47,49,51,53,55,57,59,61,63,0,1,3,5,7,9,11,13,15,17,19,21,23,25,27,29,31,33,35,37,39,41,43,45,47,49,51,53,55,57,59,61,63,0,1,3,5,7,9,11,13,15,17,19,21,23,25,27,29,31,33,35,37,39,41,43,45,47,49,51,53,55,57,59,61,63,0,1,3,5,7,9,11,13,15,17,19,21,23,25,27,29,31,33,35,37,39,41,43,45,47,49,51,53,55,57,59,61,63,0,1,3,5,7,9,11,13,15,17,19,21,23,25,27,29,31,33,35,37,39,41,43,45,47,49,51,53,55,57,59,61,63,0,1,3,5,7,9,11,13,15,17,19,21,23,25,27,29,31,33,35,37,39,41,43,45,47,49,51,53,55,57,59,61,63,0,1,3,5,7,9,11,13,15,17,19,21,23,25,27,29,31,33,35,37,39,41,43,45,47,49,51,53,55,57,59,61,63,0,1,3,5,7,9,11,13,15,17,19,21,23,25,27,29,31,33,35,37,39,41,43,45,47,49,51,53,55,57,59,61,63]
[null,null,1,2,3,4,5,6,7,8,9,10,11,12,13,14,15,16,17,18,19,20,21,22,23,24,25,26,27,28,29,30,31,32,33,34,35,36,37,38,39,40,41,42,43,44,45,46,47,48,49,50,51,52,53,54,55,56,57,58,59,60,61,62,63,64,65,66,67,68,69,70,71,72,73,74,75,76,77,78,79,80,81,82,83,84,85,86,87,88,89,90,91,92,93,94,95,96,97,98,99,100,101,102,103,104,105,106,107,108,109,110,111,112,113,114,115,116,117,118,119,120,121,122,123,124,125,126,127,128,129,130,131,132,133,134,135,136,137,138,139,140,141,142,143,144,145,146,147,148,149,150,151,152,153,154,155,156,157,158,159,160,161,162,163,164,165,166,167,168,169,170,171,172,173,174,175,176,177,178,179,180,181,182,183,184,185,186,187,188,189,190,191,192,193,194,195,196,197,198,199,200,201,202,203,204,205,206,207,208,209,210,211,212,213,214,215,216,217,218,219,220,221,222,223,224,225,226,227,228,229,230,231,232,233,234,235,236,237,238,239,240,241,242,243,244,245,246,247,248,249,250,251,252,253,254,255,256,257,258,259,260,261,262,263,264]
[null,null,{"$f":"IF(ISNUMBER(VLOOKUP(-1,C32:$JG$132,268-COLUMN(),0)),VLOOKUP(-1,C32:$JG$132,268-COLUMN(),0),\"-\")","v":"-"},{"$f":"IF(ISNUMBER(VLOOKUP(-1,D32:$JG$132,268-COLUMN(),0)),VLOOKUP(-1,D32:$JG$132,268-COLUMN(),0),\"-\")","v":"-"},{"$f":"IF(ISNUMBER(VLOOKUP(-1,E32:$JG$132,268-COLUMN(),0)),VLOOKUP(-1,E32:$JG$132,268-COLUMN(),0),\"-\")","v":"-"},{"$f":"IF(ISNUMBER(VLOOKUP(-1,F32:$JG$132,268-COLUMN(),0)),VLOOKUP(-1,F32:$JG$132,268-COLUMN(),0),\"-\")","v":"-"},{"$f":"IF(ISNUMBER(VLOOKUP(-1,G32:$JG$132,268-COLUMN(),0)),VLOOKUP(-1,G32:$JG$132,268-COLUMN(),0),\"-\")","v":"-"},{"$f":"IF(ISNUMBER(VLOOKUP(-1,H32:$JG$132,268-COLUMN(),0)),VLOOKUP(-1,H32:$JG$132,268-COLUMN(),0),\"-\")","v":"-"},{"$f":"IF(ISNUMBER(VLOOKUP(-1,I32:$JG$132,268-COLUMN(),0)),VLOOKUP(-1,I32:$JG$132,268-COLUMN(),0),\"-\")","v":"-"},{"$f":"IF(ISNUMBER(VLOOKUP(-1,J32:$JG$132,268-COLUMN(),0)),VLOOKUP(-1,J32:$JG$132,268-COLUMN(),0),\"-\")","v":"-"},{"$f":"IF(ISNUMBER(VLOOKUP(-1,K32:$JG$132,268-COLUMN(),0)),VLOOKUP(-1,K32:$JG$132,268-COLUMN(),0),\"-\")","v":"-"},{"$f":"IF(ISNUMBER(VLOOKUP(-1,L32:$JG$132,268-COLUMN(),0)),VLOOKUP(-1,L32:$JG$132,268-COLUMN(),0),\"-\")","v":"-"},{"$f":"IF(ISNUMBER(VLOOKUP(-1,M32:$JG$132,268-COLUMN(),0)),VLOOKUP(-1,M32:$JG$132,268-COLUMN(),0),\"-\")","v":"-"},{"$f":"IF(ISNUMBER(VLOOKUP(-1,N32:$JG$132,268-COLUMN(),0)),VLOOKUP(-1,N32:$JG$132,268-COLUMN(),0),\"-\")","v":"-"},{"$f":"IF(ISNUMBER(VLOOKUP(-1,O32:$JG$132,268-COLUMN(),0)),VLOOKUP(-1,O32:$JG$132,268-COLUMN(),0),\"-\")","v":"-"},{"$f":"IF(ISNUMBER(VLOOKUP(-1,P32:$JG$132,268-COLUMN(),0)),VLOOKUP(-1,P32:$JG$132,268-COLUMN(),0),\"-\")","v":"-"},{"$f":"IF(ISNUMBER(VLOOKUP(-1,Q32:$JG$132,268-COLUMN(),0)),VLOOKUP(-1,Q32:$JG$132,268-COLUMN(),0),\"-\")","v":"-"},{"$f":"IF(ISNUMBER(VLOOKUP(-1,R32:$JG$132,268-COLUMN(),0)),VLOOKUP(-1,R32:$JG$132,268-COLUMN(),0),\"-\")","v":"-"},{"$f":"IF(ISNUMBER(VLOOKUP(-1,S32:$JG$132,268-COLUMN(),0)),VLOOKUP(-1,S32:$JG$132,268-COLUMN(),0),\"-\")","v":"-"},{"$f":"IF(ISNUMBER(VLOOKUP(-1,T32:$JG$132,268-COLUMN(),0)),VLOOKUP(-1,T32:$JG$132,268-COLUMN(),0),\"-\")","v":"-"},{"$f":"IF(ISNUMBER(VLOOKUP(-1,U32:$JG$132,268-COLUMN(),0)),VLOOKUP(-1,U32:$JG$132,268-COLUMN(),0),\"-\")","v":"-"},{"$f":"IF(ISNUMBER(VLOOKUP(-1,V32:$JG$132,268-COLUMN(),0)),VLOOKUP(-1,V32:$JG$132,268-COLUMN(),0),\"-\")","v":"-"},{"$f":"IF(ISNUMBER(VLOOKUP(-1,W32:$JG$132,268-COLUMN(),0)),VLOOKUP(-1,W32:$JG$132,268-COLUMN(),0),\"-\")","v":"-"},{"$f":"IF(ISNUMBER(VLOOKUP(-1,X32:$JG$132,268-COLUMN(),0)),VLOOKUP(-1,X32:$JG$132,268-COLUMN(),0),\"-\")","v":"-"},{"$f":"IF(ISNUMBER(VLOOKUP(-1,Y32:$JG$132,268-COLUMN(),0)),VLOOKUP(-1,Y32:$JG$132,268-COLUMN(),0),\"-\")","v":"-"},{"$f":"IF(ISNUMBER(VLOOKUP(-1,Z32:$JG$132,268-COLUMN(),0)),VLOOKUP(-1,Z32:$JG$132,268-COLUMN(),0),\"-\")","v":"-"},{"$f":"IF(ISNUMBER(VLOOKUP(-1,AA32:$JG$132,268-COLUMN(),0)),VLOOKUP(-1,AA32:$JG$132,268-COLUMN(),0),\"-\")","v":"-"},{"$f":"IF(ISNUMBER(VLOOKUP(-1,AB32:$JG$132,268-COLUMN(),0)),VLOOKUP(-1,AB32:$JG$132,268-COLUMN(),0),\"-\")","v":"-"},{"$f":"IF(ISNUMBER(VLOOKUP(-1,AC32:$JG$132,268-COLUMN(),0)),VLOOKUP(-1,AC32:$JG$132,268-COLUMN(),0),\"-\")","v":"-"},{"$f":"IF(ISNUMBER(VLOOKUP(-1,AD32:$JG$132,268-COLUMN(),0)),VLOOKUP(-1,AD32:$JG$132,268-COLUMN(),0),\"-\")","v":"-"},{"$f":"IF(ISNUMBER(VLOOKUP(-1,AE32:$JG$132,268-COLUMN(),0)),VLOOKUP(-1,AE32:$JG$132,268-COLUMN(),0),\"-\")","v":"-"},{"$f":"IF(ISNUMBER(VLOOKUP(-1,AF32:$JG$132,268-COLUMN(),0)),VLOOKUP(-1,AF32:$JG$132,268-COLUMN(),0),\"-\")","v":"-"},{"$f":"IF(ISNUMBER(VLOOKUP(-1,AG32:$JG$132,268-COLUMN(),0)),VLOOKUP(-1,AG32:$JG$132,268-COLUMN(),0),\"-\")","v":"-"},{"$f":"IF(ISNUMBER(VLOOKUP(-1,AH32:$JG$132,268-COLUMN(),0)),VLOOKUP(-1,AH32:$JG$132,268-COLUMN(),0),\"-\")","v":"-"},{"$f":"IF(ISNUMBER(VLOOKUP(-1,AI32:$JG$132,268-COLUMN(),0)),VLOOKUP(-1,AI32:$JG$132,268-COLUMN(),0),\"-\")","v":"-"},{"$f":"IF(ISNUMBER(VLOOKUP(-1,AJ32:$JG$132,268-COLUMN(),0)),VLOOKUP(-1,AJ32:$JG$132,268-COLUMN(),0),\"-\")","v":"-"},{"$f":"IF(ISNUMBER(VLOOKUP(-1,AK32:$JG$132,268-COLUMN(),0)),VLOOKUP(-1,AK32:$JG$132,268-COLUMN(),0),\"-\")","v":"-"},{"$f":"IF(ISNUMBER(VLOOKUP(-1,AL32:$JG$132,268-COLUMN(),0)),VLOOKUP(-1,AL32:$JG$132,268-COLUMN(),0),\"-\")","v":"-"},{"$f":"IF(ISNUMBER(VLOOKUP(-1,AM32:$JG$132,268-COLUMN(),0)),VLOOKUP(-1,AM32:$JG$132,268-COLUMN(),0),\"-\")","v":"-"},{"$f":"IF(ISNUMBER(VLOOKUP(-1,AN32:$JG$132,268-COLUMN(),0)),VLOOKUP(-1,AN32:$JG$132,268-COLUMN(),0),\"-\")","v":44},{"$f":"IF(ISNUMBER(VLOOKUP(-1,AO32:$JG$132,268-COLUMN(),0)),VLOOKUP(-1,AO32:$JG$132,268-COLUMN(),0),\"-\")","v":"-"},{"$f":"IF(ISNUMBER(VLOOKUP(-1,AP32:$JG$132,268-COLUMN(),0)),VLOOKUP(-1,AP32:$JG$132,268-COLUMN(),0),\"-\")","v":"-"},{"$f":"IF(ISNUMBER(VLOOKUP(-1,AQ32:$JG$132,268-COLUMN(),0)),VLOOKUP(-1,AQ32:$JG$132,268-COLUMN(),0),\"-\")","v":"-"},{"$f":"IF(ISNUMBER(VLOOKUP(-1,AR32:$JG$132,268-COLUMN(),0)),VLOOKUP(-1,AR32:$JG$132,268-COLUMN(),0),\"-\")","v":"-"},{"$f":"IF(ISNUMBER(VLOOKUP(-1,AS32:$JG$132,268-COLUMN(),0)),VLOOKUP(-1,AS32:$JG$132,268-COLUMN(),0),\"-\")","v":"-"},{"$f":"IF(ISNUMBER(VLOOKUP(-1,AT32:$JG$132,268-COLUMN(),0)),VLOOKUP(-1,AT32:$JG$132,268-COLUMN(),0),\"-\")","v":"-"},{"$f":"IF(ISNUMBER(VLOOKUP(-1,AU32:$JG$132,268-COLUMN(),0)),VLOOKUP(-1,AU32:$JG$132,268-COLUMN(),0),\"-\")","v":"-"},{"$f":"IF(ISNUMBER(VLOOKUP(-1,AV32:$JG$132,268-COLUMN(),0)),VLOOKUP(-1,AV32:$JG$132,268-COLUMN(),0),\"-\")","v":"-"},{"$f":"IF(ISNUMBER(VLOOKUP(-1,AW32:$JG$132,268-COLUMN(),0)),VLOOKUP(-1,AW32:$JG$132,268-COLUMN(),0),\"-\")","v":"-"},{"$f":"IF(ISNUMBER(VLOOKUP(-1,AX32:$JG$132,268-COLUMN(),0)),VLOOKUP(-1,AX32:$JG$132,268-COLUMN(),0),\"-\")","v":"-"},{"$f":"IF(ISNUMBER(VLOOKUP(-1,AY32:$JG$132,268-COLUMN(),0)),VLOOKUP(-1,AY32:$JG$132,268-COLUMN(),0),\"-\")","v":"-"},{"$f":"IF(ISNUMBER(VLOOKUP(-1,AZ32:$JG$132,268-COLUMN(),0)),VLOOKUP(-1,AZ32:$JG$132,268-COLUMN(),0),\"-\")","v":"-"},{"$f":"IF(ISNUMBER(VLOOKUP(-1,BA32:$JG$132,268-COLUMN(),0)),VLOOKUP(-1,BA32:$JG$132,268-COLUMN(),0),\"-\")","v":"-"},{"$f":"IF(ISNUMBER(VLOOKUP(-1,BB32:$JG$132,268-COLUMN(),0)),VLOOKUP(-1,BB32:$JG$132,268-COLUMN(),0),\"-\")","v":"-"},{"$f":"IF(ISNUMBER(VLOOKUP(-1,BC32:$JG$132,268-COLUMN(),0)),VLOOKUP(-1,BC32:$JG$132,268-COLUMN(),0),\"-\")","v":"-"},{"$f":"IF(ISNUMBER(VLOOKUP(-1,BD32:$JG$132,268-COLUMN(),0)),VLOOKUP(-1,BD32:$JG$132,268-COLUMN(),0),\"-\")","v":"-"},{"$f":"IF(ISNUMBER(VLOOKUP(-1,BE32:$JG$132,268-COLUMN(),0)),VLOOKUP(-1,BE32:$JG$132,268-COLUMN(),0),\"-\")","v":"-"},{"$f":"IF(ISNUMBER(VLOOKUP(-1,BF32:$JG$132,268-COLUMN(),0)),VLOOKUP(-1,BF32:$JG$132,268-COLUMN(),0),\"-\")","v":"-"},{"$f":"IF(ISNUMBER(VLOOKUP(-1,BG32:$JG$132,268-COLUMN(),0)),VLOOKUP(-1,BG32:$JG$132,268-COLUMN(),0),\"-\")","v":"-"},{"$f":"IF(ISNUMBER(VLOOKUP(-1,BH32:$JG$132,268-COLUMN(),0)),VLOOKUP(-1,BH32:$JG$132,268-COLUMN(),0),\"-\")","v":"-"},{"$f":"IF(ISNUMBER(VLOOKUP(-1,BI32:$JG$132,268-COLUMN(),0)),VLOOKUP(-1,BI32:$JG$132,268-COLUMN(),0),\"-\")","v":"-"},{"$f":"IF(ISNUMBER(VLOOKUP(-1,BJ32:$JG$132,268-COLUMN(),0)),VLOOKUP(-1,BJ32:$JG$132,268-COLUMN(),0),\"-\")","v":"-"},{"$f":"IF(ISNUMBER(VLOOKUP(-1,BK32:$JG$132,268-COLUMN(),0)),VLOOKUP(-1,BK32:$JG$132,268-COLUMN(),0),\"-\")","v":"-"},{"$f":"IF(ISNUMBER(VLOOKUP(-1,BL32:$JG$132,268-COLUMN(),0)),VLOOKUP(-1,BL32:$JG$132,268-COLUMN(),0),\"-\")","v":"-"},{"$f":"IF(ISNUMBER(VLOOKUP(-1,BM32:$JG$132,268-COLUMN(),0)),VLOOKUP(-1,BM32:$JG$132,268-COLUMN(),0),\"-\")","v":"-"},{"$f":"IF(ISNUMBER(VLOOKUP(-1,BN32:$JG$132,268-COLUMN(),0)),VLOOKUP(-1,BN32:$JG$132,268-COLUMN(),0),\"-\")","v":"-"},{"$f":"IF(ISNUMBER(VLOOKUP(-1,BO32:$JG$132,268-COLUMN(),0)),VLOOKUP(-1,BO32:$JG$132,268-COLUMN(),0),\"-\")","v":"-"},{"$f":"IF(ISNUMBER(VLOOKUP(-1,BP32:$JG$132,268-COLUMN(),0)),VLOOKUP(-1,BP32:$JG$132,268-COLUMN(),0),\"-\")","v":"-"},{"$f":"IF(ISNUMBER(VLOOKUP(-1,BQ32:$JG$132,268-COLUMN(),0)),VLOOKUP(-1,BQ32:$JG$132,268-COLUMN(),0),\"-\")","v":"-"},{"$f":"IF(ISNUMBER(VLOOKUP(-1,BR32:$JG$132,268-COLUMN(),0)),VLOOKUP(-1,BR32:$JG$132,268-COLUMN(),0),\"-\")","v":"-"},{"$f":"IF(ISNUMBER(VLOOKUP(-1,BS32:$JG$132,268-COLUMN(),0)),VLOOKUP(-1,BS32:$JG$132,268-COLUMN(),0),\"-\")","v":"-"},{"$f":"IF(ISNUMBER(VLOOKUP(-1,BT32:$JG$132,268-COLUMN(),0)),VLOOKUP(-1,BT32:$JG$132,268-COLUMN(),0),\"-\")","v":"-"},{"$f":"IF(ISNUMBER(VLOOKUP(-1,BU32:$JG$132,268-COLUMN(),0)),VLOOKUP(-1,BU32:$JG$132,268-COLUMN(),0),\"-\")","v":74},{"$f":"IF(ISNUMBER(VLOOKUP(-1,BV32:$JG$132,268-COLUMN(),0)),VLOOKUP(-1,BV32:$JG$132,268-COLUMN(),0),\"-\")","v":"-"},{"$f":"IF(ISNUMBER(VLOOKUP(-1,BW32:$JG$132,268-COLUMN(),0)),VLOOKUP(-1,BW32:$JG$132,268-COLUMN(),0),\"-\")","v":"-"},{"$f":"IF(ISNUMBER(VLOOKUP(-1,BX32:$JG$132,268-COLUMN(),0)),VLOOKUP(-1,BX32:$JG$132,268-COLUMN(),0),\"-\")","v":"-"},{"$f":"IF(ISNUMBER(VLOOKUP(-1,BY32:$JG$132,268-COLUMN(),0)),VLOOKUP(-1,BY32:$JG$132,268-COLUMN(),0),\"-\")","v":"-"},{"$f":"IF(ISNUMBER(VLOOKUP(-1,BZ32:$JG$132,268-COLUMN(),0)),VLOOKUP(-1,BZ32:$JG$132,268-COLUMN(),0),\"-\")","v":"-"},{"$f":"IF(ISNUMBER(VLOOKUP(-1,CA32:$JG$132,268-COLUMN(),0)),VLOOKUP(-1,CA32:$JG$132,268-COLUMN(),0),\"-\")","v":"-"},{"$f":"IF(ISNUMBER(VLOOKUP(-1,CB32:$JG$132,268-COLUMN(),0)),VLOOKUP(-1,CB32:$JG$132,268-COLUMN(),0),\"-\")","v":"-"},{"$f":"IF(ISNUMBER(VLOOKUP(-1,CC32:$JG$132,268-COLUMN(),0)),VLOOKUP(-1,CC32:$JG$132,268-COLUMN(),0),\"-\")","v":"-"},{"$f":"IF(ISNUMBER(VLOOKUP(-1,CD32:$JG$132,268-COLUMN(),0)),VLOOKUP(-1,CD32:$JG$132,268-COLUMN(),0),\"-\")","v":"-"},{"$f":"IF(ISNUMBER(VLOOKUP(-1,CE32:$JG$132,268-COLUMN(),0)),VLOOKUP(-1,CE32:$JG$132,268-COLUMN(),0),\"-\")","v":"-"},{"$f":"IF(ISNUMBER(VLOOKUP(-1,CF32:$JG$132,268-COLUMN(),0)),VLOOKUP(-1,CF32:$JG$132,268-COLUMN(),0),\"-\")","v":"-"},{"$f":"IF(ISNUMBER(VLOOKUP(-1,CG32:$JG$132,268-COLUMN(),0)),VLOOKUP(-1,CG32:$JG$132,268-COLUMN(),0),\"-\")","v":"-"},{"$f":"IF(ISNUMBER(VLOOKUP(-1,CH32:$JG$132,268-COLUMN(),0)),VLOOKUP(-1,CH32:$JG$132,268-COLUMN(),0),\"-\")","v":"-"},{"$f":"IF(ISNUMBER(VLOOKUP(-1,CI32:$JG$132,268-COLUMN(),0)),VLOOKUP(-1,CI32:$JG$132,268-COLUMN(),0),\"-\")","v":"-"},{"$f":"IF(ISNUMBER(VLOOKUP(-1,CJ32:$JG$132,268-COLUMN(),0)),VLOOKUP(-1,CJ32:$JG$132,268-COLUMN(),0),\"-\")","v":"-"},{"$f":"IF(ISNUMBER(VLOOKUP(-1,CK32:$JG$132,268-COLUMN(),0)),VLOOKUP(-1,CK32:$JG$132,268-COLUMN(),0),\"-\")","v":"-"},{"$f":"IF(ISNUMBER(VLOOKUP(-1,CL32:$JG$132,268-COLUMN(),0)),VLOOKUP(-1,CL32:$JG$132,268-COLUMN(),0),\"-\")","v":"-"},{"$f":"IF(ISNUMBER(VLOOKUP(-1,CM32:$JG$132,268-COLUMN(),0)),VLOOKUP(-1,CM32:$JG$132,268-COLUMN(),0),\"-\")","v":"-"},{"$f":"IF(ISNUMBER(VLOOKUP(-1,CN32:$JG$132,268-COLUMN(),0)),VLOOKUP(-1,CN32:$JG$132,268-COLUMN(),0),\"-\")","v":"-"},{"$f":"IF(ISNUMBER(VLOOKUP(-1,CO32:$JG$132,268-COLUMN(),0)),VLOOKUP(-1,CO32:$JG$132,268-COLUMN(),0),\"-\")","v":"-"},{"$f":"IF(ISNUMBER(VLOOKUP(-1,CP32:$JG$132,268-COLUMN(),0)),VLOOKUP(-1,CP32:$JG$132,268-COLUMN(),0),\"-\")","v":"-"},{"$f":"IF(ISNUMBER(VLOOKUP(-1,CQ32:$JG$132,268-COLUMN(),0)),VLOOKUP(-1,CQ32:$JG$132,268-COLUMN(),0),\"-\")","v":"-"},{"$f":"IF(ISNUMBER(VLOOKUP(-1,CR32:$JG$132,268-COLUMN(),0)),VLOOKUP(-1,CR32:$JG$132,268-COLUMN(),0),\"-\")","v":"-"},{"$f":"IF(ISNUMBER(VLOOKUP(-1,CS32:$JG$132,268-COLUMN(),0)),VLOOKUP(-1,CS32:$JG$132,268-COLUMN(),0),\"-\")","v":"-"},{"$f":"IF(ISNUMBER(VLOOKUP(-1,CT32:$JG$132,268-COLUMN(),0)),VLOOKUP(-1,CT32:$JG$132,268-COLUMN(),0),\"-\")","v":"-"},{"$f":"IF(ISNUMBER(VLOOKUP(-1,CU32:$JG$132,268-COLUMN(),0)),VLOOKUP(-1,CU32:$JG$132,268-COLUMN(),0),\"-\")","v":"-"},{"$f":"IF(ISNUMBER(VLOOKUP(-1,CV32:$JG$132,268-COLUMN(),0)),VLOOKUP(-1,CV32:$JG$132,268-COLUMN(),0),\"-\")","v":"-"},{"$f":"IF(ISNUMBER(VLOOKUP(-1,CW32:$JG$132,268-COLUMN(),0)),VLOOKUP(-1,CW32:$JG$132,268-COLUMN(),0),\"-\")","v":"-"},{"$f":"IF(ISNUMBER(VLOOKUP(-1,CX32:$JG$132,268-COLUMN(),0)),VLOOKUP(-1,CX32:$JG$132,268-COLUMN(),0),\"-\")","v":"-"},{"$f":"IF(ISNUMBER(VLOOKUP(-1,CY32:$JG$132,268-COLUMN(),0)),VLOOKUP(-1,CY32:$JG$132,268-COLUMN(),0),\"-\")","v":"-"},{"$f":"IF(ISNUMBER(VLOOKUP(-1,CZ32:$JG$132,268-COLUMN(),0)),VLOOKUP(-1,CZ32:$JG$132,268-COLUMN(),0),\"-\")","v":"-"},{"$f":"IF(ISNUMBER(VLOOKUP(-1,DA32:$JG$132,268-COLUMN(),0)),VLOOKUP(-1,DA32:$JG$132,268-COLUMN(),0),\"-\")","v":74},{"$f":"IF(ISNUMBER(VLOOKUP(-1,DB32:$JG$132,268-COLUMN(),0)),VLOOKUP(-1,DB32:$JG$132,268-COLUMN(),0),\"-\")","v":104},{"$f":"IF(ISNUMBER(VLOOKUP(-1,DC32:$JG$132,268-COLUMN(),0)),VLOOKUP(-1,DC32:$JG$132,268-COLUMN(),0),\"-\")","v":"-"},{"$f":"IF(ISNUMBER(VLOOKUP(-1,DD32:$JG$132,268-COLUMN(),0)),VLOOKUP(-1,DD32:$JG$132,268-COLUMN(),0),\"-\")","v":"-"},{"$f":"IF(ISNUMBER(VLOOKUP(-1,DE32:$JG$132,268-COLUMN(),0)),VLOOKUP(-1,DE32:$JG$132,268-COLUMN(),0),\"-\")","v":"-"},{"$f":"IF(ISNUMBER(VLOOKUP(-1,DF32:$JG$132,268-COLUMN(),0)),VLOOKUP(-1,DF32:$JG$132,268-COLUMN(),0),\"-\")","v":"-"},{"$f":"IF(ISNUMBER(VLOOKUP(-1,DG32:$JG$132,268-COLUMN(),0)),VLOOKUP(-1,DG32:$JG$132,268-COLUMN(),0),\"-\")","v":"-"},{"$f":"IF(ISNUMBER(VLOOKUP(-1,DH32:$JG$132,268-COLUMN(),0)),VLOOKUP(-1,DH32:$JG$132,268-COLUMN(),0),\"-\")","v":"-"},{"$f":"IF(ISNUMBER(VLOOKUP(-1,DI32:$JG$132,268-COLUMN(),0)),VLOOKUP(-1,DI32:$JG$132,268-COLUMN(),0),\"-\")","v":"-"},{"$f":"IF(ISNUMBER(VLOOKUP(-1,DJ32:$JG$132,268-COLUMN(),0)),VLOOKUP(-1,DJ32:$JG$132,268-COLUMN(),0),\"-\")","v":"-"},{"$f":"IF(ISNUMBER(VLOOKUP(-1,DK32:$JG$132,268-COLUMN(),0)),VLOOKUP(-1,DK32:$JG$132,268-COLUMN(),0),\"-\")","v":"-"},{"$f":"IF(ISNUMBER(VLOOKUP(-1,DL32:$JG$132,268-COLUMN(),0)),VLOOKUP(-1,DL32:$JG$132,268-COLUMN(),0),\"-\")","v":"-"},{"$f":"IF(ISNUMBER(VLOOKUP(-1,DM32:$JG$132,268-COLUMN(),0)),VLOOKUP(-1,DM32:$JG$132,268-COLUMN(),0),\"-\")","v":"-"},{"$f":"IF(ISNUMBER(VLOOKUP(-1,DN32:$JG$132,268-COLUMN(),0)),VLOOKUP(-1,DN32:$JG$132,268-COLUMN(),0),\"-\")","v":"-"},{"$f":"IF(ISNUMBER(VLOOKUP(-1,DO32:$JG$132,268-COLUMN(),0)),VLOOKUP(-1,DO32:$JG$132,268-COLUMN(),0),\"-\")","v":"-"},{"$f":"IF(ISNUMBER(VLOOKUP(-1,DP32:$JG$132,268-COLUMN(),0)),VLOOKUP(-1,DP32:$JG$132,268-COLUMN(),0),\"-\")","v":"-"},{"$f":"IF(ISNUMBER(VLOOKUP(-1,DQ32:$JG$132,268-COLUMN(),0)),VLOOKUP(-1,DQ32:$JG$132,268-COLUMN(),0),\"-\")","v":"-"},{"$f":"IF(ISNUMBER(VLOOKUP(-1,DR32:$JG$132,268-COLUMN(),0)),VLOOKUP(-1,DR32:$JG$132,268-COLUMN(),0),\"-\")","v":"-"},{"$f":"IF(ISNUMBER(VLOOKUP(-1,DS32:$JG$132,268-COLUMN(),0)),VLOOKUP(-1,DS32:$JG$132,268-COLUMN(),0),\"-\")","v":"-"},{"$f":"IF(ISNUMBER(VLOOKUP(-1,DT32:$JG$132,268-COLUMN(),0)),VLOOKUP(-1,DT32:$JG$132,268-COLUMN(),0),\"-\")","v":"-"},{"$f":"IF(ISNUMBER(VLOOKUP(-1,DU32:$JG$132,268-COLUMN(),0)),VLOOKUP(-1,DU32:$JG$132,268-COLUMN(),0),\"-\")","v":"-"},{"$f":"IF(ISNUMBER(VLOOKUP(-1,DV32:$JG$132,268-COLUMN(),0)),VLOOKUP(-1,DV32:$JG$132,268-COLUMN(),0),\"-\")","v":"-"},{"$f":"IF(ISNUMBER(VLOOKUP(-1,DW32:$JG$132,268-COLUMN(),0)),VLOOKUP(-1,DW32:$JG$132,268-COLUMN(),0),\"-\")","v":"-"},{"$f":"IF(ISNUMBER(VLOOKUP(-1,DX32:$JG$132,268-COLUMN(),0)),VLOOKUP(-1,DX32:$JG$132,268-COLUMN(),0),\"-\")","v":"-"},{"$f":"IF(ISNUMBER(VLOOKUP(-1,DY32:$JG$132,268-COLUMN(),0)),VLOOKUP(-1,DY32:$JG$132,268-COLUMN(),0),\"-\")","v":"-"},{"$f":"IF(ISNUMBER(VLOOKUP(-1,DZ32:$JG$132,268-COLUMN(),0)),VLOOKUP(-1,DZ32:$JG$132,268-COLUMN(),0),\"-\")","v":"-"},{"$f":"IF(ISNUMBER(VLOOKUP(-1,EA32:$JG$132,268-COLUMN(),0)),VLOOKUP(-1,EA32:$JG$132,268-COLUMN(),0),\"-\")","v":"-"},{"$f":"IF(ISNUMBER(VLOOKUP(-1,EB32:$JG$132,268-COLUMN(),0)),VLOOKUP(-1,EB32:$JG$132,268-COLUMN(),0),\"-\")","v":"-"},{"$f":"IF(ISNUMBER(VLOOKUP(-1,EC32:$JG$132,268-COLUMN(),0)),VLOOKUP(-1,EC32:$JG$132,268-COLUMN(),0),\"-\")","v":"-"},{"$f":"IF(ISNUMBER(VLOOKUP(-1,ED32:$JG$132,268-COLUMN(),0)),VLOOKUP(-1,ED32:$JG$132,268-COLUMN(),0),\"-\")","v":"-"},{"$f":"IF(ISNUMBER(VLOOKUP(-1,EE32:$JG$132,268-COLUMN(),0)),VLOOKUP(-1,EE32:$JG$132,268-COLUMN(),0),\"-\")","v":"-"},{"$f":"IF(ISNUMBER(VLOOKUP(-1,EF32:$JG$132,268-COLUMN(),0)),VLOOKUP(-1,EF32:$JG$132,268-COLUMN(),0),\"-\")","v":"-"},{"$f":"IF(ISNUMBER(VLOOKUP(-1,EG32:$JG$132,268-COLUMN(),0)),VLOOKUP(-1,EG32:$JG$132,268-COLUMN(),0),\"-\")","v":"-"},{"$f":"IF(ISNUMBER(VLOOKUP(-1,EH32:$JG$132,268-COLUMN(),0)),VLOOKUP(-1,EH32:$JG$132,268-COLUMN(),0),\"-\")","v":"-"},{"$f":"IF(ISNUMBER(VLOOKUP(-1,EI32:$JG$132,268-COLUMN(),0)),VLOOKUP(-1,EI32:$JG$132,268-COLUMN(),0),\"-\")","v":"-"},{"$f":"IF(ISNUMBER(VLOOKUP(-1,EJ32:$JG$132,268-COLUMN(),0)),VLOOKUP(-1,EJ32:$JG$132,268-COLUMN(),0),\"-\")","v":"-"},{"$f":"IF(ISNUMBER(VLOOKUP(-1,EK32:$JG$132,268-COLUMN(),0)),VLOOKUP(-1,EK32:$JG$132,268-COLUMN(),0),\"-\")","v":"-"},{"$f":"IF(ISNUMBER(VLOOKUP(-1,EL32:$JG$132,268-COLUMN(),0)),VLOOKUP(-1,EL32:$JG$132,268-COLUMN(),0),\"-\")","v":"-"},{"$f":"IF(ISNUMBER(VLOOKUP(-1,EM32:$JG$132,268-COLUMN(),0)),VLOOKUP(-1,EM32:$JG$132,268-COLUMN(),0),\"-\")","v":"-"},{"$f":"IF(ISNUMBER(VLOOKUP(-1,EN32:$JG$132,268-COLUMN(),0)),VLOOKUP(-1,EN32:$JG$132,268-COLUMN(),0),\"-\")","v":"-"},{"$f":"IF(ISNUMBER(VLOOKUP(-1,EO32:$JG$132,268-COLUMN(),0)),VLOOKUP(-1,EO32:$JG$132,268-COLUMN(),0),\"-\")","v":"-"},{"$f":"IF(ISNUMBER(VLOOKUP(-1,EP32:$JG$132,268-COLUMN(),0)),VLOOKUP(-1,EP32:$JG$132,268-COLUMN(),0),\"-\")","v":"-"},{"$f":"IF(ISNUMBER(VLOOKUP(-1,EQ32:$JG$132,268-COLUMN(),0)),VLOOKUP(-1,EQ32:$JG$132,268-COLUMN(),0),\"-\")","v":"-"},{"$f":"IF(ISNUMBER(VLOOKUP(-1,ER32:$JG$132,268-COLUMN(),0)),VLOOKUP(-1,ER32:$JG$132,268-COLUMN(),0),\"-\")","v":"-"},{"$f":"IF(ISNUMBER(VLOOKUP(-1,ES32:$JG$132,268-COLUMN(),0)),VLOOKUP(-1,ES32:$JG$132,268-COLUMN(),0),\"-\")","v":"-"},{"$f":"IF(ISNUMBER(VLOOKUP(-1,ET32:$JG$132,268-COLUMN(),0)),VLOOKUP(-1,ET32:$JG$132,268-COLUMN(),0),\"-\")","v":"-"},{"$f":"IF(ISNUMBER(VLOOKUP(-1,EU32:$JG$132,268-COLUMN(),0)),VLOOKUP(-1,EU32:$JG$132,268-COLUMN(),0),\"-\")","v":"-"},{"$f":"IF(ISNUMBER(VLOOKUP(-1,EV32:$JG$132,268-COLUMN(),0)),VLOOKUP(-1,EV32:$JG$132,268-COLUMN(),0),\"-\")","v":"-"},{"$f":"IF(ISNUMBER(VLOOKUP(-1,EW32:$JG$132,268-COLUMN(),0)),VLOOKUP(-1,EW32:$JG$132,268-COLUMN(),0),\"-\")","v":"-"},{"$f":"IF(ISNUMBER(VLOOKUP(-1,EX32:$JG$132,268-COLUMN(),0)),VLOOKUP(-1,EX32:$JG$132,268-COLUMN(),0),\"-\")","v":"-"},{"$f":"IF(ISNUMBER(VLOOKUP(-1,EY32:$JG$132,268-COLUMN(),0)),VLOOKUP(-1,EY32:$JG$132,268-COLUMN(),0),\"-\")","v":"-"},{"$f":"IF(ISNUMBER(VLOOKUP(-1,EZ32:$JG$132,268-COLUMN(),0)),VLOOKUP(-1,EZ32:$JG$132,268-COLUMN(),0),\"-\")","v":"-"},{"$f":"IF(ISNUMBER(VLOOKUP(-1,FA32:$JG$132,268-COLUMN(),0)),VLOOKUP(-1,FA32:$JG$132,268-COLUMN(),0),\"-\")","v":"-"},{"$f":"IF(ISNUMBER(VLOOKUP(-1,FB32:$JG$132,268-COLUMN(),0)),VLOOKUP(-1,FB32:$JG$132,268-COLUMN(),0),\"-\")","v":"-"},{"$f":"IF(ISNUMBER(VLOOKUP(-1,FC32:$JG$132,268-COLUMN(),0)),VLOOKUP(-1,FC32:$JG$132,268-COLUMN(),0),\"-\")","v":"-"},{"$f":"IF(ISNUMBER(VLOOKUP(-1,FD32:$JG$132,268-COLUMN(),0)),VLOOKUP(-1,FD32:$JG$132,268-COLUMN(),0),\"-\")","v":"-"},{"$f":"IF(ISNUMBER(VLOOKUP(-1,FE32:$JG$132,268-COLUMN(),0)),VLOOKUP(-1,FE32:$JG$132,268-COLUMN(),0),\"-\")","v":"-"},{"$f":"IF(ISNUMBER(VLOOKUP(-1,FF32:$JG$132,268-COLUMN(),0)),VLOOKUP(-1,FF32:$JG$132,268-COLUMN(),0),\"-\")","v":"-"},{"$f":"IF(ISNUMBER(VLOOKUP(-1,FG32:$JG$132,268-COLUMN(),0)),VLOOKUP(-1,FG32:$JG$132,268-COLUMN(),0),\"-\")","v":"-"},{"$f":"IF(ISNUMBER(VLOOKUP(-1,FH32:$JG$132,268-COLUMN(),0)),VLOOKUP(-1,FH32:$JG$132,268-COLUMN(),0),\"-\")","v":"-"},{"$f":"IF(ISNUMBER(VLOOKUP(-1,FI32:$JG$132,268-COLUMN(),0)),VLOOKUP(-1,FI32:$JG$132,268-COLUMN(),0),\"-\")","v":"-"},{"$f":"IF(ISNUMBER(VLOOKUP(-1,FJ32:$JG$132,268-COLUMN(),0)),VLOOKUP(-1,FJ32:$JG$132,268-COLUMN(),0),\"-\")","v":"-"},{"$f":"IF(ISNUMBER(VLOOKUP(-1,FK32:$JG$132,268-COLUMN(),0)),VLOOKUP(-1,FK32:$JG$132,268-COLUMN(),0),\"-\")","v":"-"},{"$f":"IF(ISNUMBER(VLOOKUP(-1,FL32:$JG$132,268-COLUMN(),0)),VLOOKUP(-1,FL32:$JG$132,268-COLUMN(),0),\"-\")","v":"-"},{"$f":"IF(ISNUMBER(VLOOKUP(-1,FM32:$JG$132,268-COLUMN(),0)),VLOOKUP(-1,FM32:$JG$132,268-COLUMN(),0),\"-\")","v":"-"},{"$f":"IF(ISNUMBER(VLOOKUP(-1,FN32:$JG$132,268-COLUMN(),0)),VLOOKUP(-1,FN32:$JG$132,268-COLUMN(),0),\"-\")","v":"-"},{"$f":"IF(ISNUMBER(VLOOKUP(-1,FO32:$JG$132,268-COLUMN(),0)),VLOOKUP(-1,FO32:$JG$132,268-COLUMN(),0),\"-\")","v":"-"},{"$f":"IF(ISNUMBER(VLOOKUP(-1,FP32:$JG$132,268-COLUMN(),0)),VLOOKUP(-1,FP32:$JG$132,268-COLUMN(),0),\"-\")","v":"-"},{"$f":"IF(ISNUMBER(VLOOKUP(-1,FQ32:$JG$132,268-COLUMN(),0)),VLOOKUP(-1,FQ32:$JG$132,268-COLUMN(),0),\"-\")","v":"-"},{"$f":"IF(ISNUMBER(VLOOKUP(-1,FR32:$JG$132,268-COLUMN(),0)),VLOOKUP(-1,FR32:$JG$132,268-COLUMN(),0),\"-\")","v":"-"},{"$f":"IF(ISNUMBER(VLOOKUP(-1,FS32:$JG$132,268-COLUMN(),0)),VLOOKUP(-1,FS32:$JG$132,268-COLUMN(),0),\"-\")","v":"-"},{"$f":"IF(ISNUMBER(VLOOKUP(-1,FT32:$JG$132,268-COLUMN(),0)),VLOOKUP(-1,FT32:$JG$132,268-COLUMN(),0),\"-\")","v":"-"},{"$f":"IF(ISNUMBER(VLOOKUP(-1,FU32:$JG$132,268-COLUMN(),0)),VLOOKUP(-1,FU32:$JG$132,268-COLUMN(),0),\"-\")","v":"-"},{"$f":"IF(ISNUMBER(VLOOKUP(-1,FV32:$JG$132,268-COLUMN(),0)),VLOOKUP(-1,FV32:$JG$132,268-COLUMN(),0),\"-\")","v":"-"},{"$f":"IF(ISNUMBER(VLOOKUP(-1,FW32:$JG$132,268-COLUMN(),0)),VLOOKUP(-1,FW32:$JG$132,268-COLUMN(),0),\"-\")","v":"-"},{"$f":"IF(ISNUMBER(VLOOKUP(-1,FX32:$JG$132,268-COLUMN(),0)),VLOOKUP(-1,FX32:$JG$132,268-COLUMN(),0),\"-\")","v":"-"},{"$f":"IF(ISNUMBER(VLOOKUP(-1,FY32:$JG$132,268-COLUMN(),0)),VLOOKUP(-1,FY32:$JG$132,268-COLUMN(),0),\"-\")","v":"-"},{"$f":"IF(ISNUMBER(VLOOKUP(-1,FZ32:$JG$132,268-COLUMN(),0)),VLOOKUP(-1,FZ32:$JG$132,268-COLUMN(),0),\"-\")","v":"-"},{"$f":"IF(ISNUMBER(VLOOKUP(-1,GA32:$JG$132,268-COLUMN(),0)),VLOOKUP(-1,GA32:$JG$132,268-COLUMN(),0),\"-\")","v":"-"},{"$f":"IF(ISNUMBER(VLOOKUP(-1,GB32:$JG$132,268-COLUMN(),0)),VLOOKUP(-1,GB32:$JG$132,268-COLUMN(),0),\"-\")","v":"-"},{"$f":"IF(ISNUMBER(VLOOKUP(-1,GC32:$JG$132,268-COLUMN(),0)),VLOOKUP(-1,GC32:$JG$132,268-COLUMN(),0),\"-\")","v":"-"},{"$f":"IF(ISNUMBER(VLOOKUP(-1,GD32:$JG$132,268-COLUMN(),0)),VLOOKUP(-1,GD32:$JG$132,268-COLUMN(),0),\"-\")","v":"-"},{"$f":"IF(ISNUMBER(VLOOKUP(-1,GE32:$JG$132,268-COLUMN(),0)),VLOOKUP(-1,GE32:$JG$132,268-COLUMN(),0),\"-\")","v":"-"},{"$f":"IF(ISNUMBER(VLOOKUP(-1,GF32:$JG$132,268-COLUMN(),0)),VLOOKUP(-1,GF32:$JG$132,268-COLUMN(),0),\"-\")","v":"-"},{"$f":"IF(ISNUMBER(VLOOKUP(-1,GG32:$JG$132,268-COLUMN(),0)),VLOOKUP(-1,GG32:$JG$132,268-COLUMN(),0),\"-\")","v":"-"},{"$f":"IF(ISNUMBER(VLOOKUP(-1,GH32:$JG$132,268-COLUMN(),0)),VLOOKUP(-1,GH32:$JG$132,268-COLUMN(),0),\"-\")","v":"-"},{"$f":"IF(ISNUMBER(VLOOKUP(-1,GI32:$JG$132,268-COLUMN(),0)),VLOOKUP(-1,GI32:$JG$132,268-COLUMN(),0),\"-\")","v":"-"},{"$f":"IF(ISNUMBER(VLOOKUP(-1,GJ32:$JG$132,268-COLUMN(),0)),VLOOKUP(-1,GJ32:$JG$132,268-COLUMN(),0),\"-\")","v":"-"},{"$f":"IF(ISNUMBER(VLOOKUP(-1,GK32:$JG$132,268-COLUMN(),0)),VLOOKUP(-1,GK32:$JG$132,268-COLUMN(),0),\"-\")","v":"-"},{"$f":"IF(ISNUMBER(VLOOKUP(-1,GL32:$JG$132,268-COLUMN(),0)),VLOOKUP(-1,GL32:$JG$132,268-COLUMN(),0),\"-\")","v":"-"},{"$f":"IF(ISNUMBER(VLOOKUP(-1,GM32:$JG$132,268-COLUMN(),0)),VLOOKUP(-1,GM32:$JG$132,268-COLUMN(),0),\"-\")","v":"-"},{"$f":"IF(ISNUMBER(VLOOKUP(-1,GN32:$JG$132,268-COLUMN(),0)),VLOOKUP(-1,GN32:$JG$132,268-COLUMN(),0),\"-\")","v":"-"},{"$f":"IF(ISNUMBER(VLOOKUP(-1,GO32:$JG$132,268-COLUMN(),0)),VLOOKUP(-1,GO32:$JG$132,268-COLUMN(),0),\"-\")","v":"-"},{"$f":"IF(ISNUMBER(VLOOKUP(-1,GP32:$JG$132,268-COLUMN(),0)),VLOOKUP(-1,GP32:$JG$132,268-COLUMN(),0),\"-\")","v":"-"},{"$f":"IF(ISNUMBER(VLOOKUP(-1,GQ32:$JG$132,268-COLUMN(),0)),VLOOKUP(-1,GQ32:$JG$132,268-COLUMN(),0),\"-\")","v":"-"},{"$f":"IF(ISNUMBER(VLOOKUP(-1,GR32:$JG$132,268-COLUMN(),0)),VLOOKUP(-1,GR32:$JG$132,268-COLUMN(),0),\"-\")","v":"-"},{"$f":"IF(ISNUMBER(VLOOKUP(-1,GS32:$JG$132,268-COLUMN(),0)),VLOOKUP(-1,GS32:$JG$132,268-COLUMN(),0),\"-\")","v":"-"},{"$f":"IF(ISNUMBER(VLOOKUP(-1,GT32:$JG$132,268-COLUMN(),0)),VLOOKUP(-1,GT32:$JG$132,268-COLUMN(),0),\"-\")","v":"-"},{"$f":"IF(ISNUMBER(VLOOKUP(-1,GU32:$JG$132,268-COLUMN(),0)),VLOOKUP(-1,GU32:$JG$132,268-COLUMN(),0),\"-\")","v":"-"},{"$f":"IF(ISNUMBER(VLOOKUP(-1,GV32:$JG$132,268-COLUMN(),0)),VLOOKUP(-1,GV32:$JG$132,268-COLUMN(),0),\"-\")","v":"-"},{"$f":"IF(ISNUMBER(VLOOKUP(-1,GW32:$JG$132,268-COLUMN(),0)),VLOOKUP(-1,GW32:$JG$132,268-COLUMN(),0),\"-\")","v":"-"},{"$f":"IF(ISNUMBER(VLOOKUP(-1,GX32:$JG$132,268-COLUMN(),0)),VLOOKUP(-1,GX32:$JG$132,268-COLUMN(),0),\"-\")","v":"-"},{"$f":"IF(ISNUMBER(VLOOKUP(-1,GY32:$JG$132,268-COLUMN(),0)),VLOOKUP(-1,GY32:$JG$132,268-COLUMN(),0),\"-\")","v":"-"},{"$f":"IF(ISNUMBER(VLOOKUP(-1,GZ32:$JG$132,268-COLUMN(),0)),VLOOKUP(-1,GZ32:$JG$132,268-COLUMN(),0),\"-\")","v":"-"},{"$f":"IF(ISNUMBER(VLOOKUP(-1,HA32:$JG$132,268-COLUMN(),0)),VLOOKUP(-1,HA32:$JG$132,268-COLUMN(),0),\"-\")","v":"-"},{"$f":"IF(ISNUMBER(VLOOKUP(-1,HB32:$JG$132,268-COLUMN(),0)),VLOOKUP(-1,HB32:$JG$132,268-COLUMN(),0),\"-\")","v":"-"},{"$f":"IF(ISNUMBER(VLOOKUP(-1,HC32:$JG$132,268-COLUMN(),0)),VLOOKUP(-1,HC32:$JG$132,268-COLUMN(),0),\"-\")","v":"-"},{"$f":"IF(ISNUMBER(VLOOKUP(-1,HD32:$JG$132,268-COLUMN(),0)),VLOOKUP(-1,HD32:$JG$132,268-COLUMN(),0),\"-\")","v":"-"},{"$f":"IF(ISNUMBER(VLOOKUP(-1,HE32:$JG$132,268-COLUMN(),0)),VLOOKUP(-1,HE32:$JG$132,268-COLUMN(),0),\"-\")","v":"-"},{"$f":"IF(ISNUMBER(VLOOKUP(-1,HF32:$JG$132,268-COLUMN(),0)),VLOOKUP(-1,HF32:$JG$132,268-COLUMN(),0),\"-\")","v":"-"},{"$f":"IF(ISNUMBER(VLOOKUP(-1,HG32:$JG$132,268-COLUMN(),0)),VLOOKUP(-1,HG32:$JG$132,268-COLUMN(),0),\"-\")","v":"-"},{"$f":"IF(ISNUMBER(VLOOKUP(-1,HH32:$JG$132,268-COLUMN(),0)),VLOOKUP(-1,HH32:$JG$132,268-COLUMN(),0),\"-\")","v":"-"},{"$f":"IF(ISNUMBER(VLOOKUP(-1,HI32:$JG$132,268-COLUMN(),0)),VLOOKUP(-1,HI32:$JG$132,268-COLUMN(),0),\"-\")","v":"-"},{"$f":"IF(ISNUMBER(VLOOKUP(-1,HJ32:$JG$132,268-COLUMN(),0)),VLOOKUP(-1,HJ32:$JG$132,268-COLUMN(),0),\"-\")","v":"-"},{"$f":"IF(ISNUMBER(VLOOKUP(-1,HK32:$JG$132,268-COLUMN(),0)),VLOOKUP(-1,HK32:$JG$132,268-COLUMN(),0),\"-\")","v":"-"},{"$f":"IF(ISNUMBER(VLOOKUP(-1,HL32:$JG$132,268-COLUMN(),0)),VLOOKUP(-1,HL32:$JG$132,268-COLUMN(),0),\"-\")","v":"-"},{"$f":"IF(ISNUMBER(VLOOKUP(-1,HM32:$JG$132,268-COLUMN(),0)),VLOOKUP(-1,HM32:$JG$132,268-COLUMN(),0),\"-\")","v":"-"},{"$f":"IF(ISNUMBER(VLOOKUP(-1,HN32:$JG$132,268-COLUMN(),0)),VLOOKUP(-1,HN32:$JG$132,268-COLUMN(),0),\"-\")","v":"-"},{"$f":"IF(ISNUMBER(VLOOKUP(-1,HO32:$JG$132,268-COLUMN(),0)),VLOOKUP(-1,HO32:$JG$132,268-COLUMN(),0),\"-\")","v":"-"},{"$f":"IF(ISNUMBER(VLOOKUP(-1,HP32:$JG$132,268-COLUMN(),0)),VLOOKUP(-1,HP32:$JG$132,268-COLUMN(),0),\"-\")","v":"-"},{"$f":"IF(ISNUMBER(VLOOKUP(-1,HQ32:$JG$132,268-COLUMN(),0)),VLOOKUP(-1,HQ32:$JG$132,268-COLUMN(),0),\"-\")","v":"-"},{"$f":"IF(ISNUMBER(VLOOKUP(-1,HR32:$JG$132,268-COLUMN(),0)),VLOOKUP(-1,HR32:$JG$132,268-COLUMN(),0),\"-\")","v":"-"},{"$f":"IF(ISNUMBER(VLOOKUP(-1,HS32:$JG$132,268-COLUMN(),0)),VLOOKUP(-1,HS32:$JG$132,268-COLUMN(),0),\"-\")","v":"-"},{"$f":"IF(ISNUMBER(VLOOKUP(-1,HT32:$JG$132,268-COLUMN(),0)),VLOOKUP(-1,HT32:$JG$132,268-COLUMN(),0),\"-\")","v":"-"},{"$f":"IF(ISNUMBER(VLOOKUP(-1,HU32:$JG$132,268-COLUMN(),0)),VLOOKUP(-1,HU32:$JG$132,268-COLUMN(),0),\"-\")","v":"-"},{"$f":"IF(ISNUMBER(VLOOKUP(-1,HV32:$JG$132,268-COLUMN(),0)),VLOOKUP(-1,HV32:$JG$132,268-COLUMN(),0),\"-\")","v":"-"},{"$f":"IF(ISNUMBER(VLOOKUP(-1,HW32:$JG$132,268-COLUMN(),0)),VLOOKUP(-1,HW32:$JG$132,268-COLUMN(),0),\"-\")","v":"-"},{"$f":"IF(ISNUMBER(VLOOKUP(-1,HX32:$JG$132,268-COLUMN(),0)),VLOOKUP(-1,HX32:$JG$132,268-COLUMN(),0),\"-\")","v":"-"},{"$f":"IF(ISNUMBER(VLOOKUP(-1,HY32:$JG$132,268-COLUMN(),0)),VLOOKUP(-1,HY32:$JG$132,268-COLUMN(),0),\"-\")","v":"-"},{"$f":"IF(ISNUMBER(VLOOKUP(-1,HZ32:$JG$132,268-COLUMN(),0)),VLOOKUP(-1,HZ32:$JG$132,268-COLUMN(),0),\"-\")","v":"-"},{"$f":"IF(ISNUMBER(VLOOKUP(-1,IA32:$JG$132,268-COLUMN(),0)),VLOOKUP(-1,IA32:$JG$132,268-COLUMN(),0),\"-\")","v":"-"},{"$f":"IF(ISNUMBER(VLOOKUP(-1,IB32:$JG$132,268-COLUMN(),0)),VLOOKUP(-1,IB32:$JG$132,268-COLUMN(),0),\"-\")","v":"-"},{"$f":"IF(ISNUMBER(VLOOKUP(-1,IC32:$JG$132,268-COLUMN(),0)),VLOOKUP(-1,IC32:$JG$132,268-COLUMN(),0),\"-\")","v":"-"},{"$f":"IF(ISNUMBER(VLOOKUP(-1,ID32:$JG$132,268-COLUMN(),0)),VLOOKUP(-1,ID32:$JG$132,268-COLUMN(),0),\"-\")","v":"-"},{"$f":"IF(ISNUMBER(VLOOKUP(-1,IE32:$JG$132,268-COLUMN(),0)),VLOOKUP(-1,IE32:$JG$132,268-COLUMN(),0),\"-\")","v":"-"},{"$f":"IF(ISNUMBER(VLOOKUP(-1,IF32:$JG$132,268-COLUMN(),0)),VLOOKUP(-1,IF32:$JG$132,268-COLUMN(),0),\"-\")","v":"-"},{"$f":"IF(ISNUMBER(VLOOKUP(-1,IG32:$JG$132,268-COLUMN(),0)),VLOOKUP(-1,IG32:$JG$132,268-COLUMN(),0),\"-\")","v":"-"},{"$f":"IF(ISNUMBER(VLOOKUP(-1,IH32:$JG$132,268-COLUMN(),0)),VLOOKUP(-1,IH32:$JG$132,268-COLUMN(),0),\"-\")","v":"-"},{"$f":"IF(ISNUMBER(VLOOKUP(-1,II32:$JG$132,268-COLUMN(),0)),VLOOKUP(-1,II32:$JG$132,268-COLUMN(),0),\"-\")","v":"-"},{"$f":"IF(ISNUMBER(VLOOKUP(-1,IJ32:$JG$132,268-COLUMN(),0)),VLOOKUP(-1,IJ32:$JG$132,268-COLUMN(),0),\"-\")","v":"-"},{"$f":"IF(ISNUMBER(VLOOKUP(-1,IK32:$JG$132,268-COLUMN(),0)),VLOOKUP(-1,IK32:$JG$132,268-COLUMN(),0),\"-\")","v":"-"},{"$f":"IF(ISNUMBER(VLOOKUP(-1,IL32:$JG$132,268-COLUMN(),0)),VLOOKUP(-1,IL32:$JG$132,268-COLUMN(),0),\"-\")","v":"-"},{"$f":"IF(ISNUMBER(VLOOKUP(-1,IM32:$JG$132,268-COLUMN(),0)),VLOOKUP(-1,IM32:$JG$132,268-COLUMN(),0),\"-\")","v":"-"},{"$f":"IF(ISNUMBER(VLOOKUP(-1,IN32:$JG$132,268-COLUMN(),0)),VLOOKUP(-1,IN32:$JG$132,268-COLUMN(),0),\"-\")","v":"-"},{"$f":"IF(ISNUMBER(VLOOKUP(-1,IO32:$JG$132,268-COLUMN(),0)),VLOOKUP(-1,IO32:$JG$132,268-COLUMN(),0),\"-\")","v":"-"},{"$f":"IF(ISNUMBER(VLOOKUP(-1,IP32:$JG$132,268-COLUMN(),0)),VLOOKUP(-1,IP32:$JG$132,268-COLUMN(),0),\"-\")","v":"-"},{"$f":"IF(ISNUMBER(VLOOKUP(-1,IQ32:$JG$132,268-COLUMN(),0)),VLOOKUP(-1,IQ32:$JG$132,268-COLUMN(),0),\"-\")","v":"-"},{"$f":"IF(ISNUMBER(VLOOKUP(-1,IR32:$JG$132,268-COLUMN(),0)),VLOOKUP(-1,IR32:$JG$132,268-COLUMN(),0),\"-\")","v":"-"},{"$f":"IF(ISNUMBER(VLOOKUP(-1,IS32:$JG$132,268-COLUMN(),0)),VLOOKUP(-1,IS32:$JG$132,268-COLUMN(),0),\"-\")","v":"-"},{"$f":"IF(ISNUMBER(VLOOKUP(-1,IT32:$JG$132,268-COLUMN(),0)),VLOOKUP(-1,IT32:$JG$132,268-COLUMN(),0),\"-\")","v":"-"},{"$f":"IF(ISNUMBER(VLOOKUP(-1,IU32:$JG$132,268-COLUMN(),0)),VLOOKUP(-1,IU32:$JG$132,268-COLUMN(),0),\"-\")","v":"-"},{"$f":"IF(ISNUMBER(VLOOKUP(-1,IV32:$JG$132,268-COLUMN(),0)),VLOOKUP(-1,IV32:$JG$132,268-COLUMN(),0),\"-\")","v":"-"},{"$f":"IF(ISNUMBER(VLOOKUP(-1,IW32:$JG$132,268-COLUMN(),0)),VLOOKUP(-1,IW32:$JG$132,268-COLUMN(),0),\"-\")","v":"-"},{"$f":"IF(ISNUMBER(VLOOKUP(-1,IX32:$JG$132,268-COLUMN(),0)),VLOOKUP(-1,IX32:$JG$132,268-COLUMN(),0),\"-\")","v":"-"},{"$f":"IF(ISNUMBER(VLOOKUP(-1,IY32:$JG$132,268-COLUMN(),0)),VLOOKUP(-1,IY32:$JG$132,268-COLUMN(),0),\"-\")","v":"-"},{"$f":"IF(ISNUMBER(VLOOKUP(-1,IZ32:$JG$132,268-COLUMN(),0)),VLOOKUP(-1,IZ32:$JG$132,268-COLUMN(),0),\"-\")","v":"-"},{"$f":"IF(ISNUMBER(VLOOKUP(-1,JA32:$JG$132,268-COLUMN(),0)),VLOOKUP(-1,JA32:$JG$132,268-COLUMN(),0),\"-\")","v":"-"},{"$f":"IF(ISNUMBER(VLOOKUP(-1,JB32:$JG$132,268-COLUMN(),0)),VLOOKUP(-1,JB32:$JG$132,268-COLUMN(),0),\"-\")","v":"-"},{"$f":"IF(ISNUMBER(VLOOKUP(-1,JC32:$JG$132,268-COLUMN(),0)),VLOOKUP(-1,JC32:$JG$132,268-COLUMN(),0),\"-\")","v":"-"},{"$f":"IF(ISNUMBER(VLOOKUP(-1,JD32:$JG$132,268-COLUMN(),0)),VLOOKUP(-1,JD32:$JG$132,268-COLUMN(),0),\"-\")","v":"-"},{"$f":"IF(ISNUMBER(VLOOKUP(-1,JE32:$JG$132,268-COLUMN(),0)),VLOOKUP(-1,JE32:$JG$132,268-COLUMN(),0),\"-\")","v":"-"},{"$f":"IF(ISNUMBER(VLOOKUP(-1,JF32:$JG$132,268-COLUMN(),0)),VLOOKUP(-1,JF32:$JG$132,268-COLUMN(),0),\"-\")","v":"-"}]
[null,null,{"$f":"IF(ISNUMBER(C136),C133,\"-\")","v":"-"},{"$f":"IF(ISNUMBER(D136),D133,\"-\")","v":"-"},"-","-","-","-","-","-","-","-","-","-","-","-","-","-","-","-","-","-","-","-","-","-","-","-","-","-","-","-","-","-","-","-","-","-","-",1,"-","-","-","-","-","-","-","-","-","-","-","-","-","-","-","-","-","-","-","-","-","-","-","-","-","-","-",{"$f":"IF(ISNUMBER(BP136),BP133,\"-\")","v":"-"},"-","-","-","-",2,"-","-","-","-","-","-","-","-","-","-","-","-","-","-","-","-","-","-","-","-","-","-","-","-","-","-","-","-","-","-","-",3,3,"-","-","-","-","-","-","-","-","-","-","-","-","-","-","-","-","-","-","-","-","-","-","-","-","-",{"$f":"IF(ISNUMBER(EB136),EB133,\"-\")","v":"-"},"-","-","-","-","-","-","-","-","-","-","-","-","-","-","-","-","-","-","-","-","-","-","-","-","-","-","-","-","-","-","-","-","-","-","-","-","-","-","-","-","-","-","-","-","-","-","-","-","-","-","-","-","-","-","-","-","-","-","-","-","-","-","-",{"$f":"IF(ISNUMBER(GN136),GN133,\"-\")","v":"-"},"-","-","-","-","-","-","-","-","-","-","-","-","-","-","-","-","-","-","-","-","-","-","-","-","-","-","-","-","-","-","-","-","-","-","-","-","-","-","-","-","-","-","-","-","-","-","-","-","-","-","-","-","-","-","-","-","-","-","-","-","-","-","-",{"$f":"IF(ISNUMBER(IZ136),IZ133,\"-\")","v":"-"},"-","-","-","-","-","-"]
[null,null,{"$f":"IF(ISNUMBER(C136),C134,\"-\")","v":"-"},{"$f":"IF(ISNUMBER(D136),D134,\"-\")","v":"-"},"-","-","-","-","-","-","-","-","-","-","-","-","-","-","-","-","-","-","-","-","-","-","-","-","-","-","-","-","-","-","-","-","-","-","-",7,"-","-","-","-","-","-","-","-","-","-","-","-","-","-","-","-","-","-","-","-","-","-","-","-","-","-","-",{"$f":"IF(ISNUMBER(BP136),BP134,\"-\")","v":"-"},"-","-","-","-",7,"-","-","-","-","-","-","-","-","-","-","-","-","-","-","-","-","-","-","-","-","-","-","-","-","-","-","-","-","-","-","-",5,7,"-","-","-","-","-","-","-","-","-","-","-","-","-","-","-","-","-","-","-","-","-","-","-","-","-",{"$f":"IF(ISNUMBER(EB136),EB134,\"-\")","v":"-"},"-","-","-","-","-","-","-","-","-","-","-","-","-","-","-","-","-","-","-","-","-","-","-","-","-","-","-","-","-","-","-","-","-","-","-","-","-","-","-","-","-","-","-","-","-","-","-","-","-","-","-","-","-","-","-","-","-","-","-","-","-","-","-",{"$f":"IF(ISNUMBER(GN136),GN134,\"-\")","v":"-"},"-","-","-","-","-","-","-","-","-","-","-","-","-","-","-","-","-","-","-","-","-","-","-","-","-","-","-","-","-","-","-","-","-","-","-","-","-","-","-","-","-","-","-","-","-","-","-","-","-","-","-","-","-","-","-","-","-","-","-","-","-","-","-",{"$f":"IF(ISNUMBER(IZ136),IZ134,\"-\")","v":"-"},"-","-","-","-","-","-"]
[]
[null,null,"EMFD","EPREDIV","ERFD"]
[{"$f":"IF(C141=C140,A140+MATCH(C141,INDEX($C$136:$JF$136,1,A140+1):$JF$136,0),MATCH(C141,$C$136:$JF$136,0))","v":38},null,{"$f":"SMALL(IF(ISNUMBER($C$136:$JF$136),$C$136:$JF$136,\"\"),ROWS($C$141:C141))","v":44},{"$f":"INDEX($C$137:$JS$137,1,A141)","v":1},{"$f":"INDEX($C$138:$JS$138,1,A141)","v":7}]
[{"$f":"IF(C142=C141,A141+MATCH(C142,INDEX($C$136:$JF$136,1,A141+1):$JF$136,0),MATCH(C142,$C$136:$JF$136,0))","v":71},null,{"$f":"SMALL(IF(ISNUMBER($C$136:$JF$136),$C$136:$JF$136,\"\"),ROWS($C$141:C142))","v":74},{"$f":"INDEX($C$137:$JS$137,1,A142)","v":2},{"$f":"INDEX($C$138:$JS$138,1,A142)","v":7}]
[{"$f":"IF(C143=C142,A142+MATCH(C143,INDEX($C$136:$JF$136,1,A142+1):$JF$136,0),MATCH(C143,$C$136:$JF$136,0))","v":103},null,{"$f":"SMALL(IF(ISNUMBER($C$136:$JF$136),$C$136:$JF$136,\"\"),ROWS($C$141:C143))","v":74},3,5]
[{"$f":"IF(C144=C143,A143+MATCH(C144,INDEX($C$136:$JF$136,1,A143+1):$JF$136,0),MATCH(C144,$C$136:$JF$136,0))","v":104},null,{"$f":"SMALL(IF(ISNUMBER($C$136:$JF$136),$C$136:$JF$136,\"\"),ROWS($C$141:C144))","v":104},3,7]
[{"$f":"IF(C145=C144,A144+MATCH(C145,INDEX($C$136:$JF$136,1,A144+1):$JF$136,0),MATCH(C145,$C$136:$JF$136,0))","v":{"$error":"#NUM!"}},null,{"$f":"SMALL(IF(ISNUMBER($C$136:$JF$136),$C$136:$JF$136,\"\"),ROWS($C$141:C145))","v":{"$error":"#NUM!"}},{"$error":"#NUM!"},{"$error":"#NUM!"}]
[{"$f":"IF(C146=C145,A145+MATCH(C146,INDEX($C$136:$JF$136,1,A145+1):$JF$136,0),MATCH(C146,$C$136:$JF$136,0))","v":{"$error":"#NUM!"}},null,{"$f":"SMALL(IF(ISNUMBER($C$136:$JF$136),$C$136:$JF$136,\"\"),ROWS($C$141:C146))","v":{"$error":"#NUM!"}},{"$error":"#NUM!"},{"$error":"#NUM!"}]
[{"$f":"IF(C147=C146,A146+MATCH(C147,INDEX($C$136:$JF$136,1,A146+1):$JF$136,0),MATCH(C147,$C$136:$JF$136,0))","v":{"$error":"#NUM!"}},null,{"$f":"SMALL(IF(ISNUMBER($C$136:$JF$136),$C$136:$JF$136,\"\"),ROWS($C$141:C147))","v":{"$error":"#NUM!"}},{"$error":"#NUM!"},{"$error":"#NUM!"}]
[{"$f":"IF(C148=C147,A147+MATCH(C148,INDEX($C$136:$JF$136,1,A147+1):$JF$136,0),MATCH(C148,$C$136:$JF$136,0))","v":{"$error":"#NUM!"}},null,{"$f":"SMALL(IF(ISNUMBER($C$136:$JF$136),$C$136:$JF$136,\"\"),ROWS($C$141:C148))","v":{"$error":"#NUM!"}},{"$error":"#NUM!"},{"$error":"#NUM!"}]
[{"$f":"IF(C149=C148,A148+MATCH(C149,INDEX($C$136:$JF$136,1,A148+1):$JF$136,0),MATCH(C149,$C$136:$JF$136,0))","v":{"$error":"#NUM!"}},null,{"$f":"SMALL(IF(ISNUMBER($C$136:$JF$136),$C$136:$JF$136,\"\"),ROWS($C$141:C149))","v":{"$error":"#NUM!"}},{"$error":"#NUM!"},{"$error":"#NUM!"}]
[{"$f":"IF(C150=C149,A149+MATCH(C150,INDEX($C$136:$JF$136,1,A149+1):$JF$136,0),MATCH(C150,$C$136:$JF$136,0))","v":{"$error":"#NUM!"}},null,{"$f":"SMALL(IF(ISNUMBER($C$136:$JF$136),$C$136:$JF$136,\"\"),ROWS($C$141:C150))","v":{"$error":"#NUM!"}},{"$error":"#NUM!"},{"$error":"#NUM!"}]
[{"$f":"IF(C151=C150,A150+MATCH(C151,INDEX($C$136:$JF$136,1,A150+1):$JF$136,0),MATCH(C151,$C$136:$JF$136,0))","v":{"$error":"#NUM!"}},null,{"$f":"SMALL(IF(ISNUMBER($C$136:$JF$136),$C$136:$JF$136,\"\"),ROWS($C$141:C151))","v":{"$error":"#NUM!"}},{"$error":"#NUM!"},{"$error":"#NUM!"}]
[{"$f":"IF(C152=C151,A151+MATCH(C152,INDEX($C$136:$JF$136,1,A151+1):$JF$136,0),MATCH(C152,$C$136:$JF$136,0))","v":{"$error":"#NUM!"}},null,{"$f":"SMALL(IF(ISNUMBER($C$136:$JF$136),$C$136:$JF$136,\"\"),ROWS($C$141:C152))","v":{"$error":"#NUM!"}},{"$error":"#NUM!"},{"$error":"#NUM!"}]
[]
[]
[]
[]
[]
[]
[]
[]
[null,"selected variant",null,{"$f":"PLL!C10","v":1}]
[]
[null,"EMFD","EPREDIV","ERFD","fsys","ESYNCR1","ESYNCR2"]
[null,{"$f":"INDEX(B7:B18,$D$161,1)","v":44},{"$f":"INDEX(C7:C18,$D$161,1)","v":1},{"$f":"INDEX(D7:D18,$D$161,1)","v":7},{"$f":"$C$2/(C164+1)*(B164+16)/(D164+1)","v":60},{"$f":"\"0x\"&DEC2HEX(7*2^28+C164*2^16+B164,8)","v":"0x7001002C"},{"$f":"\"0x\"&DEC2HEX(D164,8)","v":"0x00000007"}]
[null,{"$f":"B164","v":44},{"$f":"C164","v":1},{"$f":"IF(D164=1,D164+1,D164+2)","v":9},{"$f":"$C$2/(C165+1)*(B165+16)/(D165+1)","v":48},null,{"$f":"\"0x\"&DEC2HEX(D165,8)","v":"0x00000009"}]
[]
[]
[null,{"$f":"\"/* Set sysclk = \"&C3&\"MHz running from PLL with \"&C2&\" MHz crystal reference. */\"","v":"/* Set sysclk = 60MHz running from PLL with 16 MHz crystal reference. */"},null,null,null,null,null,null,null,{"$f":"\"/* Set sysclk = \"&C3&\"MHz running from PLL with \"&C2&\" MHz crystal reference. */\"","v":"/* Set sysclk = 60MHz running from PLL with 16 MHz crystal reference. */"},null,null,null,null,null,null,null,{"$f":"\"/* Set sysclk = \"&$C$3&\"MHz running from PLL with \"&$C$2&\" MHz crystal reference. */\"","v":"/* Set sysclk = 60MHz running from PLL with 16 MHz crystal reference. */"}]
[null,{"$f":"\"void initSysclk (void) {\"","v":"void initSysclk (void) {"},null,null,null,null,null,null,null,{"$f":"\"void initSysclk (void) {\"","v":"void initSysclk (void) {"},null,null,null,null,null,null,null,{"$f":"\"void initSysclk (void) {\"","v":"void initSysclk (void) {"}]
[null,{"$f":"\"FMPLL.ESYNCR2.R = \"&G165&\";\"","v":"FMPLL.ESYNCR2.R = 0x00000009;"},null,null,null,null,null,null,null,{"$f":"\"FMPLL.ESYNCR2.R = \"&$G$165&\";\"","v":"FMPLL.ESYNCR2.R = 0x00000009;"},null,null,null,null,null,null,null,{"$f":"\"FMPLL.ESYNCR2.R = \"&$G$165&\";\"","v":"FMPLL.ESYNCR2.R = 0x00000009;"}]
[null,{"$f":"\"FMPLL.ESYNCR1.R = \"&F164&\";\"","v":"FMPLL.ESYNCR1.R = 0x7001002C;"},null,null,null,null,null,null,null,{"$f":"\"FMPLL.ESYNCR1.R = \"&$F$164&\";\"","v":"FMPLL.ESYNCR1.R = 0x7001002C;"},null,null,null,null,null,null,null,{"$f":"\"FMPLL.ESYNCR1.R = \"&$F$164&\";\"","v":"FMPLL.ESYNCR1.R = 0x7001002C;"}]
[null,{"$f":"\"while (FMPLL.SYNSR.B.LOCK != 1) {};\"&CHAR(9)&\"/* Wait for FMPLL to LOCK  */\"","v":"while (FMPLL.SYNSR.B.LOCK != 1) {};\t/* Wait for FMPLL to LOCK  */"},null,null,null,null,null,null,null,{"$f":"\"while (FMPLL.SYNSR.B.LOCK != 1) {};\"&CHAR(9)&\"/* Wait for FMPLL to LOCK  */\"","v":"while (FMPLL.SYNSR.B.LOCK != 1) {};\t/* Wait for FMPLL to LOCK  */"},null,null,null,null,null,null,null,{"$f":"\"while (FMPLL.SYNSR.B.LOCK != 1) {};\"&CHAR(9)&\"/* Wait for FMPLL to LOCK  */\"","v":"while (FMPLL.SYNSR.B.LOCK != 1) {};\t/* Wait for FMPLL to LOCK  */"}]
[null,{"$f":"\"FMPLL.ESYNCR2.R = \"&G164&\";\"&CHAR(9)&CHAR(9)&\"/* Fsys =\"&E164&\"Mhz */\"","v":"FMPLL.ESYNCR2.R = 0x00000007;\t\t/* Fsys =60Mhz */"},null,null,null,null,null,null,null,{"$f":"\"FMPLL.ESYNCR2.R = \"&$G$164&\";\"&CHAR(9)&CHAR(9)&\"/* Fsys =\"&$E$164&\"Mhz */\"","v":"FMPLL.ESYNCR2.R = 0x00000007;\t\t/* Fsys =60Mhz */"},null,null,null,null,null,null,null,{"$f":"\"FMPLL.ESYNCR2.R = \"&$G$164&\";\"&CHAR(9)&CHAR(9)&\"/* Fsys =\"&$E$164&\"Mhz */\"","v":"FMPLL.ESYNCR2.R = 0x00000007;\t\t/* Fsys =60Mhz */"}]
[null,{"$f":"\"}\"","v":"}"},null,null,null,null,null,null,null,{"$f":"\"SIU.SYSDIV.R = 0x00002010;\"&CHAR(9)&CHAR(9)&\"/* select PLL for sys clock, bypass clock divider */\"","v":"SIU.SYSDIV.R = 0x00002010;\t\t/* select PLL for sys clock, bypass clock divider */"},null,null,null,null,null,null,null,{"$f":"\"SIU.SYSCLK.B.SYSCLKSEL = 0x2;\"&CHAR(9)&CHAR(9)&\"/* select PLL for sys clock */\"","v":"SIU.SYSCLK.B.SYSCLKSEL = 0x2;\t\t/* select PLL for sys clock */"}]
[null,{"$f":"\"\"","v":""},null,null,null,null,null,null,null,{"$f":"\"}\"","v":"}"},null,null,null,null,null,null,null,{"$f":"\"}\"","v":"}"}]
[null,{"$f":"\"\"","v":""},null,null,null,null,null,null,null,{"$f":"\"\"","v":""},null,null,null,null,null,null,null,{"$f":"\"\"","v":""}]
[null,{"$f":"\"\"","v":""},null,null,null,null,null,null,null,{"$f":"\"\"","v":""},null,null,null,null,null,null,null,{"$f":"\"\"","v":""}]
[null,{"$f":"\"\"","v":""},null,null,null,null,null,null,null,{"$f":"\"\"","v":""},null,null,null,null,null,null,null,{"$f":"\"\"","v":""}]
[null,{"$f":"\"\"","v":""},null,null,null,null,null,null,null,{"$f":"\"\"","v":""},null,null,null,null,null,null,null,{"$f":"\"\"","v":""}]
[null,{"$f":"\"\"","v":""},null,null,null,null,null,null,null,{"$f":"\"\"","v":""},null,null,null,null,null,null,null,{"$f":"\"\"","v":""}]
[null,{"$f":"\"\"","v":""},null,null,null,null,null,null,null,{"$f":"\"\"","v":""},null,null,null,null,null,null,null,{"$f":"\"\"","v":""}]
[null,{"$f":"\"\"","v":""},null,null,null,null,null,null,null,{"$f":"\"\"","v":""},null,null,null,null,null,null,null,{"$f":"\"\"","v":""}]
[null,{"$f":"\"\"","v":""},null,null,null,null,null,null,null,{"$f":"\"\"","v":""},null,null,null,null,null,null,null,{"$f":"\"\"","v":""}]
[null,{"$f":"\"\"","v":""},null,null,null,null,null,null,null,{"$f":"\"\"","v":""},null,null,null,null,null,null,null,{"$f":"\"\"","v":""}]
[null,{"$f":"\"\"","v":""},null,null,null,null,null,null,null,{"$f":"\"\"","v":""},null,null,null,null,null,null,null,{"$f":"\"\"","v":""}]
[null,{"$f":"\"\"","v":""},null,null,null,null,null,null,null,{"$f":"\"\"","v":""},null,null,null,null,null,null,null,{"$f":"\"\"","v":""}]
[null,{"$f":"\"\"","v":""},null,null,null,null,null,null,null,{"$f":"\"\"","v":""},null,null,null,null,null,null,null,{"$f":"\"\"","v":""}]
[null,{"$f":"\"\"","v":""},null,null,null,null,null,null,null,{"$f":"\"\"","v":""},null,null,null,null,null,null,null,{"$f":"\"\"","v":""}]