{"text_format":"1","workbook":"xlsx","n_sheets":5,"sheets":["Release_Notes","Clocks","PLLconfig","Sheet2","Sheet3"],"not_rendered":{"charts":0,"images":2,"macros":1,"external_links":0,"defined_names":89,"comments":0,"pivot_tables":0},"unopened":[],"bounds":{"document_bytes":16777216,"sheet_cells":100000,"rows_first":2000,"rows_last":500,"rows_between":2000,"halvings":0,"cell_chars":16384,"cell_head_chars":4096},"cells_cut":0,"cells_raw":0,"read":"whole","date_system":"1900"}

{"sheet":"Release_Notes","index":0,"n_rows":59,"n_cols":9,"rows_kept":59,"cut":false,"hidden":false,"merged":[[35,5,35,6],[35,8,35,9],[40,2,40,3]]}
["*******************************************************************************"]
["NXP Semiconductor Inc."]
["(c) Copyright 2012 NXP Semiconductor, Inc."]
["ALL RIGHTS RESERVED."]
["********************************************************************************"]
["Services performed by NXP in this matter are performed AS IS and without"]
["any warranty. CUSTOMER retains the final decision relative to the total design"]
["and functionality of the end product. NXP neither guarantees nor will be"]
["held liable by CUSTOMER for the success of this project."]
["NXP DISCLAIMS ALL WARRANTIES, EXPRESSED, IMPLIED OR STATUTORY INCLUDING,"]
["BUT NOT LIMITED TO, IMPLIED WARRANTY OF MERCHANTABILITY OR FITNESS FOR"]
["A PARTICULAR PURPOSE ON ANY HARDWARE, SOFTWARE ORE ADVISE SUPPLIED "]
["TO THE PROJECT BY NXP, AND OR NAY PRODUCT RESULTING FROM NXP "]
["SERVICES. IN NO EVENT SHALL NXP BE LIABLE FOR INCIDENTAL OR CONSEQUENTIAL "]
["DAMAGES ARISING OUT OF THIS AGREEMENT."]
["CUSTOMER agrees to hold NXP harmless against any and all claims demands "]
["or actions by anyone on account of any damage, or injury, whether commercial,"]
["contractual, or tortuous, rising directly or indirectly as a result "]
["of the advise or assistance supplied CUSTOMER in connection with product, "]
["services or goods supplied under this Agreement."]
{"$rows_left_out":40}
{"sheet":"Clocks","index":1,"n_rows":57,"n_cols":59,"rows_kept":57,"cut":false,"hidden":false,"merged":[[39,36,40,37],[36,36,37,37],[33,36,34,37],[30,36,31,37],[27,36,28,37],[27,33,30,33],[80,21,83,23],[80,24,83,24],[58,20,59,22],[47,24,47,25],[46,23,46,26],[36,20,36,22],[36,23,36,25],[82,41,82,44],[75,26,78,29],[75,30,78,30],[77,41,77,44],[10,25,22,25],[10,27,22,28],[91,41,91,44],[47,41,47,44],[66,41,66,44],[7,34,10,34],[85,41,85,44],[88,41,88,44],[19,36,20,37],[68,37,68,40],[74,41,74,44],[48,37,48,40],[50,33,53,33],[44,33,47,33],[7,36,8,37],[10,36,11,37],[21,36,22,37],[44,36,45,39],[58,23,59,25],[15,30,16,31],[121,41,121,44],[94,41,94,44],[97,41,97,44],[100,41,100,44],[103,41,103,44],[106,41,106,44],[118,41,118,44],[109,41,109,44],[112,41,112,44],[115,41,115,44],[32,14,34,16],[60,3,61,7],[62,3,62,7],[58,3,59,7],[14,14,14,20],[21,14,21,20],[12,3,14,5],[10,9,13,11],[10,12,13,12],[12,16,12,18],[10,16,10,18],[17,16,17,18],[15,15,15,19],[23,3,25,5],[17,9,20,11],[17,12,20,12],[19,16,19,18],[22,15,22,19],[42,5,42,6],[42,8,42,9],[47,3,47,4],[52,18,52,19],[51,17,51,20],[58,17,59,19],[58,14,59,16],[58,11,59,13],[58,8,59,10],[62,17,62,19],[62,20,62,22],[62,23,62,25],[60,8,60,10],[61,8,61,10],[62,8,62,10],[60,11,60,13],[60,14,60,16],[60,17,60,19],[60,20,60,22],[60,23,60,25],[61,11,61,13],[61,14,61,16],[61,17,61,19],[61,20,61,22],[61,23,61,25],[62,11,62,13],[62,14,62,16],[32,11,34,13],[32,8,34,10],[32,3,34,7],[37,20,37,22],[37,23,37,25],[32,23,34,25],[32,20,34,22],[32,17,34,19],[37,3,37,7],[37,8,37,10],[37,11,37,13],[37,14,37,16],[37,17,37,19],[35,3,36,7],[35,8,35,10],[35,11,35,13],[35,14,35,16],[35,17,35,19],[35,20,35,22],[35,23,35,25],[36,8,36,10],[36,11,36,13],[36,14,36,16],[36,17,36,19]]}
[]
[null,"! Macros has to be enabled !",null,null,null,null,null,null,null,null,null,null,null,null,null,null,null,null,null,"MPC5777C Clock configurator"]
[]
[null,"! Choose operating frequency of used device ! "]
[null,null,"(according datasheet, section 5)"]
[]
[null,null,null,null,null,null,null,null,null,null,null,null,null,null,null,null,null,null,null,null,null,null,null,null,null,null,null,null,null,null,null,null,null,null,null,null,null,null,null,null,null,null,null,null,null,null,null,null,null,null,null,null,null,null,null,null,null,null,{"$f":"code","v":" // Enable PLL0, PLL1 and select PLL1 as sys clk (300 MHz) "}]
[null,null,null,null,null,null,null,null,null,null,null,null,null,null,null,null,null,null,null,null,null,null,null,null,null,null,null,null,null,null,null,null,null,null,"ECSS",null,{"$f":"Sheet2!E22","v":"ENGDIV"},null,null,null,null,null,null,null,null,null,null,null,null,null,null,null,null,null,null,null,null,null,"void SysClk_Init(void)"]
[null,null,null,null,null,null,null,null,null,null,null,null,null,null,null,null,null,null,null,null,null,null,null,null,null,null,null,null,null,null,null,null,null,null,null,null,null,null,null,null,null,{"$f":"Sheet2!G22&\" MHz\"","v":"4.69 MHz"},null,null,null,null,{"$f":"Sheet2!J22","v":"ENG_CLK"},null,null,null,null,null,null,null,null,null,null,null,"{"]
[null,null,null,null,null,null,null,null,null,null,null,null,null,null,null,null,null,null,null,null,null,null,null,null,null,null,null,null,null,null,null,null,null,null,null,null,null,null,null,null,null,{"$f":"\"max \"&Sheet2!F22&\" MHz\"","v":"max 80 MHz"},null,null,null,null,null,null,null,null,null,null,null,null,null,null,null,null,"      SIU.SYSDIV.B.SYSCLKSEL = 0;\t\t    //run system clock from IRC"]
[null,null,null,null,null,null,null,null,null,null,null,null,"PLL1 Sel",null,null,null,"PLL1",null,null,null,null,null,null,null,null,"System Clock Selector",null,"PCS",null,null,null,null,null,null,null,null,{"$f":"Sheet2!E9","v":"EBDF"},null,null,null,null,null,null,null,null,null,null,null,null,null,null,null,null,null,null,null,null,null,"      PLLDIG.PLL0CR.B.CLKCFG = 0;\t\t    //disable PLL0"]
[null,null,null,null,null,null,null,null,null,null,null,null,null,null,null,null,null,null,null,null,"PHI",null,null,null,null,null,null,null,null,null,null,null,null,null,null,null,null,null,null,null,null,{"$f":"Sheet2!G9&\" MHz\"","v":"50 MHz"},null,null,null,null,{"$f":"Sheet2!J9","v":"CLKOUT"},null,null,null,null,null,null,null,null,null,null,null,"      PLLDIG.PLL1CR.B.CLKCFG = 0;\t\t    //disable PLL1"]
[null,null,null,"Oscillator \nXOSC",null,null,null,null,null,null,null,null,null,null,null,null,300,null,null,null,null,null,null,null,null,null,null,null,null,null,null,null,null,null,null,null,null,null,null,null,null,{"$f":"\"max \"&Sheet2!F9&\" MHz\"","v":"max 66 MHz"},null,null,null,null,null,null,null,null,null,null,null,null,null,null,null,null,"      SIU.SYSDIV.B.PLL0SEL = 0x00;\t\t    //connect XOSC to the PLL0 input"]
[null,40,null,null,null,null,null,null,null,null,null,null,null,null,null,null,null,null,null,null,null,null,null,null,null,null,null,null,null,null,null,null,null,null,null,null,null,null,null,null,null,null,null,null,null,null,null,null,null,null,null,null,null,null,null,null,null,null,"      SIU.SYSDIV.B.PLL1SEL = 0x01;\t\t    //connect PLL0-PHI1 to the PLL1 input"]
[null,null,null,null,null,null,null,null,null,null,null,null,null,null,{"$f":"IF(pll1closest<>0,\"closest \"&pll1closest&\" MHz\",IF(Sheet3!M9=1,\"check PLL1 input (38-78Mhz)\",\"no valid PLL0 setting\"))","v":"closest 300 MHz"},null,null,null,null,null,null,null,null,null,null,null,null,null,null,null,null,null,null,null,null,null,null,null,null,null,null,null,null,null,null,null,null,null,null,null,null,null,null,null,null,null,null,null,""]
[null,{"$f":"\"check XOSC (8-40Mhz)\"","v":"check XOSC (8-40Mhz)"},null,null,null,null,null,null,null,null,null,null,null,null,null,{"$f":"\"           \"&pll1closestInt&\" MHz\"","v":"           300 MHz"},null,null,null,null,null,null,null,null,null,null,null,null,null,null,{"$f":"Sheet2!E6","v":"SYSCLKDIV"},null,null,null,null,null,null,null,null,null,null,null,null,null,null,null,null,null,null,null,null,null,null,null,null,null,null,null,"      // Set PLL0 to 240 MHz with 40MHz XOSC reference"]
[null,null,null,null,null,null,null,null,null,null,null,null,null,null,null,null,null,null,null,null,null,null,null,null,null,null,null,null,null,null,null,null,null,null,null,null,null,null,null,null,null,{"$f":"ROUND(coreclkval,2)&\" MHz\"","v":"300 MHz"},null,null,null,null,"CORE_CLK",null,null,null,null,null,null,null,null,null,null,null,"      PLLDIG.PLL0DV.R = 0x4002100C;\t     // PREDIV =  1, MFD = 12, RFDPHI = 2, RFDPHI1 = 8"]
[null,null,null,null,null,null,null,null,null,null,null,null,"PLL0 Sel",null,null,null,"PLL0",null,null,null,"PHI1",null,null,null,null,null,null,null,null,null,null,null,null,null,null,null,null,null,null,null,null,{"$f":"\"max \"&coreclkmax&\" MHz\"","v":"max 300 MHz"},null,null,null,null,null,null,null,null,null,null,null,null,null,null,null,null,""]
[null,null,null,null,null,null,null,null,null,null,null,null,null,null,null,null,null,null,null,null,null,null,null,null,null,null,null,null,null,null,null,null,null,null,null,null,null,null,null,null,null,null,null,null,null,null,null,null,null,null,null,null,null,null,null,null,null,null,"      while(SIU.RSR.B.XOSC==0){};\t\t    //wait for stable XOSC"]
[null,null,null,null,null,null,null,null,null,null,null,null,null,null,null,null,240,null,null,null,"PHI",null,null,null,null,null,null,null,null,null,null,null,null,null,null,null,"/ 2",null,null,null,null,{"$f":"ROUND(sc_ssVal/2,2)&\" MHz\"","v":"150 MHz"},null,null,null,null,"PLAT_CLK",null,null,null,null,null,null,null,null,null,null,null,"      PLLDIG.PLL0CR.B.CLKCFG = 3;\t\t    //turn on PLL0"]
{"$rows_left_out":38}
{"sheet":"PLLconfig","index":2,"n_rows":47,"n_cols":25,"rows_kept":47,"cut":false,"hidden":false,"merged":[[21,1,21,4],[21,14,21,17]]}
[]
[]
[]
[]
[]
[]
[]
[]
[]
[null,null,null,null,null,null,null,null,null,null,null,null,null,null,null,null,null,null,null,null,null,null,null,null,"Fractional divider not used"]
[null,null,null,null,null,null,null,null,null,null,null,null,null,null,null,null,null,null,null,null,null,null,null,null,"in this version"]
[]
[]
[]
[]
[]
[null,null,null,null,null,null,null,null,null,null,null,null,null,null,null,null,null,null,null,null,null,null,null,null,"Fractional divider not used"]
[null,null,null,null,null,null,null,null,null,null,null,null,null,null,null,null,null,null,null,null,null,null,null,null,"in this version"]
[]
[null,"Select possible PLL0 configurations",null,null,null,null,null,null,null,null,null,null,null,null,"Select possible PLL1 configurations"]
{"$rows_left_out":28}
{"sheet":"Sheet2","index":3,"n_rows":1035,"n_cols":20,"rows_kept":1035,"cut":false,"hidden":true,"merged":[]}
[]
[null,null,null,"Control","Name","Max","Value","Selected","list",null,null,null,null,null,null,"reset","max 264","max 300"]
[null,null,null,4,"SYSCLKSEL",600,null,{"$f":"INDEX(I3:L3,1,$D$3)","v":"PLL1"},"IRC","XOSC","PLL0","PLL1",null,null,null,1,4,4,null,{"$f":"\" // Enable PLL0, PLL1 and select \"&$H$3&\" as sys clk (\"&$H$5&\" MHz) \"","v":" // Enable PLL0, PLL1 and select PLL1 as sys clk (300 MHz) "}]
[null,null,null,240,null,null,null,{"$f":"INDEX(I4:L4,1,$D$3)","v":2},0,1,3,2,null,null,null,160,192,240,null,{"$f":"\"void SysClk_Init(void)\"","v":"void SysClk_Init(void)"}]
[null,null,null,300,null,200,null,300,16,{"$f":"osc","v":40},{"$f":"pll_0","v":240},{"$f":"pll_1","v":300},null,null,null,200,264,300,null,{"$f":"\"{\"","v":"{"}]
["disabled",0,null,5,"SYSCLKDIV",{"$f":"$F$89","v":300},{"$f":"ROUNDUP($H$5/(H6),2)","v":300},{"$f":"INDEX(listsysval1,D6)","v":1},null,"CORE_CLK",null,null,null,null,null,5,5,5,null,{"$f":"\"      SIU.SYSDIV.B.SYSCLKSEL = 0;\"&CHAR(9)&CHAR(9)&\"    //run system clock from IRC\"","v":"      SIU.SYSDIV.B.SYSCLKSEL = 0;\t\t    //run system clock from IRC"}]
[{"$f":"\"div by \"&B7","v":"div by 1"},1,null,null,null,{"$f":"$H$89","v":150},{"$f":"coreclkval/2","v":150},null,null,"PLAT_CLK",null,null,null,null,null,null,null,null,null,{"$f":"\"      PLLDIG.PLL0CR.B.CLKCFG = 0;\"&CHAR(9)&CHAR(9)&\"    //disable PLL0\"","v":"      PLLDIG.PLL0CR.B.CLKCFG = 0;\t\t    //disable PLL0"}]
[{"$f":"\"div by \"&B8","v":"div by 2"},2,null,1,"FMPERDIV",{"$f":"$I$89","v":150},{"$f":"ROUNDUP($H$5/(H8),2)","v":150},{"$f":"POWER(2,INDEX(listpow2val,$D$8)+1)","v":2},null,"FM_PER_CLK",null,null,null,null,null,1,1,1,null,{"$f":"\"      PLLDIG.PLL1CR.B.CLKCFG = 0;\"&CHAR(9)&CHAR(9)&\"    //disable PLL1\"","v":"      PLLDIG.PLL1CR.B.CLKCFG = 0;\t\t    //disable PLL1"}]
["div by 3",3,null,3,"EBDF",66,{"$f":"ROUNDUP($H$5/2/(H9),2)","v":50},{"$f":"INDEX(list4enval,D9)","v":3},null,"CLKOUT",null,null,null,null,null,2,2,3,null,{"$f":"\"      SIU.SYSDIV.B.PLL0SEL = 0x\"&DEC2HEX($H$65,2)&\";\"&CHAR(9)&CHAR(9)&\"    //connect \"&$H$64&\" to the PLL0 input\"","v":"      SIU.SYSDIV.B.PLL0SEL = 0x00;\t\t    //connect XOSC to the PLL0 input"}]
["div by 4",4,null,null,null,null,null,null,null,null,null,null,null,null,null,null,null,null,null,{"$f":"\"      SIU.SYSDIV.B.PLL1SEL = 0x\"&DEC2HEX($H$68,2)&\";\"&CHAR(9)&CHAR(9)&\"    //connect \"&$H$67&\" to the PLL1 input\"","v":"      SIU.SYSDIV.B.PLL1SEL = 0x01;\t\t    //connect PLL0-PHI1 to the PLL1 input"}]
["div by 5",5,null,2,"PERCLKSEL",null,null,{"$f":"INDEX(I11:K11,1,$D$11)","v":"PLL0"},"CORE_CLK","PLL0",null,null,null,null,null,1,2,2,null,{"$f":"\"\"","v":""}]
["div by 6",6,null,null,null,null,null,{"$f":"INDEX(I12:K12,1,$D$11)","v":1},0,1,null,null,null,null,null,null,null,null,null,{"$f":"\"      // Set PLL0 to \"&INDEX(PLLconfig!J25:J47,PLLconfig!$F$22,1)&\" MHz with \"&INDEX(PLLconfig!H25:H47,PLLconfig!$F$22,1)&\"MHz \"&H64&\" reference\"","v":"      // Set PLL0 to 240 MHz with 40MHz XOSC reference"}]
["div by 7",7,null,null,null,null,null,240,{"$f":"coreclkval","v":300},{"$f":"pll_0","v":240},null,null,null,null,null,null,null,null,null,{"$f":"\"      PLLDIG.PLL0DV.R = \"&INDEX(PLLconfig!L25:L47,PLLconfig!$F$22,1)&\";\"&CHAR(9)&\"     // PREDIV =  \"&INDEX(PLLconfig!D25:D47,PLLconfig!$F$22,1)&\", MFD = \"&INDEX(PLLconfig!C25:C47,PLLconfig!$F$22,1)&\", RFDPHI = \"&INDEX(PLLconfig!E25:E47,PLLconfig!$F$22,1)&\", RFDPHI1 = \"&INDEX(PLLconfig!F25:F47,PLLconfig!$F$22,1)","v":"      PLLDIG.PLL0DV.R = 0x4002100C;\t     // PREDIV =  1, MFD = 12, RFDPHI = 2, RFDPHI1 = 8"}]
["div by 8",8,null,1,"ETPUDIV",{"$f":"$G$89","v":240},{"$f":"ROUNDUP($H$13/(H14),2)","v":240},{"$f":"INDEX(list2enval,D14)","v":1},null,"ETPU_CLK",null,null,null,null,null,1,1,1,null,{"$f":"\"\"","v":""}]
["div by 9",9,null,1,"PERDIV",{"$f":"$J$89","v":120},{"$f":"ROUNDUP($H$13/(H15),2)","v":120},{"$f":"POWER(2,INDEX(listpow2val,$D$15)+1)","v":2},null,"PER_CLK",null,null,null,null,null,1,1,1,null,{"$f":"\"      while(SIU.RSR.B.XOSC==0){};\"&CHAR(9)&CHAR(9)&\"    //wait for stable XOSC\"","v":"      while(SIU.RSR.B.XOSC==0){};\t\t    //wait for stable XOSC"}]
["div by 10",10,null,15,"SDDIV",16,16,{"$f":"INDEX(list128enval,D16)","v":15},null,"SD_CLK",null,null,null,null,null,1,12,15,null,{"$f":"\"      PLLDIG.PLL0CR.B.CLKCFG = 3;\"&CHAR(9)&CHAR(9)&\"    //turn on PLL0\"","v":"      PLLDIG.PLL0CR.B.CLKCFG = 3;\t\t    //turn on PLL0"}]
["div by 11",11,null,3,"PSDIV",100,80,{"$f":"INDEX(list256enval,D17)","v":3},null,"PSI5_RX_CLK",null,null,null,null,null,1,2,3,null,{"$f":"\"      while(PLLDIG.PLL0SR.B.LOCK==0){};\"&CHAR(9)&CHAR(9)&\"    //wait for PLL0 lock\"","v":"      while(PLLDIG.PLL0SR.B.LOCK==0){};\t\t    //wait for PLL0 lock"}]
["div by 12",12,null,240,"PSDIV1M",1,1,{"$f":"INDEX(list1024enval,D18)","v":240},null,"PSI5_1US_CLK",null,null,null,null,null,1,192,240,null,{"$f":"\"\"","v":""}]
["div by 13",13,null,2,"ECSS",null,null,{"$f":"INDEX(I19:L19,1,$D$19)","v":"PLAT_CLK"},"XOSC","PLAT_CLK",null,null,null,null,null,2,2,2,null,{"$f":"\"      // Set PLL1 to \"&INDEX(PLLconfig!W25:W47,IF(Sheet3!M9=2,PLLconfig!$F$22,PLLconfig!$S$22),1)&\" MHz with \"&INDEX(PLLconfig!U25:U47,IF(Sheet3!M9=2,PLLconfig!$F$22,PLLconfig!$S$22),1)&\"MHz \"&H67&\" reference\"","v":"      // Set PLL1 to 300 MHz with 60MHz PLL0-PHI1 reference"}]
["div by 14",14,null,null,null,null,null,{"$f":"INDEX(I20:L20,1,$D$19)","v":0},1,0,null,null,null,null,null,null,null,null,null,{"$f":"\"      PLLDIG.PLL1DV.R = \"&INDEX(PLLconfig!Y25:Y47,IF(Sheet3!M9=2,PLLconfig!$F$22,PLLconfig!$S$22),1)&\";\"&CHAR(9)&\"     // MFD = \"&INDEX(PLLconfig!P25:P47,PLLconfig!$S$22,1)&\", RFDPHI = \"&INDEX(PLLconfig!R25:R47,PLLconfig!$S$22,1)","v":"      PLLDIG.PLL1DV.R = 0x00020014;\t     // MFD = 20, RFDPHI = 2"}]
{"$rows_left_out":1016}
{"sheet":"Sheet3","index":4,"n_rows":102,"n_cols":31,"rows_kept":102,"cut":false,"hidden":true,"merged":[[11,16,11,17],[1,14,1,15],[1,16,1,17],[1,12,1,13],[1,4,1,5],[1,6,1,7],[1,8,1,9],[1,10,1,11]]}
[]
[null,null,"fmax",null,"f_osc/xtal",null,"f_pll_in",null,"f_VCO/ICO",null,"PLL0_PHI0",null,"PLL0_PHI1",null,"f_pll1_in",null,"PLL1_PHI0"]
[null,null,null,null,"min","max","min","max","min","max","min","max","min","max","min","max","min","max"]
[null,null,200,null,8,40,8,44,600,1250,4.7619999999999996,{"$f":"etpuMax","v":240},20,156,38,78,4.7619999999999996,{"$f":"coreclkmax","v":300}]
[]
[null,null,null,null,null,null,null,null,null,null,null,"closest"]
[]
[null,null,null,null,null,null,null,null,null,null,null,"aux sel 3",{"$f":"Sheet2!D64","v":2}]
[null,null,null,null,null,null,null,null,null,null,null,"aux sel 4",{"$f":"Sheet2!D67","v":2}]
[null,"Fin",{"$f":"IF(M8=1,16,osc)","v":40},null,"closest",240]
[null,"Fsys",{"$f":"pll_0","v":240},null,"closest int",240]
[]
[null,"MFD","PREDIV","RFDPHI","RFDPHI1",null,{"$f":"\"\"","v":""},"MFD","PREDIV","RFDPHI","RFDPHI1",{"$f":"\"\"","v":""},"fPLLin","fVCO","fphi",null,"PLL0DV",{"$f":"\"\"","v":""},null,{"$f":"\"\"","v":""},"MFD","PREDIV","RFDPHI","RFDPHI1",{"$f":"\"\"","v":""},"fPLLin","fVCO","fphi",null,"PLL0DV",{"$f":"\"\"","v":""}]
[1,12,1,2,{"$f":"ROUNDUP(N14/$N$4,0)","v":7},null,{"$f":"IF(ISNUMBER(H14),1,\"\")","v":1},{"$f":"IF(ISNUMBER(B14),B14,\"\")","v":12},{"$f":"IF(ISNUMBER(C14),C14,\"\")","v":1},{"$f":"IF(ISNUMBER(D14),D14,\"\")","v":2},{"$f":"IF(ISNUMBER(E14),E14,\"\")","v":7},null,{"$f":"IF(ISNUMBER(H14),$C$10,\"\")","v":40},{"$f":"IF(ISNUMBER(H14),$C$10/(I14)*H14*2,\"\")","v":960},{"$f":"IF(ISNUMBER(H14),$C$10/(I14)*H14/(J14),\"\")","v":240},null,{"$f":"IF(ISNUMBER(H14),\"0x\"&DEC2HEX(E14*2^27+J14*2^16+I14*2^12+H14,8),\"\")","v":"0x3802100C"},{"$f":"\"\"","v":""},null,{"$f":"IF(ISNUMBER(U14),1,\"\")","v":1},{"$f":"IF(ISNUMBER(B74),B74,\"\")","v":12},{"$f":"IF(ISNUMBER(C74),C74,\"\")","v":1},2,8,null,{"$f":"IF(ISNUMBER(U14),$C$10,\"\")","v":40},{"$f":"IF(ISNUMBER(U14),$C$10/(V14)*U14*2,\"\")","v":960},{"$f":"IF(ISNUMBER(U14),$C$10/(V14)*U14/(W14),\"\")","v":240},null,{"$f":"IF(ISNUMBER(U14),\"0x\"&DEC2HEX(X14*2^27+W14*2^16+V14*2^12+U14,8),\"\")","v":"0x4002100C"},{"$f":"\"\"","v":""}]
[2,24,2,2,{"$f":"ROUNDUP(N15/$N$4,0)","v":7},null,{"$f":"IF(ISNUMBER(H15),G14+1,\"\")","v":2},24,2,2,{"$f":"IF(ISNUMBER(E15),E15,\"\")","v":7},null,{"$f":"IF(ISNUMBER(H15),$C$10,\"\")","v":40},{"$f":"IF(ISNUMBER(H15),$C$10/(I15)*H15*2,\"\")","v":960},{"$f":"IF(ISNUMBER(H15),$C$10/(I15)*H15/(J15),\"\")","v":240},null,{"$f":"IF(ISNUMBER(H15),\"0x\"&DEC2HEX(E15*2^27+J15*2^16+I15*2^12+H15,8),\"\")","v":"0x38022018"},{"$f":"\"\"","v":""},null,{"$f":"IF(ISNUMBER(U15),T14+1,\"\")","v":2},{"$f":"IF(ISNUMBER(B75),B75,\"\")","v":24},{"$f":"IF(ISNUMBER(C75),C75,\"\")","v":2},{"$f":"IF(ISNUMBER(D75),D75,\"\")","v":2},{"$f":"IF(ISNUMBER(E75),E75,\"\")","v":8},null,40,960,240,null,{"$f":"IF(ISNUMBER(U15),\"0x\"&DEC2HEX(X15*2^27+W15*2^16+V15*2^12+U15,8),\"\")","v":"0x40022018"},{"$f":"\"\"","v":""}]
[3,36,3,2,7,null,{"$f":"IF(ISNUMBER(H16),G15+1,\"\")","v":3},{"$f":"IF(ISNUMBER(B16),B16,\"\")","v":36},{"$f":"IF(ISNUMBER(C16),C16,\"\")","v":3},{"$f":"IF(ISNUMBER(D16),D16,\"\")","v":2},{"$f":"IF(ISNUMBER(E16),E16,\"\")","v":7},null,{"$f":"IF(ISNUMBER(H16),$C$10,\"\")","v":40},{"$f":"IF(ISNUMBER(H16),$C$10/(I16)*H16*2,\"\")","v":960},{"$f":"IF(ISNUMBER(H16),$C$10/(I16)*H16/(J16),\"\")","v":240},null,{"$f":"IF(ISNUMBER(H16),\"0x\"&DEC2HEX(E16*2^27+J16*2^16+I16*2^12+H16,8),\"\")","v":"0x38023024"},{"$f":"\"\"","v":""},null,{"$f":"IF(ISNUMBER(U16),T15+1,\"\")","v":3},36,3,2,8,null,40,960,240,null,"0x40023024",{"$f":"\"\"","v":""}]
[4,48,4,2,7,null,4,48,4,2,7,null,40,960,240,null,"0x38024030",{"$f":"\"\"","v":""},null,4,48,4,2,8,null,40,960,240,null,"0x40024030",{"$f":"\"\"","v":""}]
[5,60,5,2,7,null,5,60,5,2,7,null,40,960,240,null,"0x3802503C",{"$f":"\"\"","v":""},null,5,60,5,2,8,null,40,960,240,null,"0x4002503C",{"$f":"\"\"","v":""}]
[6,72,6,2,7,null,6,72,6,2,7,null,40,960,240,null,"0x38026048",{"$f":"\"\"","v":""},null,6,72,6,2,8,null,40,960,240,null,"0x40026048",{"$f":"\"\"","v":""}]
[7,84,7,2,7,null,7,84,7,2,7,null,40,960,240,null,"0x38027054",{"$f":"\"\"","v":""},null,7,84,7,2,8,null,40,960,240,null,"0x40027054",{"$f":"\"\"","v":""}]
{"$rows_left_out":82}